#104115 Report by node travis-ci covering 2114 tests from 56 modules resulted into 6 errors

Report

ObsPy Version
1.1.1.post0+696.g6e6d1b5f44...
Continuous Integration
https://travis-ci.org/obspy/obspy/jobs/541621557
GitHub Pull Request
-
Report File
XML Document
Total Runtime
698.8 sec
Report Date/Time
2019-06-05 03:53:20

System / Python

Architecture
64bit
Machine
x86_64
Node
travis-ci
Processor
x86_64
Python Compiler
GCC 4.4.7 20120313 (Red Hat 4.4.7-1)
Python Implementation
CPython
Python Version
3.4.5
Release
4.15.0-1028-gcp
System
Linux
Version
#29~16.04.1-Ubuntu SMP Tue Feb 12 16:31:10 UTC 2019

Dependencies

cartopy
---
decorator
4.4.0
flake8
---
future
0.16.0
geographiclib
1.49
lxml.etree
3.7.2
m2crypto
---
matplotlib
2.0.0
mock
2.0.0
mpl_toolkits.basemap
1.0.7
numpy
1.11.3
pep8-naming
---
pyflakes
---
pyimgur
0.5.2
pyproj
1.9.5.1
requests
2.21.0
scipy
0.18.1
setuptools
27.2.0
shapefile
2.1.0
sqlalchemy
1.1.5

Modules (56)

Module Errors /
Failures
Tracebacks
obspy.clients.arclink 3 1 2 3
obspy.clients.earthworm - -
obspy.clients.fdsn 3 4 5 6
obspy.clients.filesystem - -
obspy.clients.iris - -
obspy.clients.neic - -
obspy.clients.nrl - -
obspy.clients.seedlink - -
obspy.clients.seishub - -
obspy.clients.syngine - -
obspy.core - -
obspy.db - -
obspy.geodetics - -
obspy.imaging - -
obspy.io.ah - -
obspy.io.arclink - -
obspy.io.ascii - -
obspy.io.cmtsolution - -
obspy.io.cnv - -
obspy.io.css - -
obspy.io.focmec - -
obspy.io.gcf - -
obspy.io.gse2 - -
obspy.io.iaspei - -
obspy.io.json - -
obspy.io.kinemetrics - -
obspy.io.kml - -
obspy.io.mseed - -
obspy.io.ndk - -
obspy.io.nied - -
obspy.io.nlloc - -
obspy.io.nordic - -
obspy.io.pdas - -
obspy.io.pde - -
obspy.io.quakeml - -
obspy.io.reftek - -
obspy.io.rg16 - -
obspy.io.sac - -
obspy.io.scardec - -
obspy.io.seg2 - -
obspy.io.segy - -
obspy.io.seisan - -
obspy.io.seiscomp - -
obspy.io.sh - -
obspy.io.shapefile - -
obspy.io.stationtxt - -
obspy.io.stationxml - -
obspy.io.wav - -
obspy.io.win - -
obspy.io.xseed - -
obspy.io.y - -
obspy.io.zmap - -
obspy.realtime - -
obspy.scripts - -
obspy.signal - -
obspy.taup - -
Summary 6 6

Tracebacks (6)

Traceback (most recent call last):
File "/home/travis/miniconda/envs/test-environment/lib/python3.4/site-packages/obspy/clients/arclink/tests/test_client.py", line 428, in test_get_stations
self.assertTrue(expected in result)
AssertionError: False is not true
Traceback (most recent call last):
File "/home/travis/miniconda/envs/test-environment/lib/python3.4/site-packages/obspy/clients/arclink/tests/test_client.py", line 274, in test_get_waveform_with_metadata
metadata=True)
File "/home/travis/miniconda/envs/test-environment/lib/python3.4/site-packages/obspy/clients/arclink/client.py", line 458, in get_waveforms
instruments=True, route=route)
File "/home/travis/miniconda/envs/test-environment/lib/python3.4/site-packages/obspy/clients/arclink/client.py", line 1123, in get_inventory
result = self._fetch(rtype, rdata, route=route)
File "/home/travis/miniconda/envs/test-environment/lib/python3.4/site-packages/obspy/clients/arclink/client.py", line 225, in _fetch
endtime=request_data[1])
File "/home/travis/miniconda/envs/test-environment/lib/python3.4/site-packages/obspy/clients/arclink/client.py", line 622, in get_routing
result = self._fetch(rtype, rdata, route=False)
File "/home/travis/miniconda/envs/test-environment/lib/python3.4/site-packages/obspy/clients/arclink/client.py", line 219, in _fetch
return self._request(request_type, request_data)
File "/home/travis/miniconda/envs/test-environment/lib/python3.4/site-packages/obspy/clients/arclink/client.py", line 324, in _request
raise ArcLinkException("%s %s" % (err_code, msg))
obspy.clients.arclink.client.ArcLinkException: b'UNSET'
Traceback (most recent call last):
File "/home/travis/miniconda/envs/test-environment/lib/python3.4/site-packages/obspy/clients/arclink/tests/test_client.py", line 122, in test_get_routing
results = client.get_routing('BW', 'RJOB', dt, dt + 1)
File "/home/travis/miniconda/envs/test-environment/lib/python3.4/site-packages/obspy/clients/arclink/client.py", line 622, in get_routing
result = self._fetch(rtype, rdata, route=False)
File "/home/travis/miniconda/envs/test-environment/lib/python3.4/site-packages/obspy/clients/arclink/client.py", line 219, in _fetch
return self._request(request_type, request_data)
File "/home/travis/miniconda/envs/test-environment/lib/python3.4/site-packages/obspy/clients/arclink/client.py", line 324, in _request
raise ArcLinkException("%s %s" % (err_code, msg))
obspy.clients.arclink.client.ArcLinkException: b'UNSET'
Traceback (most recent call last):
File "/home/travis/miniconda/envs/test-environment/lib/python3.4/site-packages/obspy/clients/fdsn/tests/test_federator_routing_client.py", line 342, in test_get_stations_integration_test
channel="LHZ", level="station")
File "</home/travis/miniconda/envs/test-environment/lib/python3.4/site-packages/decorator.py:decorator-gen-67>", line 2, in get_stations
File "/home/travis/miniconda/envs/test-environment/lib/python3.4/site-packages/obspy/clients/fdsn/routing/routing_client.py", line 82, in _assert_filename_not_in_kwargs
return f(*args, **kwargs)
File "/home/travis/miniconda/envs/test-environment/lib/python3.4/site-packages/obspy/clients/fdsn/routing/federator_routing_client.py", line 110, in get_stations
return super(FederatorRoutingClient, self).get_stations(**kwargs)
File "</home/travis/miniconda/envs/test-environment/lib/python3.4/site-packages/decorator.py:decorator-gen-64>", line 2, in get_stations
File "/home/travis/miniconda/envs/test-environment/lib/python3.4/site-packages/obspy/clients/fdsn/routing/routing_client.py", line 82, in _assert_filename_not_in_kwargs
return f(*args, **kwargs)
File "/home/travis/miniconda/envs/test-environment/lib/python3.4/site-packages/obspy/clients/fdsn/routing/routing_client.py", line 371, in get_stations
return self.get_stations_bulk([bulk], **kwargs)
File "</home/travis/miniconda/envs/test-environment/lib/python3.4/site-packages/decorator.py:decorator-gen-68>", line 2, in get_stations_bulk
File "/home/travis/miniconda/envs/test-environment/lib/python3.4/site-packages/obspy/clients/fdsn/routing/routing_client.py", line 82, in _assert_filename_not_in_kwargs
return f(*args, **kwargs)
File "/home/travis/miniconda/envs/test-environment/lib/python3.4/site-packages/obspy/clients/fdsn/routing/federator_routing_client.py", line 143, in get_stations_bulk
r = self._download(self._url + "/query", data=bulk_str)
File "/home/travis/miniconda/envs/test-environment/lib/python3.4/site-packages/obspy/clients/base.py", line 245, in _download
self._handle_requests_http_error(r)
File "/home/travis/miniconda/envs/test-environment/lib/python3.4/site-packages/obspy/clients/fdsn/routing/routing_client.py", line 307, in _handle_requests_http_error
raise_on_error(r.status_code, buf)
File "/home/travis/miniconda/envs/test-environment/lib/python3.4/site-packages/obspy/clients/fdsn/client.py", line 1753, in raise_on_error
raise FDSNException("Unknown HTTP code: %i" % code, server_info)
obspy.clients.fdsn.header.FDSNException: Unknown HTTP code: 404
Detailed response of server:
-- Error 404: No data matched request.
Request:
http://service.iris.edu/irisws/fedcatalog/1/query
Request Submitted:
2019/06/05 08:47:05 UTC
Service version:
Service: irisws-fedcatalog version: 1.1.11
Traceback (most recent call last):
File "/home/travis/miniconda/envs/test-environment/lib/python3.4/site-packages/obspy/clients/fdsn/tests/test_client.py", line 1378, in test_redirection_auth
endtime=UTCDateTime("2010-02-27T06:30:01.000"))
File "/home/travis/miniconda/envs/test-environment/lib/python3.4/site-packages/obspy/clients/fdsn/client.py", line 844, in get_waveforms
data_stream = self._download(url, use_gzip=False)
File "/home/travis/miniconda/envs/test-environment/lib/python3.4/site-packages/obspy/clients/fdsn/client.py", line 1397, in _download
raise_on_error(code, data)
File "/home/travis/miniconda/envs/test-environment/lib/python3.4/site-packages/obspy/clients/fdsn/client.py", line 1728, in raise_on_error
server_info)
obspy.clients.fdsn.header.FDSNException: Unauthorized, authentication required.
Traceback (most recent call last):
File "/home/travis/miniconda/envs/test-environment/lib/python3.4/site-packages/obspy/clients/fdsn/tests/test_client.py", line 904, in test_dataselect_bulk
got = client.get_waveforms_bulk(bulk, **params)
File "/home/travis/miniconda/envs/test-environment/lib/python3.4/site-packages/obspy/clients/fdsn/client.py", line 1024, in get_waveforms_bulk
data=bulk)
File "/home/travis/miniconda/envs/test-environment/lib/python3.4/site-packages/obspy/clients/fdsn/client.py", line 1397, in _download
raise_on_error(code, data)
File "/home/travis/miniconda/envs/test-environment/lib/python3.4/site-packages/obspy/clients/fdsn/client.py", line 1728, in raise_on_error
server_info)
obspy.clients.fdsn.header.FDSNException: Unauthorized, authentication required.

Skipped Tests (41)

Submodule Test Skip Message
clients.seishub test_get_channel_ids (obspy.clients.seishub.tests.test_client.ClientTestCase) Seishub test server not reachable.
clients.seishub test_get_coordinates (obspy.clients.seishub.tests.test_client.ClientTestCase) Seishub test server not reachable.
clients.seishub test_get_event_list (obspy.clients.seishub.tests.test_client.ClientTestCase) Seishub test server not reachable.
clients.seishub test_get_location_ids (obspy.clients.seishub.tests.test_client.ClientTestCase) Seishub test server not reachable.
clients.seishub test_get_network_ids (obspy.clients.seishub.tests.test_client.ClientTestCase) Seishub test server not reachable.
clients.seishub test_get_paz (obspy.clients.seishub.tests.test_client.ClientTestCase) Seishub test server not reachable.
clients.seishub test_get_preview (obspy.clients.seishub.tests.test_client.ClientTestCase) Seishub test server not reachable.
clients.seishub test_get_preview_by_ids (obspy.clients.seishub.tests.test_client.ClientTestCase) Seishub test server not reachable.
clients.seishub test_get_station_ids (obspy.clients.seishub.tests.test_client.ClientTestCase) Seishub test server not reachable.
clients.seishub test_get_waveform_with_metadata (obspy.clients.seishub.tests.test_client.ClientTestCase) Seishub test server not reachable.
clients.seishub test_get_waveforms (obspy.clients.seishub.tests.test_client.ClientTestCase) Seishub test server not reachable.
clients.seishub test_localcache (obspy.clients.seishub.tests.test_client.ClientTestCase) Seishub test server not reachable.
clients.seishub test_ping (obspy.clients.seishub.tests.test_client.ClientTestCase) Seishub test server not reachable.
geodetics test_gps_2_dist_azimuth_bug150 (obspy.geodetics.tests.test_util_geodetics.UtilGeodeticsTestCase) Module geographiclib is installed, not using calc_vincenty_inverse
imaging test_script_plot (obspy.imaging.tests.test_mopad_script.MopadTestCase) Currently broken until further review.
clients.seedlink test_info (obspy.clients.seedlink.tests.test_slclient.SLClientTestCase) test must be started manually
clients.seedlink test_issue708 (obspy.clients.seedlink.tests.test_slclient.SLClientTestCase) test must be started manually
clients.seedlink test_time_window (obspy.clients.seedlink.tests.test_slclient.SLClientTestCase) test must be started manually
clients.arclink test_m2crypto (obspy.clients.arclink.tests.test_decrypt.ClientTestCase) M2Crypto is not installed
clients.arclink test_pycrypto (obspy.clients.arclink.tests.test_decrypt.ClientTestCase) PyCrypto is not installed
core test_flake8 (obspy.core.tests.test_code_formatting.CodeFormattingTestCase) Formatting tests require at least flake8 3.0.
core test_location_plot_global (obspy.core.tests.test_network.NetworkCartopyTestCase) cartopy not installed
core test_location_plot_local (obspy.core.tests.test_network.NetworkCartopyTestCase) cartopy not installed
core test_location_plot_ortho (obspy.core.tests.test_network.NetworkCartopyTestCase) cartopy not installed
core test_combined_station_event_plot (obspy.core.tests.test_inventory.InventoryBasemapTestCase) matplotlib 3.0.1 is not compatible with basemap
core test_location_plot_global (obspy.core.tests.test_inventory.InventoryBasemapTestCase) matplotlib 3.0.1 is not compatible with basemap
core test_location_plot_local (obspy.core.tests.test_inventory.InventoryBasemapTestCase) matplotlib 3.0.1 is not compatible with basemap
core test_location_plot_ortho (obspy.core.tests.test_inventory.InventoryBasemapTestCase) matplotlib 3.0.1 is not compatible with basemap
core test_location_plot_global (obspy.core.tests.test_inventory.InventoryCartopyTestCase) cartopy not installed
core test_location_plot_local (obspy.core.tests.test_inventory.InventoryCartopyTestCase) cartopy not installed
core test_location_plot_ortho (obspy.core.tests.test_inventory.InventoryCartopyTestCase) cartopy not installed
core test_catalog_plot_global (obspy.core.tests.test_event.CatalogBasemapTestCase) matplotlib 3.0.1 is not campatible with basemap
core test_catalog_plot_local (obspy.core.tests.test_event.CatalogBasemapTestCase) matplotlib 3.0.1 is not campatible with basemap
core test_catalog_plot_ortho (obspy.core.tests.test_event.CatalogBasemapTestCase) matplotlib 3.0.1 is not campatible with basemap
core test_catalog_plot_ortho_longitude_wrap (obspy.core.tests.test_event.CatalogBasemapTestCase) matplotlib 3.0.1 is not campatible with basemap
core test_plot_catalog_before_1900 (obspy.core.tests.test_event.CatalogBasemapTestCase) matplotlib 3.0.1 is not campatible with basemap
core test_catalog_plot_global (obspy.core.tests.test_event.CatalogCartopyTestCase) Cartopy not installed or too old
core test_catalog_plot_local (obspy.core.tests.test_event.CatalogCartopyTestCase) Cartopy not installed or too old
core test_catalog_plot_ortho (obspy.core.tests.test_event.CatalogCartopyTestCase) Cartopy not installed or too old
core test_catalog_plot_ortho_longitude_wrap (obspy.core.tests.test_event.CatalogCartopyTestCase) Cartopy not installed or too old
core test_plot_farfield_without_quiver_with_maps (obspy.core.tests.test_event.EventTestCase) matplotlib 3.0.1 is not campatible with basemap

Slowest Tests (20)

Runtime Test
42.345s test_get_waveform_with_metadata (obspy.clients.arclink.tests.test_client.ClientTestCase)
39.246s test_get_routing (obspy.clients.arclink.tests.test_client.ClientTestCase)
20.493s test_get_waveform_instrument_change (obspy.clients.arclink.tests.test_client.ClientTestCase)
16.180s test_get_inventory (obspy.clients.arclink.tests.test_client.ClientTestCase)
15.568s test_get_networks (obspy.clients.arclink.tests.test_client.ClientTestCase)
14.428s test_response_calculation_from_seed_and_xseed (obspy.io.xseed.tests.test_core.CoreTestCase)
13.905s test_get_waveform_with_dcid_key_file (obspy.clients.arclink.tests.test_decrypt.ClientTestCase)
10.597s test_issue_311 (obspy.clients.arclink.tests.test_client.ClientTestCase)
10.544s test_save_waveform_no_compression (obspy.clients.arclink.tests.test_client.ClientTestCase)
9.340s test_delayed_request (obspy.clients.arclink.tests.test_client.ClientTestCase)
9.321s test_eida_token_resolution (obspy.clients.fdsn.tests.test_client.ClientTestCase)
9.100s test_ppsd_restricted_stacks (obspy.signal.tests.test_spectral_estimation.PsdTestCase)
8.833s test_get_inventory_twice (obspy.clients.arclink.tests.test_client.ClientTestCase)
8.805s test_get_inventory_stationgroup (obspy.clients.arclink.tests.test_client.ClientTestCase)
8.725s __init__ (obspy.clients.arclink)
8.472s test_save_waveform (obspy.clients.arclink.tests.test_client.ClientTestCase)
8.435s test_plot_multiple_traces (obspy.imaging.tests.test_waveform.WaveformTestCase)
7.865s __init__ (obspy.taup)
7.853s test_get_waveform (obspy.clients.arclink.tests.test_client.ClientTestCase)
7.490s test_cryptography (obspy.clients.arclink.tests.test_decrypt.ClientTestCase)

Chuck Norris Fact

Chuck Norris originally appeared in the "Street Fighter II" video game, but was removed by Beta Testers because every button caused him to do a roundhouse kick. When asked about this glitch, Norris replied "That's no glitch."