#111151 Report by node travis-ci covering 2100 tests from 49 modules resulted into 2 errors

Report

ObsPy version
1.2.1.post0+44.g774728b100
Continuous Integration
https://travis-ci.org/obspy/obspy/jobs/702326232
GitHub Pull Request
https://github.com/obspy/obspy/pull/2656
Report file
XML document
Total runtime
438.8 sec
Report date/time
2020-06-26 05:41:55

System / Python

Architecture
64bit
Machine
x86_64
Node
travis-ci
Processor
i386
Python Compiler
GCC Clang 9.0.1
Python Implementation
CPython
Python Version
3.6.10
Release
17.7.0
System
Darwin
Version
Darwin Kernel Version 17.7.0: Thu Jun 21 22:53:14 PDT 2018; root:xnu-4570.71.2~1/RELEASE_X86_64

Dependencies

cartopy
---
decorator
4.4.2
flake8
---
future
0.18.2
geographiclib
1.50
lxml.etree
4.5.1
m2crypto
---
matplotlib
2.0.2
mock
4.0.2
mpl_toolkits.basemap
1.0.7
numpy
1.13.3
pep8-naming
---
pyflakes
---
pyimgur
0.5.2
pyproj
1.9.5.1
requests
2.24.0
scipy
1.2.1
setuptools
47.3.1.post20200616
shapefile
2.1.0
sqlalchemy
1.3.18

Modules (49)

Module Errors / Failures Tracebacks
obspy.clients.arclink Not tested -
obspy.clients.earthworm Not tested -
obspy.clients.fdsn 2 1 2
obspy.clients.filesystem - -
obspy.clients.iris Not tested -
obspy.clients.neic Not tested -
obspy.clients.nrl Not tested -
obspy.clients.seedlink Not tested -
obspy.clients.seishub Not tested -
obspy.clients.syngine Not tested -
obspy.core - -
obspy.db - -
obspy.geodetics - -
obspy.imaging - -
obspy.io.ah - -
obspy.io.arclink - -
obspy.io.ascii - -
obspy.io.cmtsolution - -
obspy.io.cnv - -
obspy.io.css - -
obspy.io.dmx - -
obspy.io.focmec - -
obspy.io.gcf - -
obspy.io.gse2 - -
obspy.io.iaspei - -
obspy.io.json - -
obspy.io.kinemetrics - -
obspy.io.kml - -
obspy.io.mseed - -
obspy.io.ndk - -
obspy.io.nied - -
obspy.io.nlloc - -
obspy.io.nordic - -
obspy.io.pdas - -
obspy.io.pde - -
obspy.io.quakeml - -
obspy.io.reftek - -
obspy.io.rg16 - -
obspy.io.sac - -
obspy.io.scardec - -
obspy.io.seg2 - -
obspy.io.segy - -
obspy.io.seisan - -
obspy.io.seiscomp - -
obspy.io.sh - -
obspy.io.shapefile - -
obspy.io.stationtxt - -
obspy.io.stationxml - -
obspy.io.wav - -
obspy.io.win - -
obspy.io.xseed - -
obspy.io.y - -
obspy.io.zmap - -
obspy.realtime - -
obspy.scripts - -
obspy.signal - -
obspy.taup - -
Summary 2 2

Tracebacks (2)

Traceback (most recent call last):
File "/Users/travis/miniconda/envs/test-environment/lib/python3.6/site-packages/obspy/clients/fdsn/tests/test_client.py", line 1511, in test_eida_token_resolution
user, password = client._resolve_eida_token(token=token)
File "/Users/travis/miniconda/envs/test-environment/lib/python3.6/site-packages/obspy/clients/fdsn/client.py", line 387, in _resolve_eida_token
use_gzip=True, return_string=True)
File "/Users/travis/miniconda/envs/test-environment/lib/python3.6/site-packages/obspy/clients/fdsn/client.py", line 1397, in _download
raise_on_error(code, data)
File "/Users/travis/miniconda/envs/test-environment/lib/python3.6/site-packages/obspy/clients/fdsn/client.py", line 1727, in raise_on_error
raise FDSNException(msg, server_info)
obspy.clients.fdsn.header.FDSNException: Bad request. If you think your request was valid please contact the developers.
Detailed response of server:
Error 400: Bad Request
token is expired
Usage details are available from /fdsnws/dataselect/1/
Request:
/fdsnws/dataselect/1/auth
Request Submitted:
2020-06-26T10:34:42.875451
Service Version:
1.1.0
Traceback (most recent call last):
File "/Users/travis/miniconda/envs/test-environment/lib/python3.6/doctest.py", line 2199, in runTest
raise self.failureException(self.format_failure(new.getvalue()))
AssertionError: Failed doctest test for obspy.clients.fdsn.client.Client.get_stations_bulk
File "/Users/travis/miniconda/envs/test-environment/lib/python3.6/site-packages/obspy/clients/fdsn/client.py", line 1038, in get_stations_bulk
----------------------------------------------------------------------
File "/Users/travis/miniconda/envs/test-environment/lib/python3.6/site-packages/obspy/clients/fdsn/client.py", line 1070, in obspy.clients.fdsn.client.Client.get_stations_bulk
Failed example:
print(inv) # doctest: +ELLIPSIS +NORMALIZE_WHITESPACE
Expected:
Inventory created at ...
Created by: IRIS WEB SERVICE: fdsnws-station | version: ...
...
Sending institution: IRIS-DMC (IRIS-DMC)
Contains:
Networks (2):
GR, IU
Stations (2):
GR.GRA1 (GRAFENBERG ARRAY, BAYERN)
IU.ANMO (Albuquerque, New Mexico, USA)
Channels (0):
Got:
Inventory created at 2020-06-26T10:34:27.000000Z
	Created by: IRIS WEB SERVICE: fdsnws-station | version: 1.1.45
		
	Sending institution: IRIS-DMC (IRIS-DMC)
	Contains:
		Networks (2):
			GR, IU
		Stations (2):
			GR.GRA1 (GRAFENBERG ARRAY, BAYERN)
			IU.ANMO (Albuquerque, New Mexico, USA)
		Channels (0):
<BLANKLINE>
----------------------------------------------------------------------
File "/Users/travis/miniconda/envs/test-environment/lib/python3.6/site-packages/obspy/clients/fdsn/client.py", line 1100, in obspy.clients.fdsn.client.Client.get_stations_bulk
Failed example:
print(inv) # doctest: +ELLIPSIS +NORMALIZE_WHITESPACE
Expected:
Inventory created at ...
Created by: IRIS WEB SERVICE: fdsnws-station | version: ...
...
Sending institution: IRIS-DMC (IRIS-DMC)
Contains:
Networks (2):
GR, IU
Stations (2):
GR.GRA1 (GRAFENBERG ARRAY, BAYERN)
IU.ANMO (Albuquerque, New Mexico, USA)
Channels (5):
GR.GRA1..BHZ, GR.GRA1..BHN, GR.GRA1..BHE, IU.ANMO.00.BHZ,
IU.ANMO.10.BHZ
Got:
Inventory created at 2020-06-26T10:34:27.000000Z
	Created by: IRIS WEB SERVICE: fdsnws-station | version: 1.1.45
		
	Sending institution: IRIS-DMC (IRIS-DMC)
	Contains:
		Networks (2):
			GR, IU
		Stations (2):
			GR.GRA1 (GRAFENBERG ARRAY, BAYERN)
			IU.ANMO (Albuquerque, New Mexico, USA)
		Channels (5):
			GR.GRA1..BHZ, GR.GRA1..BHN, GR.GRA1..BHE, IU.ANMO.00.BHZ,
			IU.ANMO.10.BHZ

Skipped tests (23)

Submodule Test Skip message
core test_flake8 (obspy.core.tests.test_code_formatting.CodeFormattingTestCase) Formatting tests require at least flake8 3.0.
core test_catalog_plot_global (obspy.core.tests.test_event.CatalogBasemapTestCase) matplotlib 3.0.1 is not compatible with basemap
core test_catalog_plot_local (obspy.core.tests.test_event.CatalogBasemapTestCase) matplotlib 3.0.1 is not compatible with basemap
core test_catalog_plot_ortho (obspy.core.tests.test_event.CatalogBasemapTestCase) matplotlib 3.0.1 is not compatible with basemap
core test_catalog_plot_ortho_longitude_wrap (obspy.core.tests.test_event.CatalogBasemapTestCase) matplotlib 3.0.1 is not compatible with basemap
core test_plot_catalog_before_1900 (obspy.core.tests.test_event.CatalogBasemapTestCase) matplotlib 3.0.1 is not compatible with basemap
core test_catalog_plot_global (obspy.core.tests.test_event.CatalogCartopyTestCase) Cartopy not installed or too old
core test_catalog_plot_local (obspy.core.tests.test_event.CatalogCartopyTestCase) Cartopy not installed or too old
core test_catalog_plot_ortho (obspy.core.tests.test_event.CatalogCartopyTestCase) Cartopy not installed or too old
core test_catalog_plot_ortho_longitude_wrap (obspy.core.tests.test_event.CatalogCartopyTestCase) Cartopy not installed or too old
core test_plot_farfield_without_quiver_with_maps (obspy.core.tests.test_event.EventTestCase) matplotlib 3.0.1 is not compatible with basemap
core test_combined_station_event_plot (obspy.core.tests.test_inventory.InventoryBasemapTestCase) matplotlib 3.0.1 is not compatible with basemap
core test_location_plot_global (obspy.core.tests.test_inventory.InventoryBasemapTestCase) matplotlib 3.0.1 is not compatible with basemap
core test_location_plot_local (obspy.core.tests.test_inventory.InventoryBasemapTestCase) matplotlib 3.0.1 is not compatible with basemap
core test_location_plot_ortho (obspy.core.tests.test_inventory.InventoryBasemapTestCase) matplotlib 3.0.1 is not compatible with basemap
core test_location_plot_global (obspy.core.tests.test_inventory.InventoryCartopyTestCase) cartopy not installed
core test_location_plot_local (obspy.core.tests.test_inventory.InventoryCartopyTestCase) cartopy not installed
core test_location_plot_ortho (obspy.core.tests.test_inventory.InventoryCartopyTestCase) cartopy not installed
core test_location_plot_global (obspy.core.tests.test_network.NetworkCartopyTestCase) cartopy not installed
core test_location_plot_local (obspy.core.tests.test_network.NetworkCartopyTestCase) cartopy not installed
core test_location_plot_ortho (obspy.core.tests.test_network.NetworkCartopyTestCase) cartopy not installed
geodetics test_gps_2_dist_azimuth_bug150 (obspy.geodetics.tests.test_util_geodetics.UtilGeodeticsTestCase) Module geographiclib is installed, not using calc_vincenty_inverse
imaging test_script_plot (obspy.imaging.tests.test_mopad_script.MopadTestCase) Currently broken until further review.

Slowest tests (20)

Runtime Test
16.475s test_response_calculation_from_seed_and_xseed (obspy.io.xseed.tests.test_core.CoreTestCase)
13.127s __init__ (obspy.taup)
10.464s test_plot_multiple_traces (obspy.imaging.tests.test_waveform.WaveformTestCase)
10.310s test_ppsd_restricted_stacks (obspy.signal.tests.test_spectral_estimation.PsdTestCase)
9.671s test_location_plot_global (obspy.core.tests.test_network.NetworkBasemapTestCase)
9.067s test_shoot_existing_ray_param (obspy.taup.tests.test_seismic_phase.TauPySeismicPhaseTestCase)
7.161s test_dataselect_bulk (obspy.clients.fdsn.tests.test_client.ClientTestCase)
6.936s test_get_stations_integration_test (obspy.clients.fdsn.tests.test_eidaws_routing_client.EIDAWSRoutingClientTestCase)
5.997s test_correlate_stream_template_and_correlation_detector (obspy.signal.tests.test_cross_correlation.CrossCorrelationTestCase)
5.922s test_relcal_different_overlaps (obspy.signal.tests.test_calibration.CalibrationTestCase)
5.833s plot_travel_times (obspy.taup.tau)
5.596s test_remove_response_plot (obspy.core.tests.test_trace.TraceTestCase)
5.361s test_regional_models (obspy.taup.tests.test_tau.TauPyModelTestCase)
5.132s test_polarization_vidale (obspy.signal.tests.test_polarization.PolarizationTestCase)
4.857s test_vs_java_iasp91 (obspy.taup.tests.test_tau.TauPyModelTestCase)
4.141s test_many_identically_named_phases (obspy.taup.tests.test_seismic_phase.TauPySeismicPhaseTestCase)
4.075s test_plot_wiggles_vertical_section (obspy.imaging.tests.test_waveform.WaveformTestCase)
4.066s test_auto_read_arclink_xml (obspy.io.arclink.tests.test_inventory_xml.ArclinkInventoryTestCase)
4.035s test_plot_wiggles_horizontal_section (obspy.imaging.tests.test_waveform.WaveformTestCase)
3.893s test_iris_example_queries_dataselect (obspy.clients.fdsn.tests.test_client.ClientTestCase)

Chuck Norris fact

Chuck Norris's keyboard doesn't have a Ctrl key because nothing controls Chuck Norris.