#111288 Report by node travis-ci covering 2107 tests from 50 modules resulted into 3 errors

Report

ObsPy version
1.2.2rc3.post0+2.g7d90dc5f58
Continuous Integration
https://travis-ci.org/obspy/obspy/jobs/703173048
GitHub Pull Request
https://github.com/obspy/obspy/pull/2659
Report file
XML document
Total runtime
325.3 sec
Report date/time
2020-06-29 09:29:02

System / Python

Architecture
64bit
Machine
x86_64
Node
travis-ci
Processor
x86_64
Python Compiler
GCC 4.4.7 20120313 (Red Hat 4.4.7-1)
Python Implementation
CPython
Python Version
3.6.2
Release
4.15.0-1028-gcp
System
Linux
Version
#29~16.04.1-Ubuntu SMP Tue Feb 12 16:31:10 UTC 2019

Dependencies

cartopy
---
decorator
4.4.2
flake8
---
future
0.18.2
geographiclib
1.50
lxml.etree
3.8.0
m2crypto
---
matplotlib
2.0.2
mock
4.0.2
mpl_toolkits.basemap
1.0.7
numpy
1.13.3
pep8-naming
---
pyflakes
---
pyimgur
0.5.2
pyproj
1.9.5.1
requests
2.24.0
scipy
1.2.1
setuptools
47.3.1.post20200616
shapefile
2.1.0
sqlalchemy
1.3.18

Modules (50)

Module Errors / Failures Tracebacks
obspy.clients.arclink Not tested -
obspy.clients.earthworm Not tested -
obspy.clients.fdsn 3 1 2 3
obspy.clients.filesystem - -
obspy.clients.iris Not tested -
obspy.clients.neic Not tested -
obspy.clients.nrl Not tested -
obspy.clients.seedlink Not tested -
obspy.clients.seishub Not tested -
obspy.clients.syngine Not tested -
obspy.core - -
obspy.db - -
obspy.geodetics - -
obspy.imaging - -
obspy.io.ah - -
obspy.io.arclink - -
obspy.io.ascii - -
obspy.io.cmtsolution - -
obspy.io.cnv - -
obspy.io.css - -
obspy.io.dmx - -
obspy.io.focmec - -
obspy.io.gcf - -
obspy.io.gse2 - -
obspy.io.hypodd - -
obspy.io.iaspei - -
obspy.io.json - -
obspy.io.kinemetrics - -
obspy.io.kml - -
obspy.io.mseed - -
obspy.io.ndk - -
obspy.io.nied - -
obspy.io.nlloc - -
obspy.io.nordic - -
obspy.io.pdas - -
obspy.io.pde - -
obspy.io.quakeml - -
obspy.io.reftek - -
obspy.io.rg16 - -
obspy.io.sac - -
obspy.io.scardec - -
obspy.io.seg2 - -
obspy.io.segy - -
obspy.io.seisan - -
obspy.io.seiscomp - -
obspy.io.sh - -
obspy.io.shapefile - -
obspy.io.stationtxt - -
obspy.io.stationxml - -
obspy.io.wav - -
obspy.io.win - -
obspy.io.xseed - -
obspy.io.y - -
obspy.io.zmap - -
obspy.realtime - -
obspy.scripts - -
obspy.signal - -
obspy.taup - -
Summary 3 3

Tracebacks (3)

Traceback (most recent call last):
File "/home/travis/miniconda/envs/test-environment/lib/python3.6/site-packages/obspy/clients/fdsn/tests/test_client.py", line 917, in test_dataselect_bulk
got = client.get_waveforms_bulk(bulk, **params)
File "/home/travis/miniconda/envs/test-environment/lib/python3.6/site-packages/obspy/clients/fdsn/client.py", line 1024, in get_waveforms_bulk
data=bulk)
File "/home/travis/miniconda/envs/test-environment/lib/python3.6/site-packages/obspy/clients/fdsn/client.py", line 1397, in _download
raise_on_error(code, data)
File "/home/travis/miniconda/envs/test-environment/lib/python3.6/site-packages/obspy/clients/fdsn/client.py", line 1730, in raise_on_error
server_info)
obspy.clients.fdsn.header.FDSNException: Unauthorized, authentication required.
Traceback (most recent call last):
File "/home/travis/miniconda/envs/test-environment/lib/python3.6/site-packages/obspy/clients/fdsn/tests/test_client.py", line 1511, in test_eida_token_resolution
user, password = client._resolve_eida_token(token=token)
File "/home/travis/miniconda/envs/test-environment/lib/python3.6/site-packages/obspy/clients/fdsn/client.py", line 387, in _resolve_eida_token
use_gzip=True, return_string=True)
File "/home/travis/miniconda/envs/test-environment/lib/python3.6/site-packages/obspy/clients/fdsn/client.py", line 1397, in _download
raise_on_error(code, data)
File "/home/travis/miniconda/envs/test-environment/lib/python3.6/site-packages/obspy/clients/fdsn/client.py", line 1727, in raise_on_error
raise FDSNException(msg, server_info)
obspy.clients.fdsn.header.FDSNException: Bad request. If you think your request was valid please contact the developers.
Detailed response of server:
Error 400: Bad Request
token is expired
Usage details are available from /fdsnws/dataselect/1/
Request:
/fdsnws/dataselect/1/auth
Request Submitted:
2020-06-29T14:24:13.7157
Service Version:
1.1.0
Traceback (most recent call last):
File "/home/travis/miniconda/envs/test-environment/lib/python3.6/doctest.py", line 2199, in runTest
raise self.failureException(self.format_failure(new.getvalue()))
AssertionError: Failed doctest test for obspy.clients.fdsn.client.Client.get_stations_bulk
File "/home/travis/miniconda/envs/test-environment/lib/python3.6/site-packages/obspy/clients/fdsn/client.py", line 1038, in get_stations_bulk
----------------------------------------------------------------------
File "/home/travis/miniconda/envs/test-environment/lib/python3.6/site-packages/obspy/clients/fdsn/client.py", line 1070, in obspy.clients.fdsn.client.Client.get_stations_bulk
Failed example:
print(inv) # doctest: +ELLIPSIS +NORMALIZE_WHITESPACE
Expected:
Inventory created at ...
Created by: IRIS WEB SERVICE: fdsnws-station | version: ...
...
Sending institution: IRIS-DMC (IRIS-DMC)
Contains:
Networks (2):
GR, IU
Stations (2):
GR.GRA1 (GRAFENBERG ARRAY, BAYERN)
IU.ANMO (Albuquerque, New Mexico, USA)
Channels (0):
Got:
Inventory created at 2020-06-29T14:23:29.000000Z
	Created by: IRIS WEB SERVICE: fdsnws-station | version: 1.1.45
		
	Sending institution: IRIS-DMC (IRIS-DMC)
	Contains:
		Networks (2):
			GR, IU
		Stations (2):
			GR.GRA1 (GRAFENBERG ARRAY, BAYERN)
			IU.ANMO (Albuquerque, New Mexico, USA)
		Channels (0):
<BLANKLINE>
----------------------------------------------------------------------
File "/home/travis/miniconda/envs/test-environment/lib/python3.6/site-packages/obspy/clients/fdsn/client.py", line 1100, in obspy.clients.fdsn.client.Client.get_stations_bulk
Failed example:
print(inv) # doctest: +ELLIPSIS +NORMALIZE_WHITESPACE
Expected:
Inventory created at ...
Created by: IRIS WEB SERVICE: fdsnws-station | version: ...
...
Sending institution: IRIS-DMC (IRIS-DMC)
Contains:
Networks (2):
GR, IU
Stations (2):
GR.GRA1 (GRAFENBERG ARRAY, BAYERN)
IU.ANMO (Albuquerque, New Mexico, USA)
Channels (5):
GR.GRA1..BHZ, GR.GRA1..BHN, GR.GRA1..BHE, IU.ANMO.00.BHZ,
IU.ANMO.10.BHZ
Got:
Inventory created at 2020-06-29T14:23:30.000000Z
	Created by: IRIS WEB SERVICE: fdsnws-station | version: 1.1.45
		
	Sending institution: IRIS-DMC (IRIS-DMC)
	Contains:
		Networks (2):
			GR, IU
		Stations (2):
			GR.GRA1 (GRAFENBERG ARRAY, BAYERN)
			IU.ANMO (Albuquerque, New Mexico, USA)
		Channels (5):
			GR.GRA1..BHZ, GR.GRA1..BHN, GR.GRA1..BHE, IU.ANMO.00.BHZ,
			IU.ANMO.10.BHZ

Skipped tests (23)

Submodule Test Skip message
core test_flake8 (obspy.core.tests.test_code_formatting.CodeFormattingTestCase) Formatting tests require at least flake8 3.0.
core test_location_plot_global (obspy.core.tests.test_network.NetworkCartopyTestCase) cartopy not installed
core test_location_plot_local (obspy.core.tests.test_network.NetworkCartopyTestCase) cartopy not installed
core test_location_plot_ortho (obspy.core.tests.test_network.NetworkCartopyTestCase) cartopy not installed
core test_combined_station_event_plot (obspy.core.tests.test_inventory.InventoryBasemapTestCase) matplotlib 3.0.1 is not compatible with basemap
core test_location_plot_global (obspy.core.tests.test_inventory.InventoryBasemapTestCase) matplotlib 3.0.1 is not compatible with basemap
core test_location_plot_local (obspy.core.tests.test_inventory.InventoryBasemapTestCase) matplotlib 3.0.1 is not compatible with basemap
core test_location_plot_ortho (obspy.core.tests.test_inventory.InventoryBasemapTestCase) matplotlib 3.0.1 is not compatible with basemap
core test_location_plot_global (obspy.core.tests.test_inventory.InventoryCartopyTestCase) cartopy not installed
core test_location_plot_local (obspy.core.tests.test_inventory.InventoryCartopyTestCase) cartopy not installed
core test_location_plot_ortho (obspy.core.tests.test_inventory.InventoryCartopyTestCase) cartopy not installed
core test_catalog_plot_global (obspy.core.tests.test_event.CatalogBasemapTestCase) matplotlib 3.0.1 is not compatible with basemap
core test_catalog_plot_local (obspy.core.tests.test_event.CatalogBasemapTestCase) matplotlib 3.0.1 is not compatible with basemap
core test_catalog_plot_ortho (obspy.core.tests.test_event.CatalogBasemapTestCase) matplotlib 3.0.1 is not compatible with basemap
core test_catalog_plot_ortho_longitude_wrap (obspy.core.tests.test_event.CatalogBasemapTestCase) matplotlib 3.0.1 is not compatible with basemap
core test_plot_catalog_before_1900 (obspy.core.tests.test_event.CatalogBasemapTestCase) matplotlib 3.0.1 is not compatible with basemap
core test_catalog_plot_global (obspy.core.tests.test_event.CatalogCartopyTestCase) Cartopy not installed or too old
core test_catalog_plot_local (obspy.core.tests.test_event.CatalogCartopyTestCase) Cartopy not installed or too old
core test_catalog_plot_ortho (obspy.core.tests.test_event.CatalogCartopyTestCase) Cartopy not installed or too old
core test_catalog_plot_ortho_longitude_wrap (obspy.core.tests.test_event.CatalogCartopyTestCase) Cartopy not installed or too old
core test_plot_farfield_without_quiver_with_maps (obspy.core.tests.test_event.EventTestCase) matplotlib 3.0.1 is not compatible with basemap
geodetics test_gps_2_dist_azimuth_bug150 (obspy.geodetics.tests.test_util_geodetics.UtilGeodeticsTestCase) Module geographiclib is installed, not using calc_vincenty_inverse
imaging test_script_plot (obspy.imaging.tests.test_mopad_script.MopadTestCase) Currently broken until further review.

Slowest tests (20)

Runtime Test
15.978s test_get_stations_integration_test (obspy.clients.fdsn.tests.test_eidaws_routing_client.EIDAWSRoutingClientTestCase)
13.522s test_get_waveforms_integration_test (obspy.clients.fdsn.tests.test_eidaws_routing_client.EIDAWSRoutingClientTestCase)
11.970s test_response_calculation_from_seed_and_xseed (obspy.io.xseed.tests.test_core.CoreTestCase)
10.975s test_ppsd_restricted_stacks (obspy.signal.tests.test_spectral_estimation.PsdTestCase)
7.649s test_plot_multiple_traces (obspy.imaging.tests.test_waveform.WaveformTestCase)
6.644s __init__ (obspy.taup)
5.093s test_relcal_different_overlaps (obspy.signal.tests.test_calibration.CalibrationTestCase)
4.618s test_shoot_existing_ray_param (obspy.taup.tests.test_seismic_phase.TauPySeismicPhaseTestCase)
4.475s test_remove_response_plot (obspy.core.tests.test_trace.TraceTestCase)
3.587s test_correlate_stream_template_and_correlation_detector (obspy.signal.tests.test_cross_correlation.CrossCorrelationTestCase)
3.536s test_location_plot_global (obspy.core.tests.test_network.NetworkBasemapTestCase)
3.326s test_polarization_vidale (obspy.signal.tests.test_polarization.PolarizationTestCase)
3.179s test_iris_example_queries_dataselect (obspy.clients.fdsn.tests.test_client.ClientTestCase)
3.017s plot_travel_times (obspy.taup.tau)
2.995s test_auto_read_arclink_xml (obspy.io.arclink.tests.test_inventory_xml.ArclinkInventoryTestCase)
2.868s test_iris_example_queries_dataselect_discover_services_false (obspy.clients.fdsn.tests.test_client.ClientTestCase)
2.821s test_plot_wiggles_horizontal_section (obspy.imaging.tests.test_waveform.WaveformTestCase)
2.768s read (obspy.core.stream)
2.734s test_plot_azim_section (obspy.imaging.tests.test_waveform.WaveformTestCase)
2.724s test_redirection_auth (obspy.clients.fdsn.tests.test_client.ClientTestCase)

Chuck Norris fact

Chuck Norris uses canvas in IE.