#112255 Report by node travis-ci covering 2110 tests from 50 modules resulted into 5 errors

Report

ObsPy version
1.2.2.post0+32.g0feedda483
Continuous Integration
https://travis-ci.org/obspy/obspy/jobs/739850289
GitHub Pull Request
https://github.com/obspy/obspy/pull/2739
Report file
XML document
Total runtime
313.9 sec
Report date/time
2020-10-29 03:48:22

System / Python

Architecture
64bit
Machine
x86_64
Node
travis-ci
Processor
x86_64
Python Compiler
GCC 4.8.2 20140120 (Red Hat 4.8.2-15)
Python Implementation
CPython
Python Version
3.4.5
Release
4.15.0-1077-gcp
System
Linux
Version
#87~16.04.1-Ubuntu SMP Sat Jun 6 01:51:20 UTC 2020

Dependencies

cartopy
---
decorator
4.4.2
flake8
---
future
0.16.0
geographiclib
1.50
lxml.etree
3.7.2
m2crypto
---
matplotlib
2.0.0
mock
2.0.0
mpl_toolkits.basemap
1.0.7
numpy
1.11.3
pep8-naming
---
pyflakes
---
pyimgur
0.5.2
pyproj
1.9.5.1
requests
2.21.0
scipy
0.18.1
setuptools
27.2.0
shapefile
2.1.2
sqlalchemy
1.1.5

Modules (50)

Module Errors / Failures Tracebacks
obspy.clients.arclink Not tested -
obspy.clients.earthworm Not tested -
obspy.clients.fdsn 5 1 2 3 4 5
obspy.clients.filesystem - -
obspy.clients.iris Not tested -
obspy.clients.neic Not tested -
obspy.clients.nrl Not tested -
obspy.clients.seedlink Not tested -
obspy.clients.seishub Not tested -
obspy.clients.syngine Not tested -
obspy.core - -
obspy.db - -
obspy.geodetics - -
obspy.imaging - -
obspy.io.ah - -
obspy.io.arclink - -
obspy.io.ascii - -
obspy.io.cmtsolution - -
obspy.io.cnv - -
obspy.io.css - -
obspy.io.dmx - -
obspy.io.focmec - -
obspy.io.gcf - -
obspy.io.gse2 - -
obspy.io.hypodd - -
obspy.io.iaspei - -
obspy.io.json - -
obspy.io.kinemetrics - -
obspy.io.kml - -
obspy.io.mseed - -
obspy.io.ndk - -
obspy.io.nied - -
obspy.io.nlloc - -
obspy.io.nordic - -
obspy.io.pdas - -
obspy.io.pde - -
obspy.io.quakeml - -
obspy.io.reftek - -
obspy.io.rg16 - -
obspy.io.sac - -
obspy.io.scardec - -
obspy.io.seg2 - -
obspy.io.segy - -
obspy.io.seisan - -
obspy.io.seiscomp - -
obspy.io.sh - -
obspy.io.shapefile - -
obspy.io.stationtxt - -
obspy.io.stationxml - -
obspy.io.wav - -
obspy.io.win - -
obspy.io.xseed - -
obspy.io.y - -
obspy.io.zmap - -
obspy.realtime - -
obspy.scripts - -
obspy.signal - -
obspy.taup - -
Summary 5 5

Tracebacks (5)

Traceback (most recent call last):
File "/home/travis/miniconda/envs/test-environment/lib/python3.4/site-packages/obspy/clients/fdsn/tests/test_client.py", line 638, in test_authentication
got = client.get_waveforms(*query)
File "/home/travis/miniconda/envs/test-environment/lib/python3.4/site-packages/obspy/clients/fdsn/client.py", line 851, in get_waveforms
data_stream = self._download(url, use_gzip=False)
File "/home/travis/miniconda/envs/test-environment/lib/python3.4/site-packages/obspy/clients/fdsn/client.py", line 1404, in _download
raise_on_error(code, data)
File "/home/travis/miniconda/envs/test-environment/lib/python3.4/site-packages/obspy/clients/fdsn/client.py", line 1743, in raise_on_error
server_info)
obspy.clients.fdsn.header.FDSNException: Unauthorized, authentication required.
Traceback (most recent call last):
File "/home/travis/miniconda/envs/test-environment/lib/python3.4/doctest.py", line 2187, in runTest
raise self.failureException(self.format_failure(new.getvalue()))
AssertionError: Failed doctest test for obspy.clients.fdsn.client.Client.get_stations_bulk
File "/home/travis/miniconda/envs/test-environment/lib/python3.4/site-packages/obspy/clients/fdsn/client.py", line 1045, in get_stations_bulk
----------------------------------------------------------------------
File "/home/travis/miniconda/envs/test-environment/lib/python3.4/site-packages/obspy/clients/fdsn/client.py", line 1077, in obspy.clients.fdsn.client.Client.get_stations_bulk
Failed example:
print(inv) # doctest: +ELLIPSIS +NORMALIZE_WHITESPACE
Expected:
Inventory created at ...
Created by: IRIS WEB SERVICE: fdsnws-station | version: ...
...
Sending institution: IRIS-DMC (IRIS-DMC)
Contains:
Networks (2):
GR, IU
Stations (2):
GR.GRA1 (GRAFENBERG ARRAY, BAYERN)
IU.ANMO (Albuquerque, New Mexico, USA)
Channels (0):
Got:
Inventory created at 2020-10-29T08:43:02.000000Z
	Created by: IRIS WEB SERVICE: fdsnws-station | version: 1.1.47
		
	Sending institution: IRIS-DMC (IRIS-DMC)
	Contains:
		Networks (2):
			GR, IU
		Stations (2):
			GR.GRA1 (GRAFENBERG ARRAY, BAYERN)
			IU.ANMO (Albuquerque, New Mexico, USA)
		Channels (0):
<BLANKLINE>
----------------------------------------------------------------------
File "/home/travis/miniconda/envs/test-environment/lib/python3.4/site-packages/obspy/clients/fdsn/client.py", line 1107, in obspy.clients.fdsn.client.Client.get_stations_bulk
Failed example:
print(inv) # doctest: +ELLIPSIS +NORMALIZE_WHITESPACE
Expected:
Inventory created at ...
Created by: IRIS WEB SERVICE: fdsnws-station | version: ...
...
Sending institution: IRIS-DMC (IRIS-DMC)
Contains:
Networks (2):
GR, IU
Stations (2):
GR.GRA1 (GRAFENBERG ARRAY, BAYERN)
IU.ANMO (Albuquerque, New Mexico, USA)
Channels (5):
GR.GRA1..BHZ, GR.GRA1..BHN, GR.GRA1..BHE, IU.ANMO.00.BHZ,
IU.ANMO.10.BHZ
Got:
Inventory created at 2020-10-29T08:43:02.000000Z
	Created by: IRIS WEB SERVICE: fdsnws-station | version: 1.1.47
		
	Sending institution: IRIS-DMC (IRIS-DMC)
	Contains:
		Networks (2):
			GR, IU
		Stations (2):
			GR.GRA1 (GRAFENBERG ARRAY, BAYERN)
			IU.ANMO (Albuquerque, New Mexico, USA)
		Channels (5):
			GR.GRA1..BHZ, GR.GRA1..BHN, GR.GRA1..BHE, IU.ANMO.00.BHZ,
			IU.ANMO.10.BHZ
Traceback (most recent call last):
File "/home/travis/miniconda/envs/test-environment/lib/python3.4/site-packages/obspy/clients/fdsn/tests/test_client.py", line 1427, in test_redirection_auth
st = c_auth.get_waveforms_bulk(bulk, quality="B", longestonly=False)
File "/home/travis/miniconda/envs/test-environment/lib/python3.4/site-packages/obspy/clients/fdsn/client.py", line 1031, in get_waveforms_bulk
data=bulk)
File "/home/travis/miniconda/envs/test-environment/lib/python3.4/site-packages/obspy/clients/fdsn/client.py", line 1404, in _download
raise_on_error(code, data)
File "/home/travis/miniconda/envs/test-environment/lib/python3.4/site-packages/obspy/clients/fdsn/client.py", line 1743, in raise_on_error
server_info)
obspy.clients.fdsn.header.FDSNException: Unauthorized, authentication required.
Traceback (most recent call last):
File "/home/travis/miniconda/envs/test-environment/lib/python3.4/site-packages/obspy/clients/fdsn/tests/test_client.py", line 929, in test_dataselect_bulk
got = client.get_waveforms_bulk(bulk, **params)
File "/home/travis/miniconda/envs/test-environment/lib/python3.4/site-packages/obspy/clients/fdsn/client.py", line 1031, in get_waveforms_bulk
data=bulk)
File "/home/travis/miniconda/envs/test-environment/lib/python3.4/site-packages/obspy/clients/fdsn/client.py", line 1404, in _download
raise_on_error(code, data)
File "/home/travis/miniconda/envs/test-environment/lib/python3.4/site-packages/obspy/clients/fdsn/client.py", line 1743, in raise_on_error
server_info)
obspy.clients.fdsn.header.FDSNException: Unauthorized, authentication required.
Traceback (most recent call last):
File "/home/travis/miniconda/envs/test-environment/lib/python3.4/site-packages/obspy/clients/fdsn/tests/test_client.py", line 1523, in test_eida_token_resolution
user, password = client._resolve_eida_token(token=token)
File "/home/travis/miniconda/envs/test-environment/lib/python3.4/site-packages/obspy/clients/fdsn/client.py", line 394, in _resolve_eida_token
use_gzip=True, return_string=True)
File "/home/travis/miniconda/envs/test-environment/lib/python3.4/site-packages/obspy/clients/fdsn/client.py", line 1404, in _download
raise_on_error(code, data)
File "/home/travis/miniconda/envs/test-environment/lib/python3.4/site-packages/obspy/clients/fdsn/client.py", line 1740, in raise_on_error
raise FDSNException(msg, server_info)
obspy.clients.fdsn.header.FDSNException: Bad request. If you think your request was valid please contact the developers.
Detailed response of server:
Error 400: Bad Request
token is expired
Usage details are available from /fdsnws/dataselect/1/
Request:
/fdsnws/dataselect/1/auth
Request Submitted:
2020-10-29T08:43:21.233124
Service Version:
1.1.0

Skipped tests (23)

Submodule Test Skip message
geodetics test_gps_2_dist_azimuth_bug150 (obspy.geodetics.tests.test_util_geodetics.UtilGeodeticsTestCase) Module geographiclib is installed, not using calc_vincenty_inverse
core test_flake8 (obspy.core.tests.test_code_formatting.CodeFormattingTestCase) Formatting tests require at least flake8 3.0.
core test_location_plot_global (obspy.core.tests.test_network.NetworkCartopyTestCase) cartopy not installed
core test_location_plot_local (obspy.core.tests.test_network.NetworkCartopyTestCase) cartopy not installed
core test_location_plot_ortho (obspy.core.tests.test_network.NetworkCartopyTestCase) cartopy not installed
core test_combined_station_event_plot (obspy.core.tests.test_inventory.InventoryBasemapTestCase) matplotlib 3.0.1 is not compatible with basemap
core test_location_plot_global (obspy.core.tests.test_inventory.InventoryBasemapTestCase) matplotlib 3.0.1 is not compatible with basemap
core test_location_plot_local (obspy.core.tests.test_inventory.InventoryBasemapTestCase) matplotlib 3.0.1 is not compatible with basemap
core test_location_plot_ortho (obspy.core.tests.test_inventory.InventoryBasemapTestCase) matplotlib 3.0.1 is not compatible with basemap
core test_location_plot_global (obspy.core.tests.test_inventory.InventoryCartopyTestCase) cartopy not installed
core test_location_plot_local (obspy.core.tests.test_inventory.InventoryCartopyTestCase) cartopy not installed
core test_location_plot_ortho (obspy.core.tests.test_inventory.InventoryCartopyTestCase) cartopy not installed
core test_catalog_plot_global (obspy.core.tests.test_event.CatalogBasemapTestCase) matplotlib 3.0.1 is not compatible with basemap
core test_catalog_plot_local (obspy.core.tests.test_event.CatalogBasemapTestCase) matplotlib 3.0.1 is not compatible with basemap
core test_catalog_plot_ortho (obspy.core.tests.test_event.CatalogBasemapTestCase) matplotlib 3.0.1 is not compatible with basemap
core test_catalog_plot_ortho_longitude_wrap (obspy.core.tests.test_event.CatalogBasemapTestCase) matplotlib 3.0.1 is not compatible with basemap
core test_plot_catalog_before_1900 (obspy.core.tests.test_event.CatalogBasemapTestCase) matplotlib 3.0.1 is not compatible with basemap
core test_catalog_plot_global (obspy.core.tests.test_event.CatalogCartopyTestCase) Cartopy not installed or too old
core test_catalog_plot_local (obspy.core.tests.test_event.CatalogCartopyTestCase) Cartopy not installed or too old
core test_catalog_plot_ortho (obspy.core.tests.test_event.CatalogCartopyTestCase) Cartopy not installed or too old
core test_catalog_plot_ortho_longitude_wrap (obspy.core.tests.test_event.CatalogCartopyTestCase) Cartopy not installed or too old
core test_plot_farfield_without_quiver_with_maps (obspy.core.tests.test_event.EventTestCase) matplotlib 3.0.1 is not compatible with basemap
imaging test_script_plot (obspy.imaging.tests.test_mopad_script.MopadTestCase) Currently broken until further review.

Slowest tests (20)

Runtime Test
11.579s test_response_calculation_from_seed_and_xseed (obspy.io.xseed.tests.test_core.CoreTestCase)
11.309s test_ppsd_restricted_stacks (obspy.signal.tests.test_spectral_estimation.PsdTestCase)
8.389s test_plot_multiple_traces (obspy.imaging.tests.test_waveform.WaveformTestCase)
6.396s __init__ (obspy.taup)
5.677s test_irisph5_event (obspy.clients.fdsn.tests.test_client.ClientTestCase)
4.745s test_relcal_different_overlaps (obspy.signal.tests.test_calibration.CalibrationTestCase)
4.272s test_shoot_existing_ray_param (obspy.taup.tests.test_seismic_phase.TauPySeismicPhaseTestCase)
4.124s test_remove_response_plot (obspy.core.tests.test_trace.TraceTestCase)
3.627s test_correlate_stream_template_and_correlation_detector (obspy.signal.tests.test_cross_correlation.CrossCorrelationTestCase)
3.439s test_location_plot_global (obspy.core.tests.test_network.NetworkBasemapTestCase)
3.413s test_plot_wiggles_horizontal_section (obspy.imaging.tests.test_waveform.WaveformTestCase)
3.373s test_plot_wiggles_vertical_section (obspy.imaging.tests.test_waveform.WaveformTestCase)
3.336s test_rotate2zne_against_lqt_different_combinations (obspy.signal.tests.test_rotate.RotateTestCase)
3.255s test_plot_horizontal_section (obspy.imaging.tests.test_waveform.WaveformTestCase)
3.244s test_plot_wiggles_negative_section (obspy.imaging.tests.test_waveform.WaveformTestCase)
3.199s test_plot_wiggles_positive_section (obspy.imaging.tests.test_waveform.WaveformTestCase)
3.198s test_plot_azim_section (obspy.imaging.tests.test_waveform.WaveformTestCase)
3.172s test_plot_default_section (obspy.imaging.tests.test_waveform.WaveformTestCase)
3.163s test_plot_colored_section (obspy.imaging.tests.test_waveform.WaveformTestCase)
3.152s test_plot_ref_time_section (obspy.imaging.tests.test_waveform.WaveformTestCase)

Chuck Norris fact

Chuck Norris doesn't need to use AJAX because pages are too afraid to postback anyways.