#15714 Report by node Johns-MacBook-Air covering 1205 tests from 29 modules resulted into 21 errors

Report

ObsPy Version
0.9.2-844-gc415-dirty
Continuous Integration
-
GitHub Pull Request
-
Report File
XML Document
Total Runtime
937.9 sec
Report Date/Time
2014-07-11 00:45:31

System / Python

Architecture
64bit
Machine
x86_64
Node
Johns-MacBook-Air
Processor
i386
Python Compiler
GCC 4.0.1 (Apple Inc. build 5493)
Python Implementation
CPython
Python Version
2.7.7
Release
13.2.0
System
Darwin
Version
Darwin Kernel Version 13.2.0: Thu Apr 17 23:03:13 PDT 2014; root:xnu-2422.100.13~1/RELEASE_X86_64

Dependencies

flake8
Not Installed
future
0.12.1
lxml.etree
3.3.5
matplotlib
1.3.1
mock
1.0.1
mpl_toolkits.basemap
Not Installed
nose
1.3.3
numpy
1.8.1
pyflakes
0.8.1
pyimgur
Not Installed
scipy
0.14.0
sqlalchemy
0.9.4
suds
0.6

Modules (29)

Module Errors /
Failures
Tracebacks
obspy.arclink 3 1 2 3
obspy.core 2 4 5
obspy.css - -
obspy.datamark - -
obspy.db - -
obspy.earthworm 3 6 7 8
obspy.fdsn 1 9
obspy.gse2 - -
obspy.imaging - -
obspy.iris - -
obspy.mseed - -
obspy.ndk - -
obspy.neic - -
obspy.neries 12 10 11 12 13 14 15 16 17 18 19 20 21
obspy.pde - -
obspy.realtime - -
obspy.sac - -
obspy.seedlink - -
obspy.seg2 - -
obspy.segy - -
obspy.seisan - -
obspy.seishub - -
obspy.sh - -
obspy.signal - -
obspy.station - -
obspy.taup - -
obspy.wav - -
obspy.xseed - -
obspy.y - -
Summary 21 21

Tracebacks (21)

Traceback (most recent call last):
File "/Users/jleeman/anaconda/lib/python2.7/site-packages/obspy-0.9.2_844_gc415_dirty-py2.7-macosx-10.5-x86_64.egg/obspy/arclink/tests/test_client.py", line 50, in test_getWaveform
self.assertTrue(trace.stats.starttime <= start)
AssertionError: False is not true
Traceback (most recent call last):
File "/Users/jleeman/anaconda/lib/python2.7/site-packages/obspy-0.9.2_844_gc415_dirty-py2.7-macosx-10.5-x86_64.egg/obspy/core/tests/test_code_formatting.py", line 25, in test_flake8
report, message = check_flake8()
File "/Users/jleeman/anaconda/lib/python2.7/site-packages/obspy-0.9.2_844_gc415_dirty-py2.7-macosx-10.5-x86_64.egg/obspy/core/util/testing.py", line 391, in check_flake8
raise Exception('flake8 is required to check code formatting')
Exception: flake8 is required to check code formatting
Traceback (most recent call last):
File "/Users/jleeman/anaconda/lib/python2.7/site-packages/obspy-0.9.2_844_gc415_dirty-py2.7-macosx-10.5-x86_64.egg/obspy/core/tests/test_code_formatting.py", line 85, in test_future_imports_in_every_file
self.assertEqual(len(failures), 0, "\n" + "\n".join(failures))
AssertionError:
File '/Users/jleeman/anaconda/lib/python2.7/site-packages/obspy-0.9.2_844_gc415_dirty-py2.7-macosx-10.5-x86_64.egg/obspy/lib/libevresp_Darwin_64bit_py27.py' misses imports: from __future__ import (absolute_import, division, print_function, unicode_literals)
File '/Users/jleeman/anaconda/lib/python2.7/site-packages/obspy-0.9.2_844_gc415_dirty-py2.7-macosx-10.5-x86_64.egg/obspy/lib/libevresp_Darwin_64bit_py27.py' misses imports: from future.builtins import * # NOQA
File '/Users/jleeman/anaconda/lib/python2.7/site-packages/obspy-0.9.2_844_gc415_dirty-py2.7-macosx-10.5-x86_64.egg/obspy/lib/libgse2_Darwin_64bit_py27.py' misses imports: from __future__ import (absolute_import, division, print_function, unicode_literals)
File '/Users/jleeman/anaconda/lib/python2.7/site-packages/obspy-0.9.2_844_gc415_dirty-py2.7-macosx-10.5-x86_64.egg/obspy/lib/libgse2_Darwin_64bit_py27.py' misses imports: from future.builtins import * # NOQA
File '/Users/jleeman/anaconda/lib/python2.7/site-packages/obspy-0.9.2_844_gc415_dirty-py2.7-macosx-10.5-x86_64.egg/obspy/lib/libmseed_Darwin_64bit_py27.py' misses imports: from __future__ import (absolute_import, division, print_function, unicode_literals)
File '/Users/jleeman/anaconda/lib/python2.7/site-packages/obspy-0.9.2_844_gc415_dirty-py2.7-macosx-10.5-x86_64.egg/obspy/lib/libmseed_Darwin_64bit_py27.py' misses imports: from future.builtins import * # NOQA
File '/Users/jleeman/anaconda/lib/python2.7/site-packages/obspy-0.9.2_844_gc415_dirty-py2.7-macosx-10.5-x86_64.egg/obspy/lib/libsegy_Darwin_64bit_py27.py' misses imports: from __future__ import (absolute_import, division, print_function, unicode_literals)
File '/Users/jleeman/anaconda/lib/python2.7/site-packages/obspy-0.9.2_844_gc415_dirty-py2.7-macosx-10.5-x86_64.egg/obspy/lib/libsegy_Darwin_64bit_py27.py' misses imports: from future.builtins import * # NOQA
File '/Users/jleeman/anaconda/lib/python2.7/site-packages/obspy-0.9.2_844_gc415_dirty-py2.7-macosx-10.5-x86_64.egg/obspy/lib/libsignal_Darwin_64bit_py27.py' misses imports: from __future__ import (absolute_import, division, print_function, unicode_literals)
File '/Users/jleeman/anaconda/lib/python2.7/site-packages/obspy-0.9.2_844_gc415_dirty-py2.7-macosx-10.5-x86_64.egg/obspy/lib/libsignal_Darwin_64bit_py27.py' misses imports: from future.builtins import * # NOQA
File '/Users/jleeman/anaconda/lib/python2.7/site-packages/obspy-0.9.2_844_gc415_dirty-py2.7-macosx-10.5-x86_64.egg/obspy/lib/libtau_Darwin_64bit_py27.py' misses imports: from __future__ import (absolute_import, division, print_function, unicode_literals)
File '/Users/jleeman/anaconda/lib/python2.7/site-packages/obspy-0.9.2_844_gc415_dirty-py2.7-macosx-10.5-x86_64.egg/obspy/lib/libtau_Darwin_64bit_py27.py' misses imports: from future.builtins import * # NOQA
Traceback (most recent call last):
File "/Users/jleeman/anaconda/lib/python2.7/doctest.py", line 2226, in runTest
raise self.failureException(self.format_failure(new.getvalue()))
AssertionError: Failed doctest test for obspy.earthworm.__init__
File "/Users/jleeman/anaconda/lib/python2.7/site-packages/obspy-0.9.2_844_gc415_dirty-py2.7-macosx-10.5-x86_64.egg/obspy/earthworm/__init__.py", line 1, in __init__
----------------------------------------------------------------------
File "/Users/jleeman/anaconda/lib/python2.7/site-packages/obspy-0.9.2_844_gc415_dirty-py2.7-macosx-10.5-x86_64.egg/obspy/earthworm/__init__.py", line 21, in obspy.earthworm.__init__
Failed example:
response = client.availability("UW", "TUCA", channel="BHZ")
Exception raised:
Traceback (most recent call last):
File "/Users/jleeman/anaconda/lib/python2.7/doctest.py", line 1315, in __run
compileflags, 1) in test.globs
File "<doctest obspy.earthworm.__init__[2]>", line 1, in <module>
response = client.availability("UW", "TUCA", channel="BHZ")
File "/Users/jleeman/anaconda/lib/python2.7/site-packages/obspy-0.9.2_844_gc415_dirty-py2.7-macosx-10.5-x86_64.egg/obspy/earthworm/client.py", line 220, in availability
response = getMenu(self.host, self.port, timeout=self.timeout)
File "/Users/jleeman/anaconda/lib/python2.7/site-packages/obspy-0.9.2_844_gc415_dirty-py2.7-macosx-10.5-x86_64.egg/obspy/earthworm/waveserver.py", line 202, in getMenu
timeout=timeout)
File "/Users/jleeman/anaconda/lib/python2.7/site-packages/obspy-0.9.2_844_gc415_dirty-py2.7-macosx-10.5-x86_64.egg/obspy/earthworm/waveserver.py", line 134, in sendSockReq
s.connect((server, port))
File "/Users/jleeman/anaconda/lib/python2.7/socket.py", line 224, in meth
return getattr(self._sock,name)(*args)
error: [Errno 60] Operation timed out
----------------------------------------------------------------------
File "/Users/jleeman/anaconda/lib/python2.7/site-packages/obspy-0.9.2_844_gc415_dirty-py2.7-macosx-10.5-x86_64.egg/obspy/earthworm/__init__.py", line 29, in obspy.earthworm.__init__
Failed example:
t = response[0][4]
Exception raised:
Traceback (most recent call last):
File "/Users/jleeman/anaconda/lib/python2.7/doctest.py", line 1315, in __run
compileflags, 1) in test.globs
File "<doctest obspy.earthworm.__init__[4]>", line 1, in <module>
t = response[0][4]
NameError: name 'response' is not defined
----------------------------------------------------------------------
File "/Users/jleeman/anaconda/lib/python2.7/site-packages/obspy-0.9.2_844_gc415_dirty-py2.7-macosx-10.5-x86_64.egg/obspy/earthworm/__init__.py", line 30, in obspy.earthworm.__init__
Failed example:
st = client.getWaveform('UW', 'TUCA', '', 'BH*', t + 100, t + 130)
Exception raised:
Traceback (most recent call last):
File "/Users/jleeman/anaconda/lib/python2.7/doctest.py", line 1315, in __run
compileflags, 1) in test.globs
File "<doctest obspy.earthworm.__init__[5]>", line 1, in <module>
st = client.getWaveform('UW', 'TUCA', '', 'BH*', t + 100, t + 130)
NameError: name 't' is not defined
Traceback (most recent call last):
File "/Users/jleeman/anaconda/lib/python2.7/doctest.py", line 2226, in runTest
raise self.failureException(self.format_failure(new.getvalue()))
AssertionError: Failed doctest test for obspy.earthworm.client.Client.availability
File "/Users/jleeman/anaconda/lib/python2.7/site-packages/obspy-0.9.2_844_gc415_dirty-py2.7-macosx-10.5-x86_64.egg/obspy/earthworm/client.py", line 167, in availability
----------------------------------------------------------------------
File "/Users/jleeman/anaconda/lib/python2.7/site-packages/obspy-0.9.2_844_gc415_dirty-py2.7-macosx-10.5-x86_64.egg/obspy/earthworm/client.py", line 194, in obspy.earthworm.client.Client.availability
Failed example:
response = client.availability(network="UW", station="TUCA",
channel="BH*")
Exception raised:
Traceback (most recent call last):
File "/Users/jleeman/anaconda/lib/python2.7/doctest.py", line 1315, in __run
compileflags, 1) in test.globs
File "<doctest obspy.earthworm.client.Client.availability[2]>", line 2, in <module>
channel="BH*")
File "/Users/jleeman/anaconda/lib/python2.7/site-packages/obspy-0.9.2_844_gc415_dirty-py2.7-macosx-10.5-x86_64.egg/obspy/earthworm/client.py", line 220, in availability
response = getMenu(self.host, self.port, timeout=self.timeout)
File "/Users/jleeman/anaconda/lib/python2.7/site-packages/obspy-0.9.2_844_gc415_dirty-py2.7-macosx-10.5-x86_64.egg/obspy/earthworm/waveserver.py", line 202, in getMenu
timeout=timeout)
File "/Users/jleeman/anaconda/lib/python2.7/site-packages/obspy-0.9.2_844_gc415_dirty-py2.7-macosx-10.5-x86_64.egg/obspy/earthworm/waveserver.py", line 134, in sendSockReq
s.connect((server, port))
File "/Users/jleeman/anaconda/lib/python2.7/socket.py", line 224, in meth
return getattr(self._sock,name)(*args)
timeout: timed out
Traceback (most recent call last):
File "/Users/jleeman/anaconda/lib/python2.7/doctest.py", line 2226, in runTest
raise self.failureException(self.format_failure(new.getvalue()))
AssertionError: Failed doctest test for obspy.earthworm.client.Client.getWaveform
File "/Users/jleeman/anaconda/lib/python2.7/site-packages/obspy-0.9.2_844_gc415_dirty-py2.7-macosx-10.5-x86_64.egg/obspy/earthworm/client.py", line 49, in getWaveform
----------------------------------------------------------------------
File "/Users/jleeman/anaconda/lib/python2.7/site-packages/obspy-0.9.2_844_gc415_dirty-py2.7-macosx-10.5-x86_64.egg/obspy/earthworm/client.py", line 81, in obspy.earthworm.client.Client.getWaveform
Failed example:
st = client.getWaveform('UW', 'TUCA', '', 'BHZ', dt, dt + 10)
Exception raised:
Traceback (most recent call last):
File "/Users/jleeman/anaconda/lib/python2.7/doctest.py", line 1315, in __run
compileflags, 1) in test.globs
File "<doctest obspy.earthworm.client.Client.getWaveform[3]>", line 1, in <module>
st = client.getWaveform('UW', 'TUCA', '', 'BHZ', dt, dt + 10)
File "/Users/jleeman/anaconda/lib/python2.7/site-packages/obspy-0.9.2_844_gc415_dirty-py2.7-macosx-10.5-x86_64.egg/obspy/earthworm/client.py", line 111, in getWaveform
timeout=self.timeout)
File "/Users/jleeman/anaconda/lib/python2.7/site-packages/obspy-0.9.2_844_gc415_dirty-py2.7-macosx-10.5-x86_64.egg/obspy/earthworm/waveserver.py", line 244, in readWaveServerV
sock = sendSockReq(server, port, reqstr, timeout=timeout)
File "/Users/jleeman/anaconda/lib/python2.7/site-packages/obspy-0.9.2_844_gc415_dirty-py2.7-macosx-10.5-x86_64.egg/obspy/earthworm/waveserver.py", line 134, in sendSockReq
s.connect((server, port))
File "/Users/jleeman/anaconda/lib/python2.7/socket.py", line 224, in meth
return getattr(self._sock,name)(*args)
error: [Errno 60] Operation timed out
----------------------------------------------------------------------
File "/Users/jleeman/anaconda/lib/python2.7/site-packages/obspy-0.9.2_844_gc415_dirty-py2.7-macosx-10.5-x86_64.egg/obspy/earthworm/client.py", line 83, in obspy.earthworm.client.Client.getWaveform
Failed example:
st = client.getWaveform('UW', 'TUCA', '', 'BH*', dt, dt + 10)
Exception raised:
Traceback (most recent call last):
File "/Users/jleeman/anaconda/lib/python2.7/doctest.py", line 1315, in __run
compileflags, 1) in test.globs
File "<doctest obspy.earthworm.client.Client.getWaveform[5]>", line 1, in <module>
st = client.getWaveform('UW', 'TUCA', '', 'BH*', dt, dt + 10)
File "/Users/jleeman/anaconda/lib/python2.7/site-packages/obspy-0.9.2_844_gc415_dirty-py2.7-macosx-10.5-x86_64.egg/obspy/earthworm/client.py", line 104, in getWaveform
cleanup=cleanup)
File "/Users/jleeman/anaconda/lib/python2.7/site-packages/obspy-0.9.2_844_gc415_dirty-py2.7-macosx-10.5-x86_64.egg/obspy/earthworm/client.py", line 111, in getWaveform
timeout=self.timeout)
File "/Users/jleeman/anaconda/lib/python2.7/site-packages/obspy-0.9.2_844_gc415_dirty-py2.7-macosx-10.5-x86_64.egg/obspy/earthworm/waveserver.py", line 244, in readWaveServerV
sock = sendSockReq(server, port, reqstr, timeout=timeout)
File "/Users/jleeman/anaconda/lib/python2.7/site-packages/obspy-0.9.2_844_gc415_dirty-py2.7-macosx-10.5-x86_64.egg/obspy/earthworm/waveserver.py", line 134, in sendSockReq
s.connect((server, port))
File "/Users/jleeman/anaconda/lib/python2.7/socket.py", line 224, in meth
return getattr(self._sock,name)(*args)
error: [Errno 60] Operation timed out
Traceback (most recent call last):
File "/Users/jleeman/anaconda/lib/python2.7/site-packages/obspy-0.9.2_844_gc415_dirty-py2.7-macosx-10.5-x86_64.egg/obspy/fdsn/tests/test_client.py", line 383, in test_IRIS_example_queries_station
self.assertEqual(msg, "", msg)
AssertionError:
Diff:
- <Station code="ORCD" startDate="1997-03-01T00:00:00" endDate="2599-12-31T23:59:59" restrictedStatus="open" iris:alternateNetworkCodes=".UNRESTRICTED,_FDSN-ALL,_REALTIME">
? ^^^^ -
+ <Station code="ORCD" startDate="2004-03-20T00:00:00" endDate="2599-12-31T23:59:59" restrictedStatus="open" iris:alternateNetworkCodes=".UNRESTRICTED,_FDSN-ALL,_REALTIME">
? ^^^^ +
- <CreationDate>1997-03-01T00:00:00</CreationDate>
? ^^^^ -
+ <CreationDate>2004-03-20T00:00:00</CreationDate>
? ^^^^ +
- <TotalNumberChannels>12</TotalNumberChannels>
? ^^
+ <TotalNumberChannels>9</TotalNumberChannels>
? ^
Traceback (most recent call last):
File "/Users/jleeman/anaconda/lib/python2.7/site-packages/obspy-0.9.2_844_gc415_dirty-py2.7-macosx-10.5-x86_64.egg/obspy/neries/tests/test_client.py", line 139, in test_getEventDetail
data = client.getEventDetail("19990817_0000001", format='xml')
File "/Users/jleeman/anaconda/lib/python2.7/site-packages/obspy-0.9.2_844_gc415_dirty-py2.7-macosx-10.5-x86_64.egg/obspy/neries/client.py", line 419, in getEventDetail
data = self._fetch("/services/event/detail", **kwargs)
File "/Users/jleeman/anaconda/lib/python2.7/site-packages/obspy-0.9.2_844_gc415_dirty-py2.7-macosx-10.5-x86_64.egg/obspy/neries/client.py", line 171, in _fetch
response = urllib.request.urlopen(remoteaddr, timeout=self.timeout)
File "/Users/jleeman/anaconda/lib/python2.7/urllib2.py", line 127, in urlopen
return _opener.open(url, data, timeout)
File "/Users/jleeman/anaconda/lib/python2.7/urllib2.py", line 410, in open
response = meth(req, response)
File "/Users/jleeman/anaconda/lib/python2.7/urllib2.py", line 523, in http_response
'http', request, response, code, msg, hdrs)
File "/Users/jleeman/anaconda/lib/python2.7/urllib2.py", line 448, in error
return self._call_chain(*args)
File "/Users/jleeman/anaconda/lib/python2.7/urllib2.py", line 382, in _call_chain
result = func(*args)
File "/Users/jleeman/anaconda/lib/python2.7/urllib2.py", line 531, in http_error_default
raise HTTPError(req.get_full_url(), code, msg, hdrs, fp)
HTTPError: HTTP Error 503: Service Unavailable
Traceback (most recent call last):
File "/Users/jleeman/anaconda/lib/python2.7/site-packages/obspy-0.9.2_844_gc415_dirty-py2.7-macosx-10.5-x86_64.egg/obspy/neries/tests/test_client.py", line 127, in test_getEventsAsCatalog
max_datetime=UTCDateTime("2005-01-01"))
File "/Users/jleeman/anaconda/lib/python2.7/site-packages/obspy-0.9.2_844_gc415_dirty-py2.7-macosx-10.5-x86_64.egg/obspy/neries/client.py", line 89, in wrapper
v = f(*args, **new_kwargs)
File "/Users/jleeman/anaconda/lib/python2.7/site-packages/obspy-0.9.2_844_gc415_dirty-py2.7-macosx-10.5-x86_64.egg/obspy/neries/client.py", line 292, in getEvents
data = self._fetch("/services/event/search", **kwargs)
File "/Users/jleeman/anaconda/lib/python2.7/site-packages/obspy-0.9.2_844_gc415_dirty-py2.7-macosx-10.5-x86_64.egg/obspy/neries/client.py", line 171, in _fetch
response = urllib.request.urlopen(remoteaddr, timeout=self.timeout)
File "/Users/jleeman/anaconda/lib/python2.7/urllib2.py", line 127, in urlopen
return _opener.open(url, data, timeout)
File "/Users/jleeman/anaconda/lib/python2.7/urllib2.py", line 410, in open
response = meth(req, response)
File "/Users/jleeman/anaconda/lib/python2.7/urllib2.py", line 523, in http_response
'http', request, response, code, msg, hdrs)
File "/Users/jleeman/anaconda/lib/python2.7/urllib2.py", line 448, in error
return self._call_chain(*args)
File "/Users/jleeman/anaconda/lib/python2.7/urllib2.py", line 382, in _call_chain
result = func(*args)
File "/Users/jleeman/anaconda/lib/python2.7/urllib2.py", line 531, in http_error_default
raise HTTPError(req.get_full_url(), code, msg, hdrs, fp)
HTTPError: HTTP Error 503: Service Unavailable
Traceback (most recent call last):
File "/Users/jleeman/anaconda/lib/python2.7/site-packages/obspy-0.9.2_844_gc415_dirty-py2.7-macosx-10.5-x86_64.egg/obspy/neries/tests/test_client.py", line 116, in test_getEventsAsQuakeML
max_datetime=UTCDateTime("2005-01-01"))
File "/Users/jleeman/anaconda/lib/python2.7/site-packages/obspy-0.9.2_844_gc415_dirty-py2.7-macosx-10.5-x86_64.egg/obspy/neries/client.py", line 89, in wrapper
v = f(*args, **new_kwargs)
File "/Users/jleeman/anaconda/lib/python2.7/site-packages/obspy-0.9.2_844_gc415_dirty-py2.7-macosx-10.5-x86_64.egg/obspy/neries/client.py", line 292, in getEvents
data = self._fetch("/services/event/search", **kwargs)
File "/Users/jleeman/anaconda/lib/python2.7/site-packages/obspy-0.9.2_844_gc415_dirty-py2.7-macosx-10.5-x86_64.egg/obspy/neries/client.py", line 171, in _fetch
response = urllib.request.urlopen(remoteaddr, timeout=self.timeout)
File "/Users/jleeman/anaconda/lib/python2.7/urllib2.py", line 127, in urlopen
return _opener.open(url, data, timeout)
File "/Users/jleeman/anaconda/lib/python2.7/urllib2.py", line 410, in open
response = meth(req, response)
File "/Users/jleeman/anaconda/lib/python2.7/urllib2.py", line 523, in http_response
'http', request, response, code, msg, hdrs)
File "/Users/jleeman/anaconda/lib/python2.7/urllib2.py", line 448, in error
return self._call_chain(*args)
File "/Users/jleeman/anaconda/lib/python2.7/urllib2.py", line 382, in _call_chain
result = func(*args)
File "/Users/jleeman/anaconda/lib/python2.7/urllib2.py", line 531, in http_error_default
raise HTTPError(req.get_full_url(), code, msg, hdrs, fp)
HTTPError: HTTP Error 503: Service Unavailable
Traceback (most recent call last):
File "/Users/jleeman/anaconda/lib/python2.7/site-packages/obspy-0.9.2_844_gc415_dirty-py2.7-macosx-10.5-x86_64.egg/obspy/neries/tests/test_client.py", line 261, in test_getInventory
self.assertTrue(isinstance(result, object))
AssertionError: False is not true
Traceback (most recent call last):
File "/Users/jleeman/anaconda/lib/python2.7/site-packages/obspy-0.9.2_844_gc415_dirty-py2.7-macosx-10.5-x86_64.egg/obspy/neries/tests/test_client.py", line 171, in test_getLatestEvents
data = client.getLatestEvents(5, format='xml')
File "/Users/jleeman/anaconda/lib/python2.7/site-packages/obspy-0.9.2_844_gc415_dirty-py2.7-macosx-10.5-x86_64.egg/obspy/neries/client.py", line 357, in getLatestEvents
data = self._fetch("/services/event/latest", **kwargs)
File "/Users/jleeman/anaconda/lib/python2.7/site-packages/obspy-0.9.2_844_gc415_dirty-py2.7-macosx-10.5-x86_64.egg/obspy/neries/client.py", line 171, in _fetch
response = urllib.request.urlopen(remoteaddr, timeout=self.timeout)
File "/Users/jleeman/anaconda/lib/python2.7/urllib2.py", line 127, in urlopen
return _opener.open(url, data, timeout)
File "/Users/jleeman/anaconda/lib/python2.7/urllib2.py", line 410, in open
response = meth(req, response)
File "/Users/jleeman/anaconda/lib/python2.7/urllib2.py", line 523, in http_response
'http', request, response, code, msg, hdrs)
File "/Users/jleeman/anaconda/lib/python2.7/urllib2.py", line 448, in error
return self._call_chain(*args)
File "/Users/jleeman/anaconda/lib/python2.7/urllib2.py", line 382, in _call_chain
result = func(*args)
File "/Users/jleeman/anaconda/lib/python2.7/urllib2.py", line 531, in http_error_default
raise HTTPError(req.get_full_url(), code, msg, hdrs, fp)
HTTPError: HTTP Error 503: Service Unavailable
Traceback (most recent call last):
File "/Users/jleeman/anaconda/lib/python2.7/site-packages/obspy-0.9.2_844_gc415_dirty-py2.7-macosx-10.5-x86_64.egg/obspy/neries/tests/test_client.py", line 295, in test_issue531
minmag=5.5, format='catalog')
File "/Users/jleeman/anaconda/lib/python2.7/site-packages/obspy-0.9.2_844_gc415_dirty-py2.7-macosx-10.5-x86_64.egg/obspy/neries/client.py", line 89, in wrapper
v = f(*args, **new_kwargs)
File "/Users/jleeman/anaconda/lib/python2.7/site-packages/obspy-0.9.2_844_gc415_dirty-py2.7-macosx-10.5-x86_64.egg/obspy/neries/client.py", line 292, in getEvents
data = self._fetch("/services/event/search", **kwargs)
File "/Users/jleeman/anaconda/lib/python2.7/site-packages/obspy-0.9.2_844_gc415_dirty-py2.7-macosx-10.5-x86_64.egg/obspy/neries/client.py", line 171, in _fetch
response = urllib.request.urlopen(remoteaddr, timeout=self.timeout)
File "/Users/jleeman/anaconda/lib/python2.7/urllib2.py", line 127, in urlopen
return _opener.open(url, data, timeout)
File "/Users/jleeman/anaconda/lib/python2.7/urllib2.py", line 410, in open
response = meth(req, response)
File "/Users/jleeman/anaconda/lib/python2.7/urllib2.py", line 523, in http_response
'http', request, response, code, msg, hdrs)
File "/Users/jleeman/anaconda/lib/python2.7/urllib2.py", line 448, in error
return self._call_chain(*args)
File "/Users/jleeman/anaconda/lib/python2.7/urllib2.py", line 382, in _call_chain
result = func(*args)
File "/Users/jleeman/anaconda/lib/python2.7/urllib2.py", line 531, in http_error_default
raise HTTPError(req.get_full_url(), code, msg, hdrs, fp)
HTTPError: HTTP Error 503: Service Unavailable
Traceback (most recent call last):
File "/Users/jleeman/anaconda/lib/python2.7/site-packages/obspy-0.9.2_844_gc415_dirty-py2.7-macosx-10.5-x86_64.egg/obspy/neries/tests/test_client.py", line 27, in test_getEventsList
max_datetime="2005-01-01")
File "/Users/jleeman/anaconda/lib/python2.7/site-packages/obspy-0.9.2_844_gc415_dirty-py2.7-macosx-10.5-x86_64.egg/obspy/neries/client.py", line 89, in wrapper
v = f(*args, **new_kwargs)
File "/Users/jleeman/anaconda/lib/python2.7/site-packages/obspy-0.9.2_844_gc415_dirty-py2.7-macosx-10.5-x86_64.egg/obspy/neries/client.py", line 292, in getEvents
data = self._fetch("/services/event/search", **kwargs)
File "/Users/jleeman/anaconda/lib/python2.7/site-packages/obspy-0.9.2_844_gc415_dirty-py2.7-macosx-10.5-x86_64.egg/obspy/neries/client.py", line 171, in _fetch
response = urllib.request.urlopen(remoteaddr, timeout=self.timeout)
File "/Users/jleeman/anaconda/lib/python2.7/urllib2.py", line 127, in urlopen
return _opener.open(url, data, timeout)
File "/Users/jleeman/anaconda/lib/python2.7/urllib2.py", line 410, in open
response = meth(req, response)
File "/Users/jleeman/anaconda/lib/python2.7/urllib2.py", line 523, in http_response
'http', request, response, code, msg, hdrs)
File "/Users/jleeman/anaconda/lib/python2.7/urllib2.py", line 448, in error
return self._call_chain(*args)
File "/Users/jleeman/anaconda/lib/python2.7/urllib2.py", line 382, in _call_chain
result = func(*args)
File "/Users/jleeman/anaconda/lib/python2.7/urllib2.py", line 531, in http_error_default
raise HTTPError(req.get_full_url(), code, msg, hdrs, fp)
HTTPError: HTTP Error 503: Service Unavailable
Traceback (most recent call last):
File "/Users/jleeman/anaconda/lib/python2.7/site-packages/obspy-0.9.2_844_gc415_dirty-py2.7-macosx-10.5-x86_64.egg/obspy/neries/tests/test_client.py", line 90, in test_getEventsWithUTCDateTimes
max_datetime=UTCDateTime("2005-01-01"))
File "/Users/jleeman/anaconda/lib/python2.7/site-packages/obspy-0.9.2_844_gc415_dirty-py2.7-macosx-10.5-x86_64.egg/obspy/neries/client.py", line 89, in wrapper
v = f(*args, **new_kwargs)
File "/Users/jleeman/anaconda/lib/python2.7/site-packages/obspy-0.9.2_844_gc415_dirty-py2.7-macosx-10.5-x86_64.egg/obspy/neries/client.py", line 292, in getEvents
data = self._fetch("/services/event/search", **kwargs)
File "/Users/jleeman/anaconda/lib/python2.7/site-packages/obspy-0.9.2_844_gc415_dirty-py2.7-macosx-10.5-x86_64.egg/obspy/neries/client.py", line 171, in _fetch
response = urllib.request.urlopen(remoteaddr, timeout=self.timeout)
File "/Users/jleeman/anaconda/lib/python2.7/urllib2.py", line 127, in urlopen
return _opener.open(url, data, timeout)
File "/Users/jleeman/anaconda/lib/python2.7/urllib2.py", line 410, in open
response = meth(req, response)
File "/Users/jleeman/anaconda/lib/python2.7/urllib2.py", line 523, in http_response
'http', request, response, code, msg, hdrs)
File "/Users/jleeman/anaconda/lib/python2.7/urllib2.py", line 448, in error
return self._call_chain(*args)
File "/Users/jleeman/anaconda/lib/python2.7/urllib2.py", line 382, in _call_chain
result = func(*args)
File "/Users/jleeman/anaconda/lib/python2.7/urllib2.py", line 531, in http_error_default
raise HTTPError(req.get_full_url(), code, msg, hdrs, fp)
HTTPError: HTTP Error 503: Service Unavailable
Traceback (most recent call last):
File "/Users/jleeman/anaconda/lib/python2.7/doctest.py", line 2226, in runTest
raise self.failureException(self.format_failure(new.getvalue()))
AssertionError: Failed doctest test for obspy.neries.client.Client.getEvents
File "/Users/jleeman/anaconda/lib/python2.7/site-packages/obspy-0.9.2_844_gc415_dirty-py2.7-macosx-10.5-x86_64.egg/obspy/neries/client.py", line 83, in getEvents
----------------------------------------------------------------------
File "/Users/jleeman/anaconda/lib/python2.7/site-packages/obspy-0.9.2_844_gc415_dirty-py2.7-macosx-10.5-x86_64.egg/obspy/neries/client.py", line 146, in obspy.neries.client.Client.getEvents
Failed example:
events = client.getEvents(min_datetime="2004-12-01",
max_datetime="2005-01-01",
min_magnitude=9, format="list")
Exception raised:
Traceback (most recent call last):
File "/Users/jleeman/anaconda/lib/python2.7/doctest.py", line 1315, in __run
compileflags, 1) in test.globs
File "<doctest obspy.neries.client.Client.getEvents[2]>", line 3, in <module>
min_magnitude=9, format="list")
File "/Users/jleeman/anaconda/lib/python2.7/site-packages/obspy-0.9.2_844_gc415_dirty-py2.7-macosx-10.5-x86_64.egg/obspy/neries/client.py", line 89, in wrapper
v = f(*args, **new_kwargs)
File "/Users/jleeman/anaconda/lib/python2.7/site-packages/obspy-0.9.2_844_gc415_dirty-py2.7-macosx-10.5-x86_64.egg/obspy/neries/client.py", line 292, in getEvents
data = self._fetch("/services/event/search", **kwargs)
File "/Users/jleeman/anaconda/lib/python2.7/site-packages/obspy-0.9.2_844_gc415_dirty-py2.7-macosx-10.5-x86_64.egg/obspy/neries/client.py", line 171, in _fetch
response = urllib.request.urlopen(remoteaddr, timeout=self.timeout)
File "/Users/jleeman/anaconda/lib/python2.7/urllib2.py", line 127, in urlopen
return _opener.open(url, data, timeout)
File "/Users/jleeman/anaconda/lib/python2.7/urllib2.py", line 410, in open
response = meth(req, response)
File "/Users/jleeman/anaconda/lib/python2.7/urllib2.py", line 523, in http_response
'http', request, response, code, msg, hdrs)
File "/Users/jleeman/anaconda/lib/python2.7/urllib2.py", line 448, in error
return self._call_chain(*args)
File "/Users/jleeman/anaconda/lib/python2.7/urllib2.py", line 382, in _call_chain
result = func(*args)
File "/Users/jleeman/anaconda/lib/python2.7/urllib2.py", line 531, in http_error_default
raise HTTPError(req.get_full_url(), code, msg, hdrs, fp)
HTTPError: HTTP Error 503: Service Unavailable
----------------------------------------------------------------------
File "/Users/jleeman/anaconda/lib/python2.7/site-packages/obspy-0.9.2_844_gc415_dirty-py2.7-macosx-10.5-x86_64.egg/obspy/neries/client.py", line 149, in obspy.neries.client.Client.getEvents
Failed example:
len(events)
Exception raised:
Traceback (most recent call last):
File "/Users/jleeman/anaconda/lib/python2.7/doctest.py", line 1315, in __run
compileflags, 1) in test.globs
File "<doctest obspy.neries.client.Client.getEvents[3]>", line 1, in <module>
len(events)
NameError: name 'events' is not defined
Traceback (most recent call last):
File "/Users/jleeman/anaconda/lib/python2.7/doctest.py", line 2226, in runTest
raise self.failureException(self.format_failure(new.getvalue()))
AssertionError: Failed doctest test for obspy.neries.client.Client.getLatestEvents
File "/Users/jleeman/anaconda/lib/python2.7/site-packages/obspy-0.9.2_844_gc415_dirty-py2.7-macosx-10.5-x86_64.egg/obspy/neries/client.py", line 301, in getLatestEvents
----------------------------------------------------------------------
File "/Users/jleeman/anaconda/lib/python2.7/site-packages/obspy-0.9.2_844_gc415_dirty-py2.7-macosx-10.5-x86_64.egg/obspy/neries/client.py", line 328, in obspy.neries.client.Client.getLatestEvents
Failed example:
events = client.getLatestEvents(num=5, format='list')
Exception raised:
Traceback (most recent call last):
File "/Users/jleeman/anaconda/lib/python2.7/doctest.py", line 1315, in __run
compileflags, 1) in test.globs
File "<doctest obspy.neries.client.Client.getLatestEvents[2]>", line 1, in <module>
events = client.getLatestEvents(num=5, format='list')
File "/Users/jleeman/anaconda/lib/python2.7/site-packages/obspy-0.9.2_844_gc415_dirty-py2.7-macosx-10.5-x86_64.egg/obspy/neries/client.py", line 357, in getLatestEvents
data = self._fetch("/services/event/latest", **kwargs)
File "/Users/jleeman/anaconda/lib/python2.7/site-packages/obspy-0.9.2_844_gc415_dirty-py2.7-macosx-10.5-x86_64.egg/obspy/neries/client.py", line 171, in _fetch
response = urllib.request.urlopen(remoteaddr, timeout=self.timeout)
File "/Users/jleeman/anaconda/lib/python2.7/urllib2.py", line 127, in urlopen
return _opener.open(url, data, timeout)
File "/Users/jleeman/anaconda/lib/python2.7/urllib2.py", line 410, in open
response = meth(req, response)
File "/Users/jleeman/anaconda/lib/python2.7/urllib2.py", line 523, in http_response
'http', request, response, code, msg, hdrs)
File "/Users/jleeman/anaconda/lib/python2.7/urllib2.py", line 448, in error
return self._call_chain(*args)
File "/Users/jleeman/anaconda/lib/python2.7/urllib2.py", line 382, in _call_chain
result = func(*args)
File "/Users/jleeman/anaconda/lib/python2.7/urllib2.py", line 531, in http_error_default
raise HTTPError(req.get_full_url(), code, msg, hdrs, fp)
HTTPError: HTTP Error 503: Service Unavailable
Traceback (most recent call last):
File "/Users/jleeman/anaconda/lib/python2.7/doctest.py", line 2226, in runTest
raise self.failureException(self.format_failure(new.getvalue()))
AssertionError: Failed doctest test for obspy.neries.__init__
File "/Users/jleeman/anaconda/lib/python2.7/site-packages/obspy-0.9.2_844_gc415_dirty-py2.7-macosx-10.5-x86_64.egg/obspy/neries/__init__.py", line 1, in __init__
----------------------------------------------------------------------
File "/Users/jleeman/anaconda/lib/python2.7/site-packages/obspy-0.9.2_844_gc415_dirty-py2.7-macosx-10.5-x86_64.egg/obspy/neries/__init__.py", line 25, in obspy.neries.__init__
Failed example:
events = client.getEvents(min_datetime="2004-01-01",
max_datetime="2005-01-01",
min_magnitude=9)
Exception raised:
Traceback (most recent call last):
File "/Users/jleeman/anaconda/lib/python2.7/doctest.py", line 1315, in __run
compileflags, 1) in test.globs
File "<doctest obspy.neries.__init__[2]>", line 3, in <module>
min_magnitude=9)
File "/Users/jleeman/anaconda/lib/python2.7/site-packages/obspy-0.9.2_844_gc415_dirty-py2.7-macosx-10.5-x86_64.egg/obspy/neries/client.py", line 89, in wrapper
v = f(*args, **new_kwargs)
File "/Users/jleeman/anaconda/lib/python2.7/site-packages/obspy-0.9.2_844_gc415_dirty-py2.7-macosx-10.5-x86_64.egg/obspy/neries/client.py", line 292, in getEvents
data = self._fetch("/services/event/search", **kwargs)
File "/Users/jleeman/anaconda/lib/python2.7/site-packages/obspy-0.9.2_844_gc415_dirty-py2.7-macosx-10.5-x86_64.egg/obspy/neries/client.py", line 171, in _fetch
response = urllib.request.urlopen(remoteaddr, timeout=self.timeout)
File "/Users/jleeman/anaconda/lib/python2.7/urllib2.py", line 127, in urlopen
return _opener.open(url, data, timeout)
File "/Users/jleeman/anaconda/lib/python2.7/urllib2.py", line 410, in open
response = meth(req, response)
File "/Users/jleeman/anaconda/lib/python2.7/urllib2.py", line 523, in http_response
'http', request, response, code, msg, hdrs)
File "/Users/jleeman/anaconda/lib/python2.7/urllib2.py", line 448, in error
return self._call_chain(*args)
File "/Users/jleeman/anaconda/lib/python2.7/urllib2.py", line 382, in _call_chain
result = func(*args)
File "/Users/jleeman/anaconda/lib/python2.7/urllib2.py", line 531, in http_error_default
raise HTTPError(req.get_full_url(), code, msg, hdrs, fp)
HTTPError: HTTP Error 503: Service Unavailable
----------------------------------------------------------------------
File "/Users/jleeman/anaconda/lib/python2.7/site-packages/obspy-0.9.2_844_gc415_dirty-py2.7-macosx-10.5-x86_64.egg/obspy/neries/__init__.py", line 28, in obspy.neries.__init__
Failed example:
len(events)
Exception raised:
Traceback (most recent call last):
File "/Users/jleeman/anaconda/lib/python2.7/doctest.py", line 1315, in __run
compileflags, 1) in test.globs
File "<doctest obspy.neries.__init__[3]>", line 1, in <module>
len(events)
NameError: name 'events' is not defined
----------------------------------------------------------------------
File "/Users/jleeman/anaconda/lib/python2.7/site-packages/obspy-0.9.2_844_gc415_dirty-py2.7-macosx-10.5-x86_64.egg/obspy/neries/__init__.py", line 41, in obspy.neries.__init__
Failed example:
events = client.getLatestEvents(num=5, format='list')
Exception raised:
Traceback (most recent call last):
File "/Users/jleeman/anaconda/lib/python2.7/doctest.py", line 1315, in __run
compileflags, 1) in test.globs
File "<doctest obspy.neries.__init__[7]>", line 1, in <module>
events = client.getLatestEvents(num=5, format='list')
File "/Users/jleeman/anaconda/lib/python2.7/site-packages/obspy-0.9.2_844_gc415_dirty-py2.7-macosx-10.5-x86_64.egg/obspy/neries/client.py", line 357, in getLatestEvents
data = self._fetch("/services/event/latest", **kwargs)
File "/Users/jleeman/anaconda/lib/python2.7/site-packages/obspy-0.9.2_844_gc415_dirty-py2.7-macosx-10.5-x86_64.egg/obspy/neries/client.py", line 171, in _fetch
response = urllib.request.urlopen(remoteaddr, timeout=self.timeout)
File "/Users/jleeman/anaconda/lib/python2.7/urllib2.py", line 127, in urlopen
return _opener.open(url, data, timeout)
File "/Users/jleeman/anaconda/lib/python2.7/urllib2.py", line 410, in open
response = meth(req, response)
File "/Users/jleeman/anaconda/lib/python2.7/urllib2.py", line 523, in http_response
'http', request, response, code, msg, hdrs)
File "/Users/jleeman/anaconda/lib/python2.7/urllib2.py", line 448, in error
return self._call_chain(*args)
File "/Users/jleeman/anaconda/lib/python2.7/urllib2.py", line 382, in _call_chain
result = func(*args)
File "/Users/jleeman/anaconda/lib/python2.7/urllib2.py", line 531, in http_error_default
raise HTTPError(req.get_full_url(), code, msg, hdrs, fp)
HTTPError: HTTP Error 503: Service Unavailable
----------------------------------------------------------------------
File "/Users/jleeman/anaconda/lib/python2.7/site-packages/obspy-0.9.2_844_gc415_dirty-py2.7-macosx-10.5-x86_64.egg/obspy/neries/__init__.py", line 55, in obspy.neries.__init__
Failed example:
result = client.getEventDetail("20041226_0000148", 'list')
Exception raised:
Traceback (most recent call last):
File "/Users/jleeman/anaconda/lib/python2.7/doctest.py", line 1315, in __run
compileflags, 1) in test.globs
File "<doctest obspy.neries.__init__[12]>", line 1, in <module>
result = client.getEventDetail("20041226_0000148", 'list')
File "/Users/jleeman/anaconda/lib/python2.7/site-packages/obspy-0.9.2_844_gc415_dirty-py2.7-macosx-10.5-x86_64.egg/obspy/neries/client.py", line 419, in getEventDetail
data = self._fetch("/services/event/detail", **kwargs)
File "/Users/jleeman/anaconda/lib/python2.7/site-packages/obspy-0.9.2_844_gc415_dirty-py2.7-macosx-10.5-x86_64.egg/obspy/neries/client.py", line 171, in _fetch
response = urllib.request.urlopen(remoteaddr, timeout=self.timeout)
File "/Users/jleeman/anaconda/lib/python2.7/urllib2.py", line 127, in urlopen
return _opener.open(url, data, timeout)
File "/Users/jleeman/anaconda/lib/python2.7/urllib2.py", line 410, in open
response = meth(req, response)
File "/Users/jleeman/anaconda/lib/python2.7/urllib2.py", line 523, in http_response
'http', request, response, code, msg, hdrs)
File "/Users/jleeman/anaconda/lib/python2.7/urllib2.py", line 448, in error
return self._call_chain(*args)
File "/Users/jleeman/anaconda/lib/python2.7/urllib2.py", line 382, in _call_chain
result = func(*args)
File "/Users/jleeman/anaconda/lib/python2.7/urllib2.py", line 531, in http_error_default
raise HTTPError(req.get_full_url(), code, msg, hdrs, fp)
HTTPError: HTTP Error 503: Service Unavailable
----------------------------------------------------------------------
File "/Users/jleeman/anaconda/lib/python2.7/site-packages/obspy-0.9.2_844_gc415_dirty-py2.7-macosx-10.5-x86_64.egg/obspy/neries/__init__.py", line 56, in obspy.neries.__init__
Failed example:
len(result) # Number of calculated origins
Exception raised:
Traceback (most recent call last):
File "/Users/jleeman/anaconda/lib/python2.7/doctest.py", line 1315, in __run
compileflags, 1) in test.globs
File "<doctest obspy.neries.__init__[13]>", line 1, in <module>
len(result) # Number of calculated origins
NameError: name 'result' is not defined
Traceback (most recent call last):
File "/Users/jleeman/anaconda/lib/python2.7/doctest.py", line 2226, in runTest
raise self.failureException(self.format_failure(new.getvalue()))
AssertionError: Failed doctest test for obspy.neries.client.Client.getEventDetail
File "/Users/jleeman/anaconda/lib/python2.7/site-packages/obspy-0.9.2_844_gc415_dirty-py2.7-macosx-10.5-x86_64.egg/obspy/neries/client.py", line 366, in getEventDetail
----------------------------------------------------------------------
File "/Users/jleeman/anaconda/lib/python2.7/site-packages/obspy-0.9.2_844_gc415_dirty-py2.7-macosx-10.5-x86_64.egg/obspy/neries/client.py", line 389, in obspy.neries.client.Client.getEventDetail
Failed example:
result = client.getEventDetail("19990817_0000001", 'list')
Exception raised:
Traceback (most recent call last):
File "/Users/jleeman/anaconda/lib/python2.7/doctest.py", line 1315, in __run
compileflags, 1) in test.globs
File "<doctest obspy.neries.client.Client.getEventDetail[2]>", line 1, in <module>
result = client.getEventDetail("19990817_0000001", 'list')
File "/Users/jleeman/anaconda/lib/python2.7/site-packages/obspy-0.9.2_844_gc415_dirty-py2.7-macosx-10.5-x86_64.egg/obspy/neries/client.py", line 419, in getEventDetail
data = self._fetch("/services/event/detail", **kwargs)
File "/Users/jleeman/anaconda/lib/python2.7/site-packages/obspy-0.9.2_844_gc415_dirty-py2.7-macosx-10.5-x86_64.egg/obspy/neries/client.py", line 171, in _fetch
response = urllib.request.urlopen(remoteaddr, timeout=self.timeout)
File "/Users/jleeman/anaconda/lib/python2.7/urllib2.py", line 127, in urlopen
return _opener.open(url, data, timeout)
File "/Users/jleeman/anaconda/lib/python2.7/urllib2.py", line 410, in open
response = meth(req, response)
File "/Users/jleeman/anaconda/lib/python2.7/urllib2.py", line 523, in http_response
'http', request, response, code, msg, hdrs)
File "/Users/jleeman/anaconda/lib/python2.7/urllib2.py", line 448, in error
return self._call_chain(*args)
File "/Users/jleeman/anaconda/lib/python2.7/urllib2.py", line 382, in _call_chain
result = func(*args)
File "/Users/jleeman/anaconda/lib/python2.7/urllib2.py", line 531, in http_error_default
raise HTTPError(req.get_full_url(), code, msg, hdrs, fp)
HTTPError: HTTP Error 503: Service Unavailable
----------------------------------------------------------------------
File "/Users/jleeman/anaconda/lib/python2.7/site-packages/obspy-0.9.2_844_gc415_dirty-py2.7-macosx-10.5-x86_64.egg/obspy/neries/client.py", line 390, in obspy.neries.client.Client.getEventDetail
Failed example:
len(result) # Number of calculated origins
Exception raised:
Traceback (most recent call last):
File "/Users/jleeman/anaconda/lib/python2.7/doctest.py", line 1315, in __run
compileflags, 1) in test.globs
File "<doctest obspy.neries.client.Client.getEventDetail[3]>", line 1, in <module>
len(result) # Number of calculated origins
NameError: name 'result' is not defined

Slowest Tests (20)

Runtime Test
150.686s getWaveform (obspy.earthworm.client.Client)
75.832s __init__ (obspy.earthworm)
52.810s __init__ (obspy.arclink)
44.419s test_getWaveform (obspy.arclink.tests.test_client.ClientTestCase)
34.280s test_getInventory (obspy.arclink.tests.test_client.ClientTestCase)
31.886s test_getRouting (obspy.arclink.tests.test_client.ClientTestCase)
24.917s test_getNetworks (obspy.arclink.tests.test_client.ClientTestCase)
23.169s getWaveform (obspy.neries.client.Client)
21.631s test_issue372 (obspy.arclink.tests.test_client.ClientTestCase)
19.827s __init__ (obspy.neries)
19.682s test_getInventoryTwice (obspy.arclink.tests.test_client.ClientTestCase)
18.964s test_getNotExistingWaveform (obspy.arclink.tests.test_client.ClientTestCase)
17.682s test_saveWaveformNoCompression (obspy.arclink.tests.test_client.ClientTestCase)
15.763s test_saveWaveform (obspy.neries.tests.test_client.ClientTestCase)
15.762s test_getWaveformWithMetadata (obspy.arclink.tests.test_client.ClientTestCase)
15.256s test_issue311 (obspy.arclink.tests.test_client.ClientTestCase)
14.612s test_plotComplexGapManySamples (obspy.imaging.tests.test_waveform.WaveformTestCase)
12.903s test_saveWaveformCompressed (obspy.arclink.tests.test_client.ClientTestCase)
12.181s test_dataselect_bulk (obspy.fdsn.tests.test_client.ClientTestCase)
11.090s test_delayedRequest (obspy.arclink.tests.test_client.ClientTestCase)

Chuck Norris Fact

Chuck Norris doesn't use Oracle, he is the Oracle.