#16582 Report by node Lassen covering 582 tests from 10 modules resulted into 57 errors

Report

ObsPy Version
0.8.4-dirty
Continuous Integration
-
GitHub Pull Request
-
Report File
XML Document
Total Runtime
16.0 sec
Report Date/Time
2014-08-14 17:46:27

System / Python

Architecture
64bit
Machine
AMD64
Node
Lassen
Processor
AMD64 Family 16 Model 4 Stepping 2, AuthenticAMD
Python Compiler
MSC v.1500 64 bit (AMD64)
Python Implementation
CPython
Python Version
2.7.7
Release
7
System
Windows
Version
6.1.7601

Dependencies

lxml.etree
3.3.5
matplotlib
1.3.1
mpl_toolkits.basemap
1.0.7
numpy
1.8.2
scipy
0.14.0
sqlalchemy
0.9.4
suds
0.4

Modules (10)

Module Errors /
Failures
Tracebacks
obspy.arclink Not tested -
obspy.core 27 1 2 3 4 5 6 7 8 9 10 11 12 13 14 15 16 17 18 19 20 21 22 23 24 25 26 27
obspy.datamark 1 28
obspy.db - -
obspy.earthworm Not tested -
obspy.gse2 Not tested -
obspy.imaging - -
obspy.iris Not tested -
obspy.mseed Not tested -
obspy.neries Not tested -
obspy.realtime Not tested -
obspy.sac 15 29 30 31 32 33 34 35 36 37 38 39 40 41 42 43
obspy.seedlink Not tested -
obspy.seg2 - -
obspy.segy Not tested -
obspy.seisan 2 44 45
obspy.seishub Not tested -
obspy.sh 5 46 47 48 49 50
obspy.signal Not tested -
obspy.taup Not tested -
obspy.wav 6 51 52 53 54 55 56
obspy.xseed 1 57
Summary 57 57

Tracebacks (57)

Traceback (most recent call last):
File "C:\Anaconda\lib\site-packages\obspy-0.8.4_dirty-py2.7.egg\obspy\core\tests\test_stream.py", line 1561, in test_integrateAndDifferentiate
st1.filter('lowpass', freq=1.0)
File "C:\Anaconda\lib\site-packages\obspy-0.8.4_dirty-py2.7.egg\obspy\core\stream.py", line 1826, in filter
tr.filter(type, **options)
File "C:\Anaconda\lib\site-packages\obspy-0.8.4_dirty-py2.7.egg\obspy\core\trace.py", line 1218, in filter
func = _getFunctionFromEntryPoint('filter', type)
File "C:\Anaconda\lib\site-packages\obspy-0.8.4_dirty-py2.7.egg\obspy\core\util\base.py", line 351, in _getFunctionFromEntryPoint
'obspy.plugin.%s' % (group), entry_point.name)
File "build\bdist.win-amd64\egg\pkg_resources.py", line 337, in load_entry_point
return get_distribution(dist).load_entry_point(group, name)
File "build\bdist.win-amd64\egg\pkg_resources.py", line 2281, in load_entry_point
return ep.load()
File "build\bdist.win-amd64\egg\pkg_resources.py", line 1991, in load
entry = __import__(self.module_name, globals(),globals(), ['__name__'])
File "C:\Anaconda\lib\site-packages\obspy-0.8.4_dirty-py2.7.egg\obspy\signal\__init__.py", line 189, in <module>
from trigger import recSTALTA, recSTALTAPy, carlSTATrig, classicSTALTA, \
File "C:\Anaconda\lib\site-packages\obspy-0.8.4_dirty-py2.7.egg\obspy\signal\trigger.py", line 32, in <module>
from obspy.signal.headers import clibsignal, head_stalta_t
File "C:\Anaconda\lib\site-packages\obspy-0.8.4_dirty-py2.7.egg\obspy\signal\headers.py", line 35, in <module>
raise ImportError(msg)
ImportError: Could not load shared library for obspy.signal.
[Error 126] The specified module could not be found
Traceback (most recent call last):
File "C:\Anaconda\lib\site-packages\obspy-0.8.4_dirty-py2.7.egg\obspy\core\tests\test_stream.py", line 1614, in test_readArguments
tr = read('http://examples.obspy.org/test.sac', dtype='int32')[0]
File "C:\Anaconda\lib\site-packages\obspy-0.8.4_dirty-py2.7.egg\obspy\core\stream.py", line 241, in read
st.extend(_read(fh.name, format, headonly, **kwargs).traces)
File "C:\Anaconda\lib\site-packages\obspy-0.8.4_dirty-py2.7.egg\obspy\core\util\decorator.py", line 151, in wrapped_func
result = func(filename, *args, **kwargs)
File "C:\Anaconda\lib\site-packages\obspy-0.8.4_dirty-py2.7.egg\obspy\core\stream.py", line 288, in _read
headonly=headonly, **kwargs)
File "C:\Anaconda\lib\site-packages\obspy-0.8.4_dirty-py2.7.egg\obspy\core\util\base.py", line 390, in _readFromPlugin
'isFormat')
File "build\bdist.win-amd64\egg\pkg_resources.py", line 337, in load_entry_point
return get_distribution(dist).load_entry_point(group, name)
File "build\bdist.win-amd64\egg\pkg_resources.py", line 2281, in load_entry_point
return ep.load()
File "build\bdist.win-amd64\egg\pkg_resources.py", line 1991, in load
entry = __import__(self.module_name, globals(),globals(), ['__name__'])
File "C:\Anaconda\lib\site-packages\obspy-0.8.4_dirty-py2.7.egg\obspy\mseed\core.py", line 6, in <module>
from headers import clibmseed, ENCODINGS, HPTMODULUS, SAMPLETYPE, DATATYPES, \
File "C:\Anaconda\lib\site-packages\obspy-0.8.4_dirty-py2.7.egg\obspy\mseed\headers.py", line 39, in <module>
raise ImportError(msg)
ImportError: Could not load shared library for obspy.mseed.
[Error 126] The specified module could not be found
Traceback (most recent call last):
File "C:\Anaconda\lib\site-packages\obspy-0.8.4_dirty-py2.7.egg\obspy\core\tests\test_stream.py", line 1204, in test_readWritePickle
st2 = read(tmpfile2)
File "C:\Anaconda\lib\site-packages\obspy-0.8.4_dirty-py2.7.egg\obspy\core\stream.py", line 247, in read
st.extend(_read(file, format, headonly, **kwargs).traces)
File "C:\Anaconda\lib\site-packages\obspy-0.8.4_dirty-py2.7.egg\obspy\core\util\decorator.py", line 151, in wrapped_func
result = func(filename, *args, **kwargs)
File "C:\Anaconda\lib\site-packages\obspy-0.8.4_dirty-py2.7.egg\obspy\core\stream.py", line 288, in _read
headonly=headonly, **kwargs)
File "C:\Anaconda\lib\site-packages\obspy-0.8.4_dirty-py2.7.egg\obspy\core\util\base.py", line 390, in _readFromPlugin
'isFormat')
File "build\bdist.win-amd64\egg\pkg_resources.py", line 337, in load_entry_point
return get_distribution(dist).load_entry_point(group, name)
File "build\bdist.win-amd64\egg\pkg_resources.py", line 2281, in load_entry_point
return ep.load()
File "build\bdist.win-amd64\egg\pkg_resources.py", line 1991, in load
entry = __import__(self.module_name, globals(),globals(), ['__name__'])
File "C:\Anaconda\lib\site-packages\obspy-0.8.4_dirty-py2.7.egg\obspy\mseed\core.py", line 6, in <module>
from headers import clibmseed, ENCODINGS, HPTMODULUS, SAMPLETYPE, DATATYPES, \
File "C:\Anaconda\lib\site-packages\obspy-0.8.4_dirty-py2.7.egg\obspy\mseed\headers.py", line 39, in <module>
raise ImportError(msg)
ImportError: Could not load shared library for obspy.mseed.
[Error 126] The specified module could not be found
Traceback (most recent call last):
File "C:\Anaconda\lib\site-packages\obspy-0.8.4_dirty-py2.7.egg\obspy\core\tests\test_stream.py", line 1677, in test_rotate
st.rotate(method='NE->RT', back_azimuth=30)
File "C:\Anaconda\lib\site-packages\obspy-0.8.4_dirty-py2.7.egg\obspy\core\stream.py", line 2256, in rotate
func = _getFunctionFromEntryPoint("rotate", func)
File "C:\Anaconda\lib\site-packages\obspy-0.8.4_dirty-py2.7.egg\obspy\core\util\base.py", line 351, in _getFunctionFromEntryPoint
'obspy.plugin.%s' % (group), entry_point.name)
File "build\bdist.win-amd64\egg\pkg_resources.py", line 337, in load_entry_point
return get_distribution(dist).load_entry_point(group, name)
File "build\bdist.win-amd64\egg\pkg_resources.py", line 2281, in load_entry_point
return ep.load()
File "build\bdist.win-amd64\egg\pkg_resources.py", line 1991, in load
entry = __import__(self.module_name, globals(),globals(), ['__name__'])
File "C:\Anaconda\lib\site-packages\obspy-0.8.4_dirty-py2.7.egg\obspy\signal\__init__.py", line 189, in <module>
from trigger import recSTALTA, recSTALTAPy, carlSTATrig, classicSTALTA, \
File "C:\Anaconda\lib\site-packages\obspy-0.8.4_dirty-py2.7.egg\obspy\signal\trigger.py", line 32, in <module>
from obspy.signal.headers import clibsignal, head_stalta_t
File "C:\Anaconda\lib\site-packages\obspy-0.8.4_dirty-py2.7.egg\obspy\signal\headers.py", line 35, in <module>
raise ImportError(msg)
ImportError: Could not load shared library for obspy.signal.
[Error 126] The specified module could not be found
Traceback (most recent call last):
File "C:\Anaconda\lib\site-packages\obspy-0.8.4_dirty-py2.7.egg\obspy\core\tests\test_trace.py", line 941, in test_detrend
tr.detrend(type='simple')
File "C:\Anaconda\lib\site-packages\obspy-0.8.4_dirty-py2.7.egg\obspy\core\trace.py", line 1619, in detrend
func = _getFunctionFromEntryPoint('detrend', type)
File "C:\Anaconda\lib\site-packages\obspy-0.8.4_dirty-py2.7.egg\obspy\core\util\base.py", line 351, in _getFunctionFromEntryPoint
'obspy.plugin.%s' % (group), entry_point.name)
File "build\bdist.win-amd64\egg\pkg_resources.py", line 337, in load_entry_point
return get_distribution(dist).load_entry_point(group, name)
File "build\bdist.win-amd64\egg\pkg_resources.py", line 2281, in load_entry_point
return ep.load()
File "build\bdist.win-amd64\egg\pkg_resources.py", line 1991, in load
entry = __import__(self.module_name, globals(),globals(), ['__name__'])
File "C:\Anaconda\lib\site-packages\obspy-0.8.4_dirty-py2.7.egg\obspy\signal\__init__.py", line 189, in <module>
from trigger import recSTALTA, recSTALTAPy, carlSTATrig, classicSTALTA, \
File "C:\Anaconda\lib\site-packages\obspy-0.8.4_dirty-py2.7.egg\obspy\signal\trigger.py", line 32, in <module>
from obspy.signal.headers import clibsignal, head_stalta_t
File "C:\Anaconda\lib\site-packages\obspy-0.8.4_dirty-py2.7.egg\obspy\signal\headers.py", line 35, in <module>
raise ImportError(msg)
ImportError: Could not load shared library for obspy.signal.
[Error 126] The specified module could not be found
Traceback (most recent call last):
File "C:\Anaconda\lib\site-packages\obspy-0.8.4_dirty-py2.7.egg\obspy\core\tests\test_trace.py", line 1058, in test_taper
tr.taper()
File "C:\Anaconda\lib\site-packages\obspy-0.8.4_dirty-py2.7.egg\obspy\core\trace.py", line 1702, in taper
func = _getFunctionFromEntryPoint('taper', type)
File "C:\Anaconda\lib\site-packages\obspy-0.8.4_dirty-py2.7.egg\obspy\core\util\base.py", line 351, in _getFunctionFromEntryPoint
'obspy.plugin.%s' % (group), entry_point.name)
File "build\bdist.win-amd64\egg\pkg_resources.py", line 337, in load_entry_point
return get_distribution(dist).load_entry_point(group, name)
File "build\bdist.win-amd64\egg\pkg_resources.py", line 2281, in load_entry_point
return ep.load()
File "build\bdist.win-amd64\egg\pkg_resources.py", line 1991, in load
entry = __import__(self.module_name, globals(),globals(), ['__name__'])
File "C:\Anaconda\lib\site-packages\obspy-0.8.4_dirty-py2.7.egg\obspy\signal\__init__.py", line 189, in <module>
from trigger import recSTALTA, recSTALTAPy, carlSTATrig, classicSTALTA, \
File "C:\Anaconda\lib\site-packages\obspy-0.8.4_dirty-py2.7.egg\obspy\signal\trigger.py", line 32, in <module>
from obspy.signal.headers import clibsignal, head_stalta_t
File "C:\Anaconda\lib\site-packages\obspy-0.8.4_dirty-py2.7.egg\obspy\signal\headers.py", line 35, in <module>
raise ImportError(msg)
ImportError: Could not load shared library for obspy.signal.
[Error 126] The specified module could not be found
Traceback (most recent call last):
File "C:\Anaconda\lib\site-packages\obspy-0.8.4_dirty-py2.7.egg\obspy\core\tests\test_waveform_plugins.py", line 151, in test_isFormat
'isFormat')
File "build\bdist.win-amd64\egg\pkg_resources.py", line 337, in load_entry_point
return get_distribution(dist).load_entry_point(group, name)
File "build\bdist.win-amd64\egg\pkg_resources.py", line 2281, in load_entry_point
return ep.load()
File "build\bdist.win-amd64\egg\pkg_resources.py", line 1991, in load
entry = __import__(self.module_name, globals(),globals(), ['__name__'])
File "C:\Anaconda\lib\site-packages\obspy-0.8.4_dirty-py2.7.egg\obspy\gse2\core.py", line 7, in <module>
from obspy.gse2 import libgse2, libgse1
File "C:\Anaconda\lib\site-packages\obspy-0.8.4_dirty-py2.7.egg\obspy\gse2\libgse2.py", line 60, in <module>
raise ImportError(msg)
ImportError: Could not load shared library for obspy.gse2.
[Error 126] The specified module could not be found
Traceback (most recent call last):
File "C:\Anaconda\lib\site-packages\obspy-0.8.4_dirty-py2.7.egg\obspy\core\tests\test_waveform_plugins.py", line 272, in test_issue193
tr.write(tempfile, format)
File "C:\Anaconda\lib\site-packages\obspy-0.8.4_dirty-py2.7.egg\obspy\core\trace.py", line 805, in write
Stream([self]).write(filename, format, **kwargs)
File "C:\Anaconda\lib\site-packages\obspy-0.8.4_dirty-py2.7.egg\obspy\core\stream.py", line 1278, in write
', '.join(ENTRY_POINTS['waveform_write'])))
TypeError: Writing format "MSEED" is not supported. Supported types: MSEED, SAC, GSE2, SACXY, Q, SH_ASC, SLIST, TSPAIR, SEGY, SU, SEG2, WAV, PICKLE
Traceback (most recent call last):
File "C:\Anaconda\lib\site-packages\obspy-0.8.4_dirty-py2.7.egg\obspy\core\tests\test_waveform_plugins.py", line 34, in test_raiseOnEmptyFile
'isFormat')
File "build\bdist.win-amd64\egg\pkg_resources.py", line 337, in load_entry_point
return get_distribution(dist).load_entry_point(group, name)
File "build\bdist.win-amd64\egg\pkg_resources.py", line 2281, in load_entry_point
return ep.load()
File "build\bdist.win-amd64\egg\pkg_resources.py", line 1991, in load
entry = __import__(self.module_name, globals(),globals(), ['__name__'])
File "C:\Anaconda\lib\site-packages\obspy-0.8.4_dirty-py2.7.egg\obspy\gse2\core.py", line 7, in <module>
from obspy.gse2 import libgse2, libgse1
File "C:\Anaconda\lib\site-packages\obspy-0.8.4_dirty-py2.7.egg\obspy\gse2\libgse2.py", line 60, in <module>
raise ImportError(msg)
ImportError: Could not load shared library for obspy.gse2.
[Error 126] The specified module could not be found
Traceback (most recent call last):
File "C:\Anaconda\lib\site-packages\obspy-0.8.4_dirty-py2.7.egg\obspy\core\tests\test_waveform_plugins.py", line 309, in test_raiseOnUnknownFormat
self.assertRaises(TypeError, read, tmpfile)
File "C:\Anaconda\lib\unittest\case.py", line 473, in assertRaises
callableObj(*args, **kwargs)
File "C:\Anaconda\lib\site-packages\obspy-0.8.4_dirty-py2.7.egg\obspy\core\stream.py", line 247, in read
st.extend(_read(file, format, headonly, **kwargs).traces)
File "C:\Anaconda\lib\site-packages\obspy-0.8.4_dirty-py2.7.egg\obspy\core\util\decorator.py", line 151, in wrapped_func
result = func(filename, *args, **kwargs)
File "C:\Anaconda\lib\site-packages\obspy-0.8.4_dirty-py2.7.egg\obspy\core\stream.py", line 288, in _read
headonly=headonly, **kwargs)
File "C:\Anaconda\lib\site-packages\obspy-0.8.4_dirty-py2.7.egg\obspy\core\util\base.py", line 390, in _readFromPlugin
'isFormat')
File "build\bdist.win-amd64\egg\pkg_resources.py", line 337, in load_entry_point
return get_distribution(dist).load_entry_point(group, name)
File "build\bdist.win-amd64\egg\pkg_resources.py", line 2281, in load_entry_point
return ep.load()
File "build\bdist.win-amd64\egg\pkg_resources.py", line 1991, in load
entry = __import__(self.module_name, globals(),globals(), ['__name__'])
File "C:\Anaconda\lib\site-packages\obspy-0.8.4_dirty-py2.7.egg\obspy\mseed\core.py", line 6, in <module>
from headers import clibmseed, ENCODINGS, HPTMODULUS, SAMPLETYPE, DATATYPES, \
File "C:\Anaconda\lib\site-packages\obspy-0.8.4_dirty-py2.7.egg\obspy\mseed\headers.py", line 39, in <module>
raise ImportError(msg)
ImportError: Could not load shared library for obspy.mseed.
[Error 126] The specified module could not be found
Traceback (most recent call last):
File "C:\Anaconda\lib\doctest.py", line 2226, in runTest
raise self.failureException(self.format_failure(new.getvalue()))
AssertionError: Failed doctest test for obspy.core.trace.Trace.simulate
File "C:\Anaconda\lib\site-packages\obspy-0.8.4_dirty-py2.7.egg\obspy\core\trace.py", line 1049, in simulate
----------------------------------------------------------------------
File "C:\Anaconda\lib\site-packages\obspy-0.8.4_dirty-py2.7.egg\obspy\core\trace.py", line 1102, in obspy.core.trace.Trace.simulate
Failed example:
from obspy.signal import cornFreq2Paz
Exception raised:
Traceback (most recent call last):
File "C:\Anaconda\lib\doctest.py", line 1315, in __run
compileflags, 1) in test.globs
File "<doctest obspy.core.trace.Trace.simulate[1]>", line 1, in <module>
from obspy.signal import cornFreq2Paz
File "C:\Anaconda\lib\site-packages\obspy-0.8.4_dirty-py2.7.egg\obspy\signal\__init__.py", line 189, in <module>
from trigger import recSTALTA, recSTALTAPy, carlSTATrig, classicSTALTA, \
File "C:\Anaconda\lib\site-packages\obspy-0.8.4_dirty-py2.7.egg\obspy\signal\trigger.py", line 32, in <module>
from obspy.signal.headers import clibsignal, head_stalta_t
File "C:\Anaconda\lib\site-packages\obspy-0.8.4_dirty-py2.7.egg\obspy\signal\headers.py", line 35, in <module>
raise ImportError(msg)
ImportError: Could not load shared library for obspy.signal.
[Error 126] The specified module could not be found
----------------------------------------------------------------------
File "C:\Anaconda\lib\site-packages\obspy-0.8.4_dirty-py2.7.egg\obspy\core\trace.py", line 1112, in obspy.core.trace.Trace.simulate
Failed example:
paz_1hz = cornFreq2Paz(1.0, damp=0.707)
Exception raised:
Traceback (most recent call last):
File "C:\Anaconda\lib\doctest.py", line 1315, in __run
compileflags, 1) in test.globs
File "<doctest obspy.core.trace.Trace.simulate[6]>", line 1, in <module>
paz_1hz = cornFreq2Paz(1.0, damp=0.707)
NameError: name 'cornFreq2Paz' is not defined
----------------------------------------------------------------------
File "C:\Anaconda\lib\site-packages\obspy-0.8.4_dirty-py2.7.egg\obspy\core\trace.py", line 1113, in obspy.core.trace.Trace.simulate
Failed example:
paz_1hz['sensitivity'] = 1.0
Exception raised:
Traceback (most recent call last):
File "C:\Anaconda\lib\doctest.py", line 1315, in __run
compileflags, 1) in test.globs
File "<doctest obspy.core.trace.Trace.simulate[7]>", line 1, in <module>
paz_1hz['sensitivity'] = 1.0
NameError: name 'paz_1hz' is not defined
----------------------------------------------------------------------
File "C:\Anaconda\lib\site-packages\obspy-0.8.4_dirty-py2.7.egg\obspy\core\trace.py", line 1114, in obspy.core.trace.Trace.simulate
Failed example:
tr.simulate(paz_remove=paz_sts2, paz_simulate=paz_1hz)
Exception raised:
Traceback (most recent call last):
File "C:\Anaconda\lib\doctest.py", line 1315, in __run
compileflags, 1) in test.globs
File "<doctest obspy.core.trace.Trace.simulate[8]>", line 1, in <module>
tr.simulate(paz_remove=paz_sts2, paz_simulate=paz_1hz)
NameError: name 'paz_1hz' is not defined
Traceback (most recent call last):
File "C:\Anaconda\lib\doctest.py", line 2226, in runTest
raise self.failureException(self.format_failure(new.getvalue()))
AssertionError: Failed doctest test for obspy.core.trace.Trace.filter
File "C:\Anaconda\lib\site-packages\obspy-0.8.4_dirty-py2.7.egg\obspy\core\trace.py", line 1155, in filter
----------------------------------------------------------------------
File "C:\Anaconda\lib\site-packages\obspy-0.8.4_dirty-py2.7.egg\obspy\core\trace.py", line 1205, in obspy.core.trace.Trace.filter
Failed example:
tr.filter("highpass", freq=1.0)
Exception raised:
Traceback (most recent call last):
File "C:\Anaconda\lib\doctest.py", line 1315, in __run
compileflags, 1) in test.globs
File "<doctest obspy.core.trace.Trace.filter[3]>", line 1, in <module>
tr.filter("highpass", freq=1.0)
File "C:\Anaconda\lib\site-packages\obspy-0.8.4_dirty-py2.7.egg\obspy\core\trace.py", line 1218, in filter
func = _getFunctionFromEntryPoint('filter', type)
File "C:\Anaconda\lib\site-packages\obspy-0.8.4_dirty-py2.7.egg\obspy\core\util\base.py", line 351, in _getFunctionFromEntryPoint
'obspy.plugin.%s' % (group), entry_point.name)
File "build\bdist.win-amd64\egg\pkg_resources.py", line 337, in load_entry_point
return get_distribution(dist).load_entry_point(group, name)
File "build\bdist.win-amd64\egg\pkg_resources.py", line 2281, in load_entry_point
return ep.load()
File "build\bdist.win-amd64\egg\pkg_resources.py", line 1991, in load
entry = __import__(self.module_name, globals(),globals(), ['__name__'])
File "C:\Anaconda\lib\site-packages\obspy-0.8.4_dirty-py2.7.egg\obspy\signal\__init__.py", line 189, in <module>
from trigger import recSTALTA, recSTALTAPy, carlSTATrig, classicSTALTA, \
File "C:\Anaconda\lib\site-packages\obspy-0.8.4_dirty-py2.7.egg\obspy\signal\trigger.py", line 32, in <module>
from obspy.signal.headers import clibsignal, head_stalta_t
File "C:\Anaconda\lib\site-packages\obspy-0.8.4_dirty-py2.7.egg\obspy\signal\headers.py", line 35, in <module>
raise ImportError(msg)
ImportError: Could not load shared library for obspy.signal.
[Error 126] The specified module could not be found
Traceback (most recent call last):
File "C:\Anaconda\lib\doctest.py", line 2226, in runTest
raise self.failureException(self.format_failure(new.getvalue()))
AssertionError: Failed doctest test for obspy.core.trace.Trace.decimate
File "C:\Anaconda\lib\site-packages\obspy-0.8.4_dirty-py2.7.egg\obspy\core\trace.py", line 1378, in decimate
----------------------------------------------------------------------
File "C:\Anaconda\lib\site-packages\obspy-0.8.4_dirty-py2.7.egg\obspy\core\trace.py", line 1422, in obspy.core.trace.Trace.decimate
Failed example:
tr.decimate(4, strict_length=False, no_filter=True)
Exception raised:
Traceback (most recent call last):
File "C:\Anaconda\lib\doctest.py", line 1315, in __run
compileflags, 1) in test.globs
File "<doctest obspy.core.trace.Trace.decimate[3]>", line 1, in <module>
tr.decimate(4, strict_length=False, no_filter=True)
File "C:\Anaconda\lib\site-packages\obspy-0.8.4_dirty-py2.7.egg\obspy\core\trace.py", line 1445, in decimate
from obspy.signal import integerDecimation
File "C:\Anaconda\lib\site-packages\obspy-0.8.4_dirty-py2.7.egg\obspy\signal\__init__.py", line 189, in <module>
from trigger import recSTALTA, recSTALTAPy, carlSTATrig, classicSTALTA, \
File "C:\Anaconda\lib\site-packages\obspy-0.8.4_dirty-py2.7.egg\obspy\signal\trigger.py", line 32, in <module>
from obspy.signal.headers import clibsignal, head_stalta_t
File "C:\Anaconda\lib\site-packages\obspy-0.8.4_dirty-py2.7.egg\obspy\signal\headers.py", line 35, in <module>
raise ImportError(msg)
ImportError: Could not load shared library for obspy.signal.
[Error 126] The specified module could not be found
----------------------------------------------------------------------
File "C:\Anaconda\lib\site-packages\obspy-0.8.4_dirty-py2.7.egg\obspy\core\trace.py", line 1423, in obspy.core.trace.Trace.decimate
Failed example:
tr.stats.sampling_rate
Expected:
0.25
Got:
1.0
----------------------------------------------------------------------
File "C:\Anaconda\lib\site-packages\obspy-0.8.4_dirty-py2.7.egg\obspy\core\trace.py", line 1425, in obspy.core.trace.Trace.decimate
Failed example:
tr.data
Expected:
array([0, 4, 8])
Got:
array([0, 1, 2, 3, 4, 5, 6, 7, 8, 9])
Traceback (most recent call last):
File "C:\Anaconda\lib\doctest.py", line 2226, in runTest
raise self.failureException(self.format_failure(new.getvalue()))
AssertionError: Failed doctest test for obspy.core.stream.read
File "C:\Anaconda\lib\site-packages\obspy-0.8.4_dirty-py2.7.egg\obspy\core\stream.py", line 31, in read
----------------------------------------------------------------------
File "C:\Anaconda\lib\site-packages\obspy-0.8.4_dirty-py2.7.egg\obspy\core\stream.py", line 153, in obspy.core.stream.read
Failed example:
st = read("/path/to/loc_RJOB20050831023349.z", format="GSE2")
Exception raised:
Traceback (most recent call last):
File "C:\Anaconda\lib\doctest.py", line 1315, in __run
compileflags, 1) in test.globs
File "<doctest obspy.core.stream.read[7]>", line 1, in <module>
st = read("/path/to/loc_RJOB20050831023349.z", format="GSE2")
File "C:\Anaconda\lib\site-packages\obspy-0.8.4_dirty-py2.7.egg\obspy\core\stream.py", line 247, in read
st.extend(_read(file, format, headonly, **kwargs).traces)
File "C:\Anaconda\lib\site-packages\obspy-0.8.4_dirty-py2.7.egg\obspy\core\util\decorator.py", line 151, in wrapped_func
result = func(filename, *args, **kwargs)
File "C:\Anaconda\lib\site-packages\obspy-0.8.4_dirty-py2.7.egg\obspy\core\stream.py", line 288, in _read
headonly=headonly, **kwargs)
File "C:\Anaconda\lib\site-packages\obspy-0.8.4_dirty-py2.7.egg\obspy\core\util\base.py", line 411, in _readFromPlugin
raise TypeError(msg % (format_ep.name, ', '.join(EPS)))
TypeError: Format "GSE2" is not supported. Supported types: MSEED, SAC, GSE2, SEISAN, SACXY, GSE1, Q, SH_ASC, SLIST, TSPAIR, SEGY, SU, SEG2, WAV, PICKLE, DATAMARK
----------------------------------------------------------------------
File "C:\Anaconda\lib\site-packages\obspy-0.8.4_dirty-py2.7.egg\obspy\core\stream.py", line 154, in obspy.core.stream.read
Failed example:
print(st) # doctest: +ELLIPSIS
Expected:
1 Trace(s) in Stream:
.RJOB..Z | 2005-08-31T02:33:49.849998Z - ... | 200.0 Hz, 12000 samples
Got:
3 Trace(s) in Stream:
BW.RJOB..EHZ | 2009-08-24T00:20:03.000000Z - 2009-08-24T00:20:32.990000Z | 100.0 Hz, 3000 samples
BW.RJOB..EHN | 2009-08-24T00:20:03.000000Z - 2009-08-24T00:20:32.990000Z | 100.0 Hz, 3000 samples
BW.RJOB..EHE | 2009-08-24T00:20:03.000000Z - 2009-08-24T00:20:32.990000Z | 100.0 Hz, 3000 samples
----------------------------------------------------------------------
File "C:\Anaconda\lib\site-packages\obspy-0.8.4_dirty-py2.7.egg\obspy\core\stream.py", line 161, in obspy.core.stream.read
Failed example:
st = read("http://examples.obspy.org/loc_RJOB20050831023349.z")
Exception raised:
Traceback (most recent call last):
File "C:\Anaconda\lib\doctest.py", line 1315, in __run
compileflags, 1) in test.globs
File "<doctest obspy.core.stream.read[10]>", line 1, in <module>
st = read("http://examples.obspy.org/loc_RJOB20050831023349.z")
File "C:\Anaconda\lib\site-packages\obspy-0.8.4_dirty-py2.7.egg\obspy\core\stream.py", line 241, in read
st.extend(_read(fh.name, format, headonly, **kwargs).traces)
File "C:\Anaconda\lib\site-packages\obspy-0.8.4_dirty-py2.7.egg\obspy\core\util\decorator.py", line 151, in wrapped_func
result = func(filename, *args, **kwargs)
File "C:\Anaconda\lib\site-packages\obspy-0.8.4_dirty-py2.7.egg\obspy\core\stream.py", line 288, in _read
headonly=headonly, **kwargs)
File "C:\Anaconda\lib\site-packages\obspy-0.8.4_dirty-py2.7.egg\obspy\core\util\base.py", line 390, in _readFromPlugin
'isFormat')
File "build\bdist.win-amd64\egg\pkg_resources.py", line 337, in load_entry_point
return get_distribution(dist).load_entry_point(group, name)
File "build\bdist.win-amd64\egg\pkg_resources.py", line 2281, in load_entry_point
return ep.load()
File "build\bdist.win-amd64\egg\pkg_resources.py", line 1991, in load
entry = __import__(self.module_name, globals(),globals(), ['__name__'])
File "C:\Anaconda\lib\site-packages\obspy-0.8.4_dirty-py2.7.egg\obspy\mseed\core.py", line 6, in <module>
from headers import clibmseed, ENCODINGS, HPTMODULUS, SAMPLETYPE, DATATYPES, \
File "C:\Anaconda\lib\site-packages\obspy-0.8.4_dirty-py2.7.egg\obspy\mseed\headers.py", line 39, in <module>
raise ImportError(msg)
ImportError: Could not load shared library for obspy.mseed.
[Error 126] The specified module could not be found
----------------------------------------------------------------------
File "C:\Anaconda\lib\site-packages\obspy-0.8.4_dirty-py2.7.egg\obspy\core\stream.py", line 162, in obspy.core.stream.read
Failed example:
print(st) # doctest: +ELLIPSIS
Expected:
1 Trace(s) in Stream:
.RJOB..Z | 2005-08-31T02:33:49.849998Z - ... | 200.0 Hz, 12000 samples
Got:
3 Trace(s) in Stream:
BW.RJOB..EHZ | 2009-08-24T00:20:03.000000Z - 2009-08-24T00:20:32.990000Z | 100.0 Hz, 3000 samples
BW.RJOB..EHN | 2009-08-24T00:20:03.000000Z - 2009-08-24T00:20:32.990000Z | 100.0 Hz, 3000 samples
BW.RJOB..EHE | 2009-08-24T00:20:03.000000Z - 2009-08-24T00:20:32.990000Z | 100.0 Hz, 3000 samples
----------------------------------------------------------------------
File "C:\Anaconda\lib\site-packages\obspy-0.8.4_dirty-py2.7.egg\obspy\core\stream.py", line 169, in obspy.core.stream.read
Failed example:
st = read("/path/to/tspair.ascii.gz")
Exception raised:
Traceback (most recent call last):
File "C:\Anaconda\lib\doctest.py", line 1315, in __run
compileflags, 1) in test.globs
File "<doctest obspy.core.stream.read[13]>", line 1, in <module>
st = read("/path/to/tspair.ascii.gz")
File "C:\Anaconda\lib\site-packages\obspy-0.8.4_dirty-py2.7.egg\obspy\core\stream.py", line 247, in read
st.extend(_read(file, format, headonly, **kwargs).traces)
File "C:\Anaconda\lib\site-packages\obspy-0.8.4_dirty-py2.7.egg\obspy\core\util\decorator.py", line 138, in wrapped_func
result = func(tempfile.name, *args, **kwargs)
File "C:\Anaconda\lib\site-packages\obspy-0.8.4_dirty-py2.7.egg\obspy\core\stream.py", line 288, in _read
headonly=headonly, **kwargs)
File "C:\Anaconda\lib\site-packages\obspy-0.8.4_dirty-py2.7.egg\obspy\core\util\base.py", line 390, in _readFromPlugin
'isFormat')
File "build\bdist.win-amd64\egg\pkg_resources.py", line 337, in load_entry_point
return get_distribution(dist).load_entry_point(group, name)
File "build\bdist.win-amd64\egg\pkg_resources.py", line 2281, in load_entry_point
return ep.load()
File "build\bdist.win-amd64\egg\pkg_resources.py", line 1991, in load
entry = __import__(self.module_name, globals(),globals(), ['__name__'])
File "C:\Anaconda\lib\site-packages\obspy-0.8.4_dirty-py2.7.egg\obspy\mseed\core.py", line 6, in <module>
from headers import clibmseed, ENCODINGS, HPTMODULUS, SAMPLETYPE, DATATYPES, \
File "C:\Anaconda\lib\site-packages\obspy-0.8.4_dirty-py2.7.egg\obspy\mseed\headers.py", line 39, in <module>
raise ImportError(msg)
ImportError: Could not load shared library for obspy.mseed.
[Error 126] The specified module could not be found
----------------------------------------------------------------------
File "C:\Anaconda\lib\site-packages\obspy-0.8.4_dirty-py2.7.egg\obspy\core\stream.py", line 170, in obspy.core.stream.read
Failed example:
print(st) # doctest: +ELLIPSIS
Expected:
1 Trace(s) in Stream:
XX.TEST..BHZ | 2008-01-15T00:00:00.025000Z - ... | 40.0 Hz, 635 samples
Got:
3 Trace(s) in Stream:
BW.RJOB..EHZ | 2009-08-24T00:20:03.000000Z - 2009-08-24T00:20:32.990000Z | 100.0 Hz, 3000 samples
BW.RJOB..EHN | 2009-08-24T00:20:03.000000Z - 2009-08-24T00:20:32.990000Z | 100.0 Hz, 3000 samples
BW.RJOB..EHE | 2009-08-24T00:20:03.000000Z - 2009-08-24T00:20:32.990000Z | 100.0 Hz, 3000 samples
----------------------------------------------------------------------
File "C:\Anaconda\lib\site-packages\obspy-0.8.4_dirty-py2.7.egg\obspy\core\stream.py", line 174, in obspy.core.stream.read
Failed example:
st = read("http://examples.obspy.org/slist.ascii.bz2")
Exception raised:
Traceback (most recent call last):
File "C:\Anaconda\lib\doctest.py", line 1315, in __run
compileflags, 1) in test.globs
File "<doctest obspy.core.stream.read[15]>", line 1, in <module>
st = read("http://examples.obspy.org/slist.ascii.bz2")
File "C:\Anaconda\lib\site-packages\obspy-0.8.4_dirty-py2.7.egg\obspy\core\stream.py", line 241, in read
st.extend(_read(fh.name, format, headonly, **kwargs).traces)
File "C:\Anaconda\lib\site-packages\obspy-0.8.4_dirty-py2.7.egg\obspy\core\util\decorator.py", line 138, in wrapped_func
result = func(tempfile.name, *args, **kwargs)
File "C:\Anaconda\lib\site-packages\obspy-0.8.4_dirty-py2.7.egg\obspy\core\stream.py", line 288, in _read
headonly=headonly, **kwargs)
File "C:\Anaconda\lib\site-packages\obspy-0.8.4_dirty-py2.7.egg\obspy\core\util\base.py", line 390, in _readFromPlugin
'isFormat')
File "build\bdist.win-amd64\egg\pkg_resources.py", line 337, in load_entry_point
return get_distribution(dist).load_entry_point(group, name)
File "build\bdist.win-amd64\egg\pkg_resources.py", line 2281, in load_entry_point
return ep.load()
File "build\bdist.win-amd64\egg\pkg_resources.py", line 1991, in load
entry = __import__(self.module_name, globals(),globals(), ['__name__'])
File "C:\Anaconda\lib\site-packages\obspy-0.8.4_dirty-py2.7.egg\obspy\mseed\core.py", line 6, in <module>
from headers import clibmseed, ENCODINGS, HPTMODULUS, SAMPLETYPE, DATATYPES, \
File "C:\Anaconda\lib\site-packages\obspy-0.8.4_dirty-py2.7.egg\obspy\mseed\headers.py", line 39, in <module>
raise ImportError(msg)
ImportError: Could not load shared library for obspy.mseed.
[Error 126] The specified module could not be found
----------------------------------------------------------------------
File "C:\Anaconda\lib\site-packages\obspy-0.8.4_dirty-py2.7.egg\obspy\core\stream.py", line 175, in obspy.core.stream.read
Failed example:
print(st) # doctest: +ELLIPSIS
Expected:
1 Trace(s) in Stream:
XX.TEST..BHZ | 2008-01-15T00:00:00.025000Z - ... | 40.0 Hz, 635 samples
Got:
3 Trace(s) in Stream:
BW.RJOB..EHZ | 2009-08-24T00:20:03.000000Z - 2009-08-24T00:20:32.990000Z | 100.0 Hz, 3000 samples
BW.RJOB..EHN | 2009-08-24T00:20:03.000000Z - 2009-08-24T00:20:32.990000Z | 100.0 Hz, 3000 samples
BW.RJOB..EHE | 2009-08-24T00:20:03.000000Z - 2009-08-24T00:20:32.990000Z | 100.0 Hz, 3000 samples
----------------------------------------------------------------------
File "C:\Anaconda\lib\site-packages\obspy-0.8.4_dirty-py2.7.egg\obspy\core\stream.py", line 185, in obspy.core.stream.read
Failed example:
st = read(stringio_obj)
Exception raised:
Traceback (most recent call last):
File "C:\Anaconda\lib\doctest.py", line 1315, in __run
compileflags, 1) in test.globs
File "<doctest obspy.core.stream.read[21]>", line 1, in <module>
st = read(stringio_obj)
File "C:\Anaconda\lib\site-packages\obspy-0.8.4_dirty-py2.7.egg\obspy\core\stream.py", line 222, in read
stream = _read(pathname_or_url, format, headonly, **kwargs)
File "C:\Anaconda\lib\site-packages\obspy-0.8.4_dirty-py2.7.egg\obspy\core\util\decorator.py", line 111, in wrapped_func
return func(filename, *args, **kwargs)
File "C:\Anaconda\lib\site-packages\obspy-0.8.4_dirty-py2.7.egg\obspy\core\stream.py", line 288, in _read
headonly=headonly, **kwargs)
File "C:\Anaconda\lib\site-packages\obspy-0.8.4_dirty-py2.7.egg\obspy\core\util\base.py", line 390, in _readFromPlugin
'isFormat')
File "build\bdist.win-amd64\egg\pkg_resources.py", line 337, in load_entry_point
return get_distribution(dist).load_entry_point(group, name)
File "build\bdist.win-amd64\egg\pkg_resources.py", line 2281, in load_entry_point
return ep.load()
File "build\bdist.win-amd64\egg\pkg_resources.py", line 1991, in load
entry = __import__(self.module_name, globals(),globals(), ['__name__'])
File "C:\Anaconda\lib\site-packages\obspy-0.8.4_dirty-py2.7.egg\obspy\mseed\core.py", line 6, in <module>
from headers import clibmseed, ENCODINGS, HPTMODULUS, SAMPLETYPE, DATATYPES, \
File "C:\Anaconda\lib\site-packages\obspy-0.8.4_dirty-py2.7.egg\obspy\mseed\headers.py", line 39, in <module>
raise ImportError(msg)
ImportError: Could not load shared library for obspy.mseed.
[Error 126] The specified module could not be found
----------------------------------------------------------------------
File "C:\Anaconda\lib\site-packages\obspy-0.8.4_dirty-py2.7.egg\obspy\core\stream.py", line 186, in obspy.core.stream.read
Failed example:
print(st) # doctest: +ELLIPSIS
Expected:
1 Trace(s) in Stream:
.RJOB..Z | 2005-08-31T02:33:49.849998Z - ... | 200.0 Hz, 12000 samples
Got:
3 Trace(s) in Stream:
BW.RJOB..EHZ | 2009-08-24T00:20:03.000000Z - 2009-08-24T00:20:32.990000Z | 100.0 Hz, 3000 samples
BW.RJOB..EHN | 2009-08-24T00:20:03.000000Z - 2009-08-24T00:20:32.990000Z | 100.0 Hz, 3000 samples
BW.RJOB..EHE | 2009-08-24T00:20:03.000000Z - 2009-08-24T00:20:32.990000Z | 100.0 Hz, 3000 samples
----------------------------------------------------------------------
File "C:\Anaconda\lib\site-packages\obspy-0.8.4_dirty-py2.7.egg\obspy\core\stream.py", line 194, in obspy.core.stream.read
Failed example:
st = read("http://examples.obspy.org/loc_RJOB20050831023349.z",
starttime=dt, endtime=dt+10)
Exception raised:
Traceback (most recent call last):
File "C:\Anaconda\lib\doctest.py", line 1315, in __run
compileflags, 1) in test.globs
File "<doctest obspy.core.stream.read[25]>", line 2, in <module>
starttime=dt, endtime=dt+10)
File "C:\Anaconda\lib\site-packages\obspy-0.8.4_dirty-py2.7.egg\obspy\core\stream.py", line 241, in read
st.extend(_read(fh.name, format, headonly, **kwargs).traces)
File "C:\Anaconda\lib\site-packages\obspy-0.8.4_dirty-py2.7.egg\obspy\core\util\decorator.py", line 151, in wrapped_func
result = func(filename, *args, **kwargs)
File "C:\Anaconda\lib\site-packages\obspy-0.8.4_dirty-py2.7.egg\obspy\core\stream.py", line 288, in _read
headonly=headonly, **kwargs)
File "C:\Anaconda\lib\site-packages\obspy-0.8.4_dirty-py2.7.egg\obspy\core\util\base.py", line 390, in _readFromPlugin
'isFormat')
File "build\bdist.win-amd64\egg\pkg_resources.py", line 337, in load_entry_point
return get_distribution(dist).load_entry_point(group, name)
File "build\bdist.win-amd64\egg\pkg_resources.py", line 2281, in load_entry_point
return ep.load()
File "build\bdist.win-amd64\egg\pkg_resources.py", line 1991, in load
entry = __import__(self.module_name, globals(),globals(), ['__name__'])
File "C:\Anaconda\lib\site-packages\obspy-0.8.4_dirty-py2.7.egg\obspy\mseed\core.py", line 6, in <module>
from headers import clibmseed, ENCODINGS, HPTMODULUS, SAMPLETYPE, DATATYPES, \
File "C:\Anaconda\lib\site-packages\obspy-0.8.4_dirty-py2.7.egg\obspy\mseed\headers.py", line 39, in <module>
raise ImportError(msg)
ImportError: Could not load shared library for obspy.mseed.
[Error 126] The specified module could not be found
----------------------------------------------------------------------
File "C:\Anaconda\lib\site-packages\obspy-0.8.4_dirty-py2.7.egg\obspy\core\stream.py", line 196, in obspy.core.stream.read
Failed example:
print(st) # doctest: +ELLIPSIS
Expected:
1 Trace(s) in Stream:
.RJOB..Z | 2005-08-31T02:33:59.999999Z - ... | 200.0 Hz, 2001 samples
Got:
3 Trace(s) in Stream:
BW.RJOB..EHZ | 2009-08-24T00:20:03.000000Z - 2009-08-24T00:20:32.990000Z | 100.0 Hz, 3000 samples
BW.RJOB..EHN | 2009-08-24T00:20:03.000000Z - 2009-08-24T00:20:32.990000Z | 100.0 Hz, 3000 samples
BW.RJOB..EHE | 2009-08-24T00:20:03.000000Z - 2009-08-24T00:20:32.990000Z | 100.0 Hz, 3000 samples
Traceback (most recent call last):
File "C:\Anaconda\lib\doctest.py", line 2226, in runTest
raise self.failureException(self.format_failure(new.getvalue()))
AssertionError: Failed doctest test for obspy.core.util.base.getExampleFile
File "C:\Anaconda\lib\site-packages\obspy-0.8.4_dirty-py2.7.egg\obspy\core\util\base.py", line 137, in getExampleFile
----------------------------------------------------------------------
File "C:\Anaconda\lib\site-packages\obspy-0.8.4_dirty-py2.7.egg\obspy\core\util\base.py", line 154, in obspy.core.util.base.getExampleFile
Failed example:
getExampleFile('does.not.exists') # doctest: +ELLIPSIS
Expected:
Traceback (most recent call last):
...
IOError: Could not find file does.not.exists ...
Got:
Traceback (most recent call last):
File "C:\Anaconda\lib\doctest.py", line 1315, in __run
compileflags, 1) in test.globs
File "<doctest obspy.core.util.base.getExampleFile[1]>", line 1, in <module>
getExampleFile('does.not.exists') # doctest: +ELLIPSIS
File "C:\Anaconda\lib\site-packages\obspy-0.8.4_dirty-py2.7.egg\obspy\core\util\base.py", line 160, in getExampleFile
mod = __import__("obspy.%s.tests" % module, fromlist=["obspy"])
File "C:\Anaconda\lib\site-packages\obspy-0.8.4_dirty-py2.7.egg\obspy\signal\__init__.py", line 189, in <module>
from trigger import recSTALTA, recSTALTAPy, carlSTATrig, classicSTALTA, \
File "C:\Anaconda\lib\site-packages\obspy-0.8.4_dirty-py2.7.egg\obspy\signal\trigger.py", line 32, in <module>
from obspy.signal.headers import clibsignal, head_stalta_t
File "C:\Anaconda\lib\site-packages\obspy-0.8.4_dirty-py2.7.egg\obspy\signal\headers.py", line 35, in <module>
raise ImportError(msg)
ImportError: Could not load shared library for obspy.signal.
<BLANKLINE>
[Error 126] The specified module could not be found
Traceback (most recent call last):
File "C:\Anaconda\lib\doctest.py", line 2226, in runTest
raise self.failureException(self.format_failure(new.getvalue()))
AssertionError: Failed doctest test for obspy.core.util.base._getFunctionFromEntryPoint
File "C:\Anaconda\lib\site-packages\obspy-0.8.4_dirty-py2.7.egg\obspy\core\util\base.py", line 312, in _getFunctionFromEntryPoint
----------------------------------------------------------------------
File "C:\Anaconda\lib\site-packages\obspy-0.8.4_dirty-py2.7.egg\obspy\core\util\base.py", line 320, in obspy.core.util.base._getFunctionFromEntryPoint
Failed example:
_getFunctionFromEntryPoint('detrend', 'simple') # doctest: +ELLIPSIS
Exception raised:
Traceback (most recent call last):
File "C:\Anaconda\lib\doctest.py", line 1315, in __run
compileflags, 1) in test.globs
File "<doctest obspy.core.util.base._getFunctionFromEntryPoint[0]>", line 1, in <module>
_getFunctionFromEntryPoint('detrend', 'simple') # doctest: +ELLIPSIS
File "C:\Anaconda\lib\site-packages\obspy-0.8.4_dirty-py2.7.egg\obspy\core\util\base.py", line 351, in _getFunctionFromEntryPoint
'obspy.plugin.%s' % (group), entry_point.name)
File "build\bdist.win-amd64\egg\pkg_resources.py", line 337, in load_entry_point
return get_distribution(dist).load_entry_point(group, name)
File "build\bdist.win-amd64\egg\pkg_resources.py", line 2281, in load_entry_point
return ep.load()
File "build\bdist.win-amd64\egg\pkg_resources.py", line 1991, in load
entry = __import__(self.module_name, globals(),globals(), ['__name__'])
File "C:\Anaconda\lib\site-packages\obspy-0.8.4_dirty-py2.7.egg\obspy\signal\__init__.py", line 189, in <module>
from trigger import recSTALTA, recSTALTAPy, carlSTATrig, classicSTALTA, \
File "C:\Anaconda\lib\site-packages\obspy-0.8.4_dirty-py2.7.egg\obspy\signal\trigger.py", line 32, in <module>
from obspy.signal.headers import clibsignal, head_stalta_t
File "C:\Anaconda\lib\site-packages\obspy-0.8.4_dirty-py2.7.egg\obspy\signal\headers.py", line 35, in <module>
raise ImportError(msg)
ImportError: Could not load shared library for obspy.signal.
[Error 126] The specified module could not be found
Traceback (most recent call last):
File "C:\Anaconda\lib\doctest.py", line 2226, in runTest
raise self.failureException(self.format_failure(new.getvalue()))
AssertionError: Failed doctest test for obspy.core.trace.Trace.trigger
File "C:\Anaconda\lib\site-packages\obspy-0.8.4_dirty-py2.7.egg\obspy\core\trace.py", line 1227, in trigger
----------------------------------------------------------------------
File "C:\Anaconda\lib\site-packages\obspy-0.8.4_dirty-py2.7.egg\obspy\core\trace.py", line 1279, in obspy.core.trace.Trace.trigger
Failed example:
tr.filter("highpass", freq=1.0)
Exception raised:
Traceback (most recent call last):
File "C:\Anaconda\lib\doctest.py", line 1315, in __run
compileflags, 1) in test.globs
File "<doctest obspy.core.trace.Trace.trigger[3]>", line 1, in <module>
tr.filter("highpass", freq=1.0)
File "C:\Anaconda\lib\site-packages\obspy-0.8.4_dirty-py2.7.egg\obspy\core\trace.py", line 1218, in filter
func = _getFunctionFromEntryPoint('filter', type)
File "C:\Anaconda\lib\site-packages\obspy-0.8.4_dirty-py2.7.egg\obspy\core\util\base.py", line 351, in _getFunctionFromEntryPoint
'obspy.plugin.%s' % (group), entry_point.name)
File "build\bdist.win-amd64\egg\pkg_resources.py", line 337, in load_entry_point
return get_distribution(dist).load_entry_point(group, name)
File "build\bdist.win-amd64\egg\pkg_resources.py", line 2281, in load_entry_point
return ep.load()
File "build\bdist.win-amd64\egg\pkg_resources.py", line 1991, in load
entry = __import__(self.module_name, globals(),globals(), ['__name__'])
File "C:\Anaconda\lib\site-packages\obspy-0.8.4_dirty-py2.7.egg\obspy\signal\__init__.py", line 189, in <module>
from trigger import recSTALTA, recSTALTAPy, carlSTATrig, classicSTALTA, \
File "C:\Anaconda\lib\site-packages\obspy-0.8.4_dirty-py2.7.egg\obspy\signal\trigger.py", line 32, in <module>
from obspy.signal.headers import clibsignal, head_stalta_t
File "C:\Anaconda\lib\site-packages\obspy-0.8.4_dirty-py2.7.egg\obspy\signal\headers.py", line 35, in <module>
raise ImportError(msg)
ImportError: Could not load shared library for obspy.signal.
[Error 126] The specified module could not be found
----------------------------------------------------------------------
File "C:\Anaconda\lib\site-packages\obspy-0.8.4_dirty-py2.7.egg\obspy\core\trace.py", line 1281, in obspy.core.trace.Trace.trigger
Failed example:
tr.trigger("recstalta", sta=3, lta=10)
Exception raised:
Traceback (most recent call last):
File "C:\Anaconda\lib\doctest.py", line 1315, in __run
compileflags, 1) in test.globs
File "<doctest obspy.core.trace.Trace.trigger[5]>", line 1, in <module>
tr.trigger("recstalta", sta=3, lta=10)
File "C:\Anaconda\lib\site-packages\obspy-0.8.4_dirty-py2.7.egg\obspy\core\trace.py", line 1296, in trigger
func = _getFunctionFromEntryPoint('trigger', type)
File "C:\Anaconda\lib\site-packages\obspy-0.8.4_dirty-py2.7.egg\obspy\core\util\base.py", line 351, in _getFunctionFromEntryPoint
'obspy.plugin.%s' % (group), entry_point.name)
File "build\bdist.win-amd64\egg\pkg_resources.py", line 337, in load_entry_point
return get_distribution(dist).load_entry_point(group, name)
File "build\bdist.win-amd64\egg\pkg_resources.py", line 2281, in load_entry_point
return ep.load()
File "build\bdist.win-amd64\egg\pkg_resources.py", line 1991, in load
entry = __import__(self.module_name, globals(),globals(), ['__name__'])
File "C:\Anaconda\lib\site-packages\obspy-0.8.4_dirty-py2.7.egg\obspy\signal\__init__.py", line 189, in <module>
from trigger import recSTALTA, recSTALTAPy, carlSTATrig, classicSTALTA, \
File "C:\Anaconda\lib\site-packages\obspy-0.8.4_dirty-py2.7.egg\obspy\signal\trigger.py", line 32, in <module>
from obspy.signal.headers import clibsignal, head_stalta_t
File "C:\Anaconda\lib\site-packages\obspy-0.8.4_dirty-py2.7.egg\obspy\signal\headers.py", line 35, in <module>
raise ImportError(msg)
ImportError: Could not load shared library for obspy.signal.
[Error 126] The specified module could not be found
Traceback (most recent call last):
File "C:\Anaconda\lib\doctest.py", line 2226, in runTest
raise self.failureException(self.format_failure(new.getvalue()))
AssertionError: Failed doctest test for obspy.core.stream.Stream.simulate
File "C:\Anaconda\lib\site-packages\obspy-0.8.4_dirty-py2.7.egg\obspy\core\stream.py", line 1674, in simulate
----------------------------------------------------------------------
File "C:\Anaconda\lib\site-packages\obspy-0.8.4_dirty-py2.7.egg\obspy\core\stream.py", line 1730, in obspy.core.stream.Stream.simulate
Failed example:
from obspy.signal import cornFreq2Paz
Exception raised:
Traceback (most recent call last):
File "C:\Anaconda\lib\doctest.py", line 1315, in __run
compileflags, 1) in test.globs
File "<doctest obspy.core.stream.Stream.simulate[1]>", line 1, in <module>
from obspy.signal import cornFreq2Paz
File "C:\Anaconda\lib\site-packages\obspy-0.8.4_dirty-py2.7.egg\obspy\signal\__init__.py", line 189, in <module>
from trigger import recSTALTA, recSTALTAPy, carlSTATrig, classicSTALTA, \
File "C:\Anaconda\lib\site-packages\obspy-0.8.4_dirty-py2.7.egg\obspy\signal\trigger.py", line 32, in <module>
from obspy.signal.headers import clibsignal, head_stalta_t
File "C:\Anaconda\lib\site-packages\obspy-0.8.4_dirty-py2.7.egg\obspy\signal\headers.py", line 35, in <module>
raise ImportError(msg)
ImportError: Could not load shared library for obspy.signal.
[Error 126] The specified module could not be found
----------------------------------------------------------------------
File "C:\Anaconda\lib\site-packages\obspy-0.8.4_dirty-py2.7.egg\obspy\core\stream.py", line 1739, in obspy.core.stream.Stream.simulate
Failed example:
paz_1hz = cornFreq2Paz(1.0, damp=0.707)
Exception raised:
Traceback (most recent call last):
File "C:\Anaconda\lib\doctest.py", line 1315, in __run
compileflags, 1) in test.globs
File "<doctest obspy.core.stream.Stream.simulate[5]>", line 1, in <module>
paz_1hz = cornFreq2Paz(1.0, damp=0.707)
NameError: name 'cornFreq2Paz' is not defined
----------------------------------------------------------------------
File "C:\Anaconda\lib\site-packages\obspy-0.8.4_dirty-py2.7.egg\obspy\core\stream.py", line 1740, in obspy.core.stream.Stream.simulate
Failed example:
st.simulate(paz_remove=paz_sts2, paz_simulate=paz_1hz)
Exception raised:
Traceback (most recent call last):
File "C:\Anaconda\lib\doctest.py", line 1315, in __run
compileflags, 1) in test.globs
File "<doctest obspy.core.stream.Stream.simulate[6]>", line 1, in <module>
st.simulate(paz_remove=paz_sts2, paz_simulate=paz_1hz)
NameError: name 'paz_1hz' is not defined
Traceback (most recent call last):
File "C:\Anaconda\lib\doctest.py", line 2226, in runTest
raise self.failureException(self.format_failure(new.getvalue()))
AssertionError: Failed doctest test for obspy.core.stream.Stream.trigger
File "C:\Anaconda\lib\site-packages\obspy-0.8.4_dirty-py2.7.egg\obspy\core\stream.py", line 1828, in trigger
----------------------------------------------------------------------
File "C:\Anaconda\lib\site-packages\obspy-0.8.4_dirty-py2.7.egg\obspy\core\stream.py", line 1878, in obspy.core.stream.Stream.trigger
Failed example:
st.filter("highpass", freq=1.0)
Exception raised:
Traceback (most recent call last):
File "C:\Anaconda\lib\doctest.py", line 1315, in __run
compileflags, 1) in test.globs
File "<doctest obspy.core.stream.Stream.trigger[2]>", line 1, in <module>
st.filter("highpass", freq=1.0)
File "C:\Anaconda\lib\site-packages\obspy-0.8.4_dirty-py2.7.egg\obspy\core\stream.py", line 1826, in filter
tr.filter(type, **options)
File "C:\Anaconda\lib\site-packages\obspy-0.8.4_dirty-py2.7.egg\obspy\core\trace.py", line 1218, in filter
func = _getFunctionFromEntryPoint('filter', type)
File "C:\Anaconda\lib\site-packages\obspy-0.8.4_dirty-py2.7.egg\obspy\core\util\base.py", line 351, in _getFunctionFromEntryPoint
'obspy.plugin.%s' % (group), entry_point.name)
File "build\bdist.win-amd64\egg\pkg_resources.py", line 337, in load_entry_point
return get_distribution(dist).load_entry_point(group, name)
File "build\bdist.win-amd64\egg\pkg_resources.py", line 2281, in load_entry_point
return ep.load()
File "build\bdist.win-amd64\egg\pkg_resources.py", line 1991, in load
entry = __import__(self.module_name, globals(),globals(), ['__name__'])
File "C:\Anaconda\lib\site-packages\obspy-0.8.4_dirty-py2.7.egg\obspy\signal\__init__.py", line 189, in <module>
from trigger import recSTALTA, recSTALTAPy, carlSTATrig, classicSTALTA, \
File "C:\Anaconda\lib\site-packages\obspy-0.8.4_dirty-py2.7.egg\obspy\signal\trigger.py", line 32, in <module>
from obspy.signal.headers import clibsignal, head_stalta_t
File "C:\Anaconda\lib\site-packages\obspy-0.8.4_dirty-py2.7.egg\obspy\signal\headers.py", line 35, in <module>
raise ImportError(msg)
ImportError: Could not load shared library for obspy.signal.
[Error 126] The specified module could not be found
----------------------------------------------------------------------
File "C:\Anaconda\lib\site-packages\obspy-0.8.4_dirty-py2.7.egg\obspy\core\stream.py", line 1880, in obspy.core.stream.Stream.trigger
Failed example:
st.trigger('recstalta', sta=3, lta=10)
Exception raised:
Traceback (most recent call last):
File "C:\Anaconda\lib\doctest.py", line 1315, in __run
compileflags, 1) in test.globs
File "<doctest obspy.core.stream.Stream.trigger[4]>", line 1, in <module>
st.trigger('recstalta', sta=3, lta=10)
File "C:\Anaconda\lib\site-packages\obspy-0.8.4_dirty-py2.7.egg\obspy\core\stream.py", line 1893, in trigger
tr.trigger(type, **options)
File "C:\Anaconda\lib\site-packages\obspy-0.8.4_dirty-py2.7.egg\obspy\core\trace.py", line 1296, in trigger
func = _getFunctionFromEntryPoint('trigger', type)
File "C:\Anaconda\lib\site-packages\obspy-0.8.4_dirty-py2.7.egg\obspy\core\util\base.py", line 351, in _getFunctionFromEntryPoint
'obspy.plugin.%s' % (group), entry_point.name)
File "build\bdist.win-amd64\egg\pkg_resources.py", line 337, in load_entry_point
return get_distribution(dist).load_entry_point(group, name)
File "build\bdist.win-amd64\egg\pkg_resources.py", line 2281, in load_entry_point
return ep.load()
File "build\bdist.win-amd64\egg\pkg_resources.py", line 1991, in load
entry = __import__(self.module_name, globals(),globals(), ['__name__'])
File "C:\Anaconda\lib\site-packages\obspy-0.8.4_dirty-py2.7.egg\obspy\signal\__init__.py", line 189, in <module>
from trigger import recSTALTA, recSTALTAPy, carlSTATrig, classicSTALTA, \
File "C:\Anaconda\lib\site-packages\obspy-0.8.4_dirty-py2.7.egg\obspy\signal\trigger.py", line 32, in <module>
from obspy.signal.headers import clibsignal, head_stalta_t
File "C:\Anaconda\lib\site-packages\obspy-0.8.4_dirty-py2.7.egg\obspy\signal\headers.py", line 35, in <module>
raise ImportError(msg)
ImportError: Could not load shared library for obspy.signal.
[Error 126] The specified module could not be found
Traceback (most recent call last):
File "C:\Anaconda\lib\site-packages\obspy-0.8.4_dirty-py2.7.egg\obspy\core\tests\test_waveform_plugins.py", line 288, in test_readGzip2File
st1 = read(os.path.join(path, 'data', 'tspair.ascii.gz'))
File "C:\Anaconda\lib\site-packages\obspy-0.8.4_dirty-py2.7.egg\obspy\core\stream.py", line 247, in read
st.extend(_read(file, format, headonly, **kwargs).traces)
File "C:\Anaconda\lib\site-packages\obspy-0.8.4_dirty-py2.7.egg\obspy\core\util\decorator.py", line 138, in wrapped_func
result = func(tempfile.name, *args, **kwargs)
File "C:\Anaconda\lib\site-packages\obspy-0.8.4_dirty-py2.7.egg\obspy\core\stream.py", line 288, in _read
headonly=headonly, **kwargs)
File "C:\Anaconda\lib\site-packages\obspy-0.8.4_dirty-py2.7.egg\obspy\core\util\base.py", line 390, in _readFromPlugin
'isFormat')
File "build\bdist.win-amd64\egg\pkg_resources.py", line 337, in load_entry_point
return get_distribution(dist).load_entry_point(group, name)
File "build\bdist.win-amd64\egg\pkg_resources.py", line 2281, in load_entry_point
return ep.load()
File "build\bdist.win-amd64\egg\pkg_resources.py", line 1991, in load
entry = __import__(self.module_name, globals(),globals(), ['__name__'])
File "C:\Anaconda\lib\site-packages\obspy-0.8.4_dirty-py2.7.egg\obspy\mseed\core.py", line 6, in <module>
from headers import clibmseed, ENCODINGS, HPTMODULUS, SAMPLETYPE, DATATYPES, \
File "C:\Anaconda\lib\site-packages\obspy-0.8.4_dirty-py2.7.egg\obspy\mseed\headers.py", line 39, in <module>
raise ImportError(msg)
ImportError: Could not load shared library for obspy.mseed.
[Error 126] The specified module could not be found
Traceback (most recent call last):
File "C:\Anaconda\lib\site-packages\obspy-0.8.4_dirty-py2.7.egg\obspy\core\tests\test_waveform_plugins.py", line 214, in test_readThreadSafe
tr.write(outfile, format=format)
File "C:\Anaconda\lib\site-packages\obspy-0.8.4_dirty-py2.7.egg\obspy\core\trace.py", line 805, in write
Stream([self]).write(filename, format, **kwargs)
File "C:\Anaconda\lib\site-packages\obspy-0.8.4_dirty-py2.7.egg\obspy\core\stream.py", line 1278, in write
', '.join(ENTRY_POINTS['waveform_write'])))
TypeError: Writing format "MSEED" is not supported. Supported types: MSEED, SAC, GSE2, SACXY, Q, SH_ASC, SLIST, TSPAIR, SEGY, SU, SEG2, WAV, PICKLE
Traceback (most recent call last):
File "C:\Anaconda\lib\site-packages\obspy-0.8.4_dirty-py2.7.egg\obspy\core\tests\test_waveform_plugins.py", line 71, in test_readAndWrite
st = read(outfile)
File "C:\Anaconda\lib\site-packages\obspy-0.8.4_dirty-py2.7.egg\obspy\core\stream.py", line 247, in read
st.extend(_read(file, format, headonly, **kwargs).traces)
File "C:\Anaconda\lib\site-packages\obspy-0.8.4_dirty-py2.7.egg\obspy\core\util\decorator.py", line 151, in wrapped_func
result = func(filename, *args, **kwargs)
File "C:\Anaconda\lib\site-packages\obspy-0.8.4_dirty-py2.7.egg\obspy\core\stream.py", line 288, in _read
headonly=headonly, **kwargs)
File "C:\Anaconda\lib\site-packages\obspy-0.8.4_dirty-py2.7.egg\obspy\core\util\base.py", line 390, in _readFromPlugin
'isFormat')
File "build\bdist.win-amd64\egg\pkg_resources.py", line 337, in load_entry_point
return get_distribution(dist).load_entry_point(group, name)
File "build\bdist.win-amd64\egg\pkg_resources.py", line 2281, in load_entry_point
return ep.load()
File "build\bdist.win-amd64\egg\pkg_resources.py", line 1991, in load
entry = __import__(self.module_name, globals(),globals(), ['__name__'])
File "C:\Anaconda\lib\site-packages\obspy-0.8.4_dirty-py2.7.egg\obspy\mseed\core.py", line 6, in <module>
from headers import clibmseed, ENCODINGS, HPTMODULUS, SAMPLETYPE, DATATYPES, \
File "C:\Anaconda\lib\site-packages\obspy-0.8.4_dirty-py2.7.egg\obspy\mseed\headers.py", line 39, in <module>
raise ImportError(msg)
ImportError: Could not load shared library for obspy.mseed.
[Error 126] The specified module could not be found
Traceback (most recent call last):
File "C:\Anaconda\lib\site-packages\obspy-0.8.4_dirty-py2.7.egg\obspy\core\tests\test_waveform_plugins.py", line 297, in test_readBzip2File
st1 = read(os.path.join(path, 'data', 'slist.ascii.bz2'))
File "C:\Anaconda\lib\site-packages\obspy-0.8.4_dirty-py2.7.egg\obspy\core\stream.py", line 247, in read
st.extend(_read(file, format, headonly, **kwargs).traces)
File "C:\Anaconda\lib\site-packages\obspy-0.8.4_dirty-py2.7.egg\obspy\core\util\decorator.py", line 138, in wrapped_func
result = func(tempfile.name, *args, **kwargs)
File "C:\Anaconda\lib\site-packages\obspy-0.8.4_dirty-py2.7.egg\obspy\core\stream.py", line 288, in _read
headonly=headonly, **kwargs)
File "C:\Anaconda\lib\site-packages\obspy-0.8.4_dirty-py2.7.egg\obspy\core\util\base.py", line 390, in _readFromPlugin
'isFormat')
File "build\bdist.win-amd64\egg\pkg_resources.py", line 337, in load_entry_point
return get_distribution(dist).load_entry_point(group, name)
File "build\bdist.win-amd64\egg\pkg_resources.py", line 2281, in load_entry_point
return ep.load()
File "build\bdist.win-amd64\egg\pkg_resources.py", line 1991, in load
entry = __import__(self.module_name, globals(),globals(), ['__name__'])
File "C:\Anaconda\lib\site-packages\obspy-0.8.4_dirty-py2.7.egg\obspy\mseed\core.py", line 6, in <module>
from headers import clibmseed, ENCODINGS, HPTMODULUS, SAMPLETYPE, DATATYPES, \
File "C:\Anaconda\lib\site-packages\obspy-0.8.4_dirty-py2.7.egg\obspy\mseed\headers.py", line 39, in <module>
raise ImportError(msg)
ImportError: Could not load shared library for obspy.mseed.
[Error 126] The specified module could not be found
Traceback (most recent call last):
File "C:\Anaconda\lib\doctest.py", line 2226, in runTest
raise self.failureException(self.format_failure(new.getvalue()))
AssertionError: Failed doctest test for obspy.core.stream.Stream.decimate
File "C:\Anaconda\lib\site-packages\obspy-0.8.4_dirty-py2.7.egg\obspy\core\stream.py", line 1944, in decimate
----------------------------------------------------------------------
File "C:\Anaconda\lib\site-packages\obspy-0.8.4_dirty-py2.7.egg\obspy\core\stream.py", line 1990, in obspy.core.stream.Stream.decimate
Failed example:
st.decimate(4, strict_length=False, no_filter=True)
Exception raised:
Traceback (most recent call last):
File "C:\Anaconda\lib\doctest.py", line 1315, in __run
compileflags, 1) in test.globs
File "<doctest obspy.core.stream.Stream.decimate[5]>", line 1, in <module>
st.decimate(4, strict_length=False, no_filter=True)
File "C:\Anaconda\lib\site-packages\obspy-0.8.4_dirty-py2.7.egg\obspy\core\stream.py", line 1998, in decimate
strict_length=strict_length)
File "C:\Anaconda\lib\site-packages\obspy-0.8.4_dirty-py2.7.egg\obspy\core\trace.py", line 1445, in decimate
from obspy.signal import integerDecimation
File "C:\Anaconda\lib\site-packages\obspy-0.8.4_dirty-py2.7.egg\obspy\signal\__init__.py", line 189, in <module>
from trigger import recSTALTA, recSTALTAPy, carlSTATrig, classicSTALTA, \
File "C:\Anaconda\lib\site-packages\obspy-0.8.4_dirty-py2.7.egg\obspy\signal\trigger.py", line 32, in <module>
from obspy.signal.headers import clibsignal, head_stalta_t
File "C:\Anaconda\lib\site-packages\obspy-0.8.4_dirty-py2.7.egg\obspy\signal\headers.py", line 35, in <module>
raise ImportError(msg)
ImportError: Could not load shared library for obspy.signal.
[Error 126] The specified module could not be found
----------------------------------------------------------------------
File "C:\Anaconda\lib\site-packages\obspy-0.8.4_dirty-py2.7.egg\obspy\core\stream.py", line 1991, in obspy.core.stream.Stream.decimate
Failed example:
tr.stats.sampling_rate
Expected:
0.25
Got:
1.0
----------------------------------------------------------------------
File "C:\Anaconda\lib\site-packages\obspy-0.8.4_dirty-py2.7.egg\obspy\core\stream.py", line 1993, in obspy.core.stream.Stream.decimate
Failed example:
tr.data
Expected:
array([0, 4, 8])
Got:
array([0, 1, 2, 3, 4, 5, 6, 7, 8, 9])
Traceback (most recent call last):
File "C:\Anaconda\lib\doctest.py", line 2226, in runTest
raise self.failureException(self.format_failure(new.getvalue()))
AssertionError: Failed doctest test for obspy.core.stream.Stream.filter
File "C:\Anaconda\lib\site-packages\obspy-0.8.4_dirty-py2.7.egg\obspy\core\stream.py", line 1766, in filter
----------------------------------------------------------------------
File "C:\Anaconda\lib\site-packages\obspy-0.8.4_dirty-py2.7.egg\obspy\core\stream.py", line 1815, in obspy.core.stream.Stream.filter
Failed example:
st.filter("highpass", freq=1.0)
Exception raised:
Traceback (most recent call last):
File "C:\Anaconda\lib\doctest.py", line 1315, in __run
compileflags, 1) in test.globs
File "<doctest obspy.core.stream.Stream.filter[2]>", line 1, in <module>
st.filter("highpass", freq=1.0)
File "C:\Anaconda\lib\site-packages\obspy-0.8.4_dirty-py2.7.egg\obspy\core\stream.py", line 1826, in filter
tr.filter(type, **options)
File "C:\Anaconda\lib\site-packages\obspy-0.8.4_dirty-py2.7.egg\obspy\core\trace.py", line 1218, in filter
func = _getFunctionFromEntryPoint('filter', type)
File "C:\Anaconda\lib\site-packages\obspy-0.8.4_dirty-py2.7.egg\obspy\core\util\base.py", line 351, in _getFunctionFromEntryPoint
'obspy.plugin.%s' % (group), entry_point.name)
File "build\bdist.win-amd64\egg\pkg_resources.py", line 337, in load_entry_point
return get_distribution(dist).load_entry_point(group, name)
File "build\bdist.win-amd64\egg\pkg_resources.py", line 2281, in load_entry_point
return ep.load()
File "build\bdist.win-amd64\egg\pkg_resources.py", line 1991, in load
entry = __import__(self.module_name, globals(),globals(), ['__name__'])
File "C:\Anaconda\lib\site-packages\obspy-0.8.4_dirty-py2.7.egg\obspy\signal\__init__.py", line 189, in <module>
from trigger import recSTALTA, recSTALTAPy, carlSTATrig, classicSTALTA, \
File "C:\Anaconda\lib\site-packages\obspy-0.8.4_dirty-py2.7.egg\obspy\signal\trigger.py", line 32, in <module>
from obspy.signal.headers import clibsignal, head_stalta_t
File "C:\Anaconda\lib\site-packages\obspy-0.8.4_dirty-py2.7.egg\obspy\signal\headers.py", line 35, in <module>
raise ImportError(msg)
ImportError: Could not load shared library for obspy.signal.
[Error 126] The specified module could not be found
Traceback (most recent call last):
File "C:\Anaconda\lib\doctest.py", line 2226, in runTest
raise self.failureException(self.format_failure(new.getvalue()))
AssertionError: Failed doctest test for obspy.core.ascii.readSLIST
File "C:\Anaconda\lib\site-packages\obspy-0.8.4_dirty-py2.7.egg\obspy\core\ascii.py", line 94, in readSLIST
----------------------------------------------------------------------
File "C:\Anaconda\lib\site-packages\obspy-0.8.4_dirty-py2.7.egg\obspy\core\ascii.py", line 113, in obspy.core.ascii.readSLIST
Failed example:
st = read('/path/to/slist.ascii')
Exception raised:
Traceback (most recent call last):
File "C:\Anaconda\lib\doctest.py", line 1315, in __run
compileflags, 1) in test.globs
File "<doctest obspy.core.ascii.readSLIST[1]>", line 1, in <module>
st = read('/path/to/slist.ascii')
File "C:\Anaconda\lib\site-packages\obspy-0.8.4_dirty-py2.7.egg\obspy\core\stream.py", line 247, in read
st.extend(_read(file, format, headonly, **kwargs).traces)
File "C:\Anaconda\lib\site-packages\obspy-0.8.4_dirty-py2.7.egg\obspy\core\util\decorator.py", line 151, in wrapped_func
result = func(filename, *args, **kwargs)
File "C:\Anaconda\lib\site-packages\obspy-0.8.4_dirty-py2.7.egg\obspy\core\stream.py", line 288, in _read
headonly=headonly, **kwargs)
File "C:\Anaconda\lib\site-packages\obspy-0.8.4_dirty-py2.7.egg\obspy\core\util\base.py", line 390, in _readFromPlugin
'isFormat')
File "build\bdist.win-amd64\egg\pkg_resources.py", line 337, in load_entry_point
return get_distribution(dist).load_entry_point(group, name)
File "build\bdist.win-amd64\egg\pkg_resources.py", line 2281, in load_entry_point
return ep.load()
File "build\bdist.win-amd64\egg\pkg_resources.py", line 1991, in load
entry = __import__(self.module_name, globals(),globals(), ['__name__'])
File "C:\Anaconda\lib\site-packages\obspy-0.8.4_dirty-py2.7.egg\obspy\mseed\core.py", line 6, in <module>
from headers import clibmseed, ENCODINGS, HPTMODULUS, SAMPLETYPE, DATATYPES, \
File "C:\Anaconda\lib\site-packages\obspy-0.8.4_dirty-py2.7.egg\obspy\mseed\headers.py", line 39, in <module>
raise ImportError(msg)
ImportError: Could not load shared library for obspy.mseed.
[Error 126] The specified module could not be found
Traceback (most recent call last):
File "C:\Anaconda\lib\doctest.py", line 2226, in runTest
raise self.failureException(self.format_failure(new.getvalue()))
AssertionError: Failed doctest test for obspy.core.ascii.readTSPAIR
File "C:\Anaconda\lib\site-packages\obspy-0.8.4_dirty-py2.7.egg\obspy\core\ascii.py", line 160, in readTSPAIR
----------------------------------------------------------------------
File "C:\Anaconda\lib\site-packages\obspy-0.8.4_dirty-py2.7.egg\obspy\core\ascii.py", line 179, in obspy.core.ascii.readTSPAIR
Failed example:
st = read('/path/to/tspair.ascii')
Exception raised:
Traceback (most recent call last):
File "C:\Anaconda\lib\doctest.py", line 1315, in __run
compileflags, 1) in test.globs
File "<doctest obspy.core.ascii.readTSPAIR[1]>", line 1, in <module>
st = read('/path/to/tspair.ascii')
File "C:\Anaconda\lib\site-packages\obspy-0.8.4_dirty-py2.7.egg\obspy\core\stream.py", line 247, in read
st.extend(_read(file, format, headonly, **kwargs).traces)
File "C:\Anaconda\lib\site-packages\obspy-0.8.4_dirty-py2.7.egg\obspy\core\util\decorator.py", line 151, in wrapped_func
result = func(filename, *args, **kwargs)
File "C:\Anaconda\lib\site-packages\obspy-0.8.4_dirty-py2.7.egg\obspy\core\stream.py", line 288, in _read
headonly=headonly, **kwargs)
File "C:\Anaconda\lib\site-packages\obspy-0.8.4_dirty-py2.7.egg\obspy\core\util\base.py", line 390, in _readFromPlugin
'isFormat')
File "build\bdist.win-amd64\egg\pkg_resources.py", line 337, in load_entry_point
return get_distribution(dist).load_entry_point(group, name)
File "build\bdist.win-amd64\egg\pkg_resources.py", line 2281, in load_entry_point
return ep.load()
File "build\bdist.win-amd64\egg\pkg_resources.py", line 1991, in load
entry = __import__(self.module_name, globals(),globals(), ['__name__'])
File "C:\Anaconda\lib\site-packages\obspy-0.8.4_dirty-py2.7.egg\obspy\mseed\core.py", line 6, in <module>
from headers import clibmseed, ENCODINGS, HPTMODULUS, SAMPLETYPE, DATATYPES, \
File "C:\Anaconda\lib\site-packages\obspy-0.8.4_dirty-py2.7.egg\obspy\mseed\headers.py", line 39, in <module>
raise ImportError(msg)
ImportError: Could not load shared library for obspy.mseed.
[Error 126] The specified module could not be found
Traceback (most recent call last):
File "C:\Anaconda\lib\site-packages\obspy-0.8.4_dirty-py2.7.egg\obspy\datamark\tests\test_core.py", line 28, in test_readViaObsPy
st = read(filename)
File "C:\Anaconda\lib\site-packages\obspy-0.8.4_dirty-py2.7.egg\obspy\core\stream.py", line 247, in read
st.extend(_read(file, format, headonly, **kwargs).traces)
File "C:\Anaconda\lib\site-packages\obspy-0.8.4_dirty-py2.7.egg\obspy\core\util\decorator.py", line 151, in wrapped_func
result = func(filename, *args, **kwargs)
File "C:\Anaconda\lib\site-packages\obspy-0.8.4_dirty-py2.7.egg\obspy\core\stream.py", line 288, in _read
headonly=headonly, **kwargs)
File "C:\Anaconda\lib\site-packages\obspy-0.8.4_dirty-py2.7.egg\obspy\core\util\base.py", line 390, in _readFromPlugin
'isFormat')
File "build\bdist.win-amd64\egg\pkg_resources.py", line 337, in load_entry_point
return get_distribution(dist).load_entry_point(group, name)
File "build\bdist.win-amd64\egg\pkg_resources.py", line 2281, in load_entry_point
return ep.load()
File "build\bdist.win-amd64\egg\pkg_resources.py", line 1991, in load
entry = __import__(self.module_name, globals(),globals(), ['__name__'])
File "C:\Anaconda\lib\site-packages\obspy-0.8.4_dirty-py2.7.egg\obspy\mseed\core.py", line 6, in <module>
from headers import clibmseed, ENCODINGS, HPTMODULUS, SAMPLETYPE, DATATYPES, \
File "C:\Anaconda\lib\site-packages\obspy-0.8.4_dirty-py2.7.egg\obspy\mseed\headers.py", line 39, in <module>
raise ImportError(msg)
ImportError: Could not load shared library for obspy.mseed.
[Error 126] The specified module could not be found
Traceback (most recent call last):
File "C:\Anaconda\lib\site-packages\obspy-0.8.4_dirty-py2.7.egg\obspy\sac\tests\test_core.py", line 130, in test_writeViaObsPy
tr = read(tempfile)[0]
File "C:\Anaconda\lib\site-packages\obspy-0.8.4_dirty-py2.7.egg\obspy\core\stream.py", line 247, in read
st.extend(_read(file, format, headonly, **kwargs).traces)
File "C:\Anaconda\lib\site-packages\obspy-0.8.4_dirty-py2.7.egg\obspy\core\util\decorator.py", line 151, in wrapped_func
result = func(filename, *args, **kwargs)
File "C:\Anaconda\lib\site-packages\obspy-0.8.4_dirty-py2.7.egg\obspy\core\stream.py", line 288, in _read
headonly=headonly, **kwargs)
File "C:\Anaconda\lib\site-packages\obspy-0.8.4_dirty-py2.7.egg\obspy\core\util\base.py", line 390, in _readFromPlugin
'isFormat')
File "build\bdist.win-amd64\egg\pkg_resources.py", line 337, in load_entry_point
return get_distribution(dist).load_entry_point(group, name)
File "build\bdist.win-amd64\egg\pkg_resources.py", line 2281, in load_entry_point
return ep.load()
File "build\bdist.win-amd64\egg\pkg_resources.py", line 1991, in load
entry = __import__(self.module_name, globals(),globals(), ['__name__'])
File "C:\Anaconda\lib\site-packages\obspy-0.8.4_dirty-py2.7.egg\obspy\mseed\core.py", line 6, in <module>
from headers import clibmseed, ENCODINGS, HPTMODULUS, SAMPLETYPE, DATATYPES, \
File "C:\Anaconda\lib\site-packages\obspy-0.8.4_dirty-py2.7.egg\obspy\mseed\headers.py", line 39, in <module>
raise ImportError(msg)
ImportError: Could not load shared library for obspy.mseed.
[Error 126] The specified module could not be found
Traceback (most recent call last):
File "C:\Anaconda\lib\site-packages\obspy-0.8.4_dirty-py2.7.egg\obspy\sac\tests\test_core.py", line 313, in test_writeSACXYWithMinimumStats
st = read(sac_file)
File "C:\Anaconda\lib\site-packages\obspy-0.8.4_dirty-py2.7.egg\obspy\core\stream.py", line 247, in read
st.extend(_read(file, format, headonly, **kwargs).traces)
File "C:\Anaconda\lib\site-packages\obspy-0.8.4_dirty-py2.7.egg\obspy\core\util\decorator.py", line 151, in wrapped_func
result = func(filename, *args, **kwargs)
File "C:\Anaconda\lib\site-packages\obspy-0.8.4_dirty-py2.7.egg\obspy\core\stream.py", line 288, in _read
headonly=headonly, **kwargs)
File "C:\Anaconda\lib\site-packages\obspy-0.8.4_dirty-py2.7.egg\obspy\core\util\base.py", line 390, in _readFromPlugin
'isFormat')
File "build\bdist.win-amd64\egg\pkg_resources.py", line 337, in load_entry_point
return get_distribution(dist).load_entry_point(group, name)
File "build\bdist.win-amd64\egg\pkg_resources.py", line 2281, in load_entry_point
return ep.load()
File "build\bdist.win-amd64\egg\pkg_resources.py", line 1991, in load
entry = __import__(self.module_name, globals(),globals(), ['__name__'])
File "C:\Anaconda\lib\site-packages\obspy-0.8.4_dirty-py2.7.egg\obspy\mseed\core.py", line 6, in <module>
from headers import clibmseed, ENCODINGS, HPTMODULUS, SAMPLETYPE, DATATYPES, \
File "C:\Anaconda\lib\site-packages\obspy-0.8.4_dirty-py2.7.egg\obspy\mseed\headers.py", line 39, in <module>
raise ImportError(msg)
ImportError: Could not load shared library for obspy.mseed.
[Error 126] The specified module could not be found
Traceback (most recent call last):
File "C:\Anaconda\lib\doctest.py", line 2226, in runTest
raise self.failureException(self.format_failure(new.getvalue()))
AssertionError: Failed doctest test for obspy.sac.__init__
File "C:\Anaconda\lib\site-packages\obspy-0.8.4_dirty-py2.7.egg\obspy\sac\__init__.py", line 1, in __init__
----------------------------------------------------------------------
File "C:\Anaconda\lib\site-packages\obspy-0.8.4_dirty-py2.7.egg\obspy\sac\__init__.py", line 20, in obspy.sac.__init__
Failed example:
st = read('/path/to/test.sac')
Exception raised:
Traceback (most recent call last):
File "C:\Anaconda\lib\doctest.py", line 1315, in __run
compileflags, 1) in test.globs
File "<doctest obspy.sac.__init__[1]>", line 1, in <module>
st = read('/path/to/test.sac')
File "C:\Anaconda\lib\site-packages\obspy-0.8.4_dirty-py2.7.egg\obspy\core\stream.py", line 247, in read
st.extend(_read(file, format, headonly, **kwargs).traces)
File "C:\Anaconda\lib\site-packages\obspy-0.8.4_dirty-py2.7.egg\obspy\core\util\decorator.py", line 151, in wrapped_func
result = func(filename, *args, **kwargs)
File "C:\Anaconda\lib\site-packages\obspy-0.8.4_dirty-py2.7.egg\obspy\core\stream.py", line 288, in _read
headonly=headonly, **kwargs)
File "C:\Anaconda\lib\site-packages\obspy-0.8.4_dirty-py2.7.egg\obspy\core\util\base.py", line 390, in _readFromPlugin
'isFormat')
File "build\bdist.win-amd64\egg\pkg_resources.py", line 337, in load_entry_point
return get_distribution(dist).load_entry_point(group, name)
File "build\bdist.win-amd64\egg\pkg_resources.py", line 2281, in load_entry_point
return ep.load()
File "build\bdist.win-amd64\egg\pkg_resources.py", line 1991, in load
entry = __import__(self.module_name, globals(),globals(), ['__name__'])
File "C:\Anaconda\lib\site-packages\obspy-0.8.4_dirty-py2.7.egg\obspy\mseed\core.py", line 6, in <module>
from headers import clibmseed, ENCODINGS, HPTMODULUS, SAMPLETYPE, DATATYPES, \
File "C:\Anaconda\lib\site-packages\obspy-0.8.4_dirty-py2.7.egg\obspy\mseed\headers.py", line 39, in <module>
raise ImportError(msg)
ImportError: Could not load shared library for obspy.mseed.
[Error 126] The specified module could not be found
----------------------------------------------------------------------
File "C:\Anaconda\lib\site-packages\obspy-0.8.4_dirty-py2.7.egg\obspy\sac\__init__.py", line 21, in obspy.sac.__init__
Failed example:
st #doctest: +ELLIPSIS
Exception raised:
Traceback (most recent call last):
File "C:\Anaconda\lib\doctest.py", line 1315, in __run
compileflags, 1) in test.globs
File "<doctest obspy.sac.__init__[2]>", line 1, in <module>
st #doctest: +ELLIPSIS
NameError: name 'st' is not defined
----------------------------------------------------------------------
File "C:\Anaconda\lib\site-packages\obspy-0.8.4_dirty-py2.7.egg\obspy\sac\__init__.py", line 23, in obspy.sac.__init__
Failed example:
print(st) #doctest: +ELLIPSIS
Exception raised:
Traceback (most recent call last):
File "C:\Anaconda\lib\doctest.py", line 1315, in __run
compileflags, 1) in test.globs
File "<doctest obspy.sac.__init__[3]>", line 1, in <module>
print(st) #doctest: +ELLIPSIS
NameError: name 'st' is not defined
----------------------------------------------------------------------
File "C:\Anaconda\lib\site-packages\obspy-0.8.4_dirty-py2.7.egg\obspy\sac\__init__.py", line 35, in obspy.sac.__init__
Failed example:
print(st[0].stats) # doctest: +NORMALIZE_WHITESPACE +ELLIPSIS
Exception raised:
Traceback (most recent call last):
File "C:\Anaconda\lib\doctest.py", line 1315, in __run
compileflags, 1) in test.globs
File "<doctest obspy.sac.__init__[4]>", line 1, in <module>
print(st[0].stats) # doctest: +NORMALIZE_WHITESPACE +ELLIPSIS
NameError: name 'st' is not defined
----------------------------------------------------------------------
File "C:\Anaconda\lib\site-packages\obspy-0.8.4_dirty-py2.7.egg\obspy\sac\__init__.py", line 51, in obspy.sac.__init__
Failed example:
st[0].data #doctest: +ELLIPSIS +NORMALIZE_WHITESPACE
Exception raised:
Traceback (most recent call last):
File "C:\Anaconda\lib\doctest.py", line 1315, in __run
compileflags, 1) in test.globs
File "<doctest obspy.sac.__init__[5]>", line 1, in <module>
st[0].data #doctest: +ELLIPSIS +NORMALIZE_WHITESPACE
NameError: name 'st' is not defined
Traceback (most recent call last):
File "C:\Anaconda\lib\site-packages\obspy-0.8.4_dirty-py2.7.egg\obspy\sac\tests\test_core.py", line 387, in test_issue390
tr = read(self.file, headonly=True, debug_headers=True)[0]
File "C:\Anaconda\lib\site-packages\obspy-0.8.4_dirty-py2.7.egg\obspy\core\stream.py", line 247, in read
st.extend(_read(file, format, headonly, **kwargs).traces)
File "C:\Anaconda\lib\site-packages\obspy-0.8.4_dirty-py2.7.egg\obspy\core\util\decorator.py", line 151, in wrapped_func
result = func(filename, *args, **kwargs)
File "C:\Anaconda\lib\site-packages\obspy-0.8.4_dirty-py2.7.egg\obspy\core\stream.py", line 288, in _read
headonly=headonly, **kwargs)
File "C:\Anaconda\lib\site-packages\obspy-0.8.4_dirty-py2.7.egg\obspy\core\util\base.py", line 390, in _readFromPlugin
'isFormat')
File "build\bdist.win-amd64\egg\pkg_resources.py", line 337, in load_entry_point
return get_distribution(dist).load_entry_point(group, name)
File "build\bdist.win-amd64\egg\pkg_resources.py", line 2281, in load_entry_point
return ep.load()
File "build\bdist.win-amd64\egg\pkg_resources.py", line 1991, in load
entry = __import__(self.module_name, globals(),globals(), ['__name__'])
File "C:\Anaconda\lib\site-packages\obspy-0.8.4_dirty-py2.7.egg\obspy\mseed\core.py", line 6, in <module>
from headers import clibmseed, ENCODINGS, HPTMODULUS, SAMPLETYPE, DATATYPES, \
File "C:\Anaconda\lib\site-packages\obspy-0.8.4_dirty-py2.7.egg\obspy\mseed\headers.py", line 39, in <module>
raise ImportError(msg)
ImportError: Could not load shared library for obspy.mseed.
[Error 126] The specified module could not be found
Traceback (most recent call last):
File "C:\Anaconda\lib\site-packages\obspy-0.8.4_dirty-py2.7.egg\obspy\sac\tests\test_core.py", line 211, in test_iztype11
tr = read(sod_file)[0]
File "C:\Anaconda\lib\site-packages\obspy-0.8.4_dirty-py2.7.egg\obspy\core\stream.py", line 247, in read
st.extend(_read(file, format, headonly, **kwargs).traces)
File "C:\Anaconda\lib\site-packages\obspy-0.8.4_dirty-py2.7.egg\obspy\core\util\decorator.py", line 151, in wrapped_func
result = func(filename, *args, **kwargs)
File "C:\Anaconda\lib\site-packages\obspy-0.8.4_dirty-py2.7.egg\obspy\core\stream.py", line 288, in _read
headonly=headonly, **kwargs)
File "C:\Anaconda\lib\site-packages\obspy-0.8.4_dirty-py2.7.egg\obspy\core\util\base.py", line 390, in _readFromPlugin
'isFormat')
File "build\bdist.win-amd64\egg\pkg_resources.py", line 337, in load_entry_point
return get_distribution(dist).load_entry_point(group, name)
File "build\bdist.win-amd64\egg\pkg_resources.py", line 2281, in load_entry_point
return ep.load()
File "build\bdist.win-amd64\egg\pkg_resources.py", line 1991, in load
entry = __import__(self.module_name, globals(),globals(), ['__name__'])
File "C:\Anaconda\lib\site-packages\obspy-0.8.4_dirty-py2.7.egg\obspy\mseed\core.py", line 6, in <module>
from headers import clibmseed, ENCODINGS, HPTMODULUS, SAMPLETYPE, DATATYPES, \
File "C:\Anaconda\lib\site-packages\obspy-0.8.4_dirty-py2.7.egg\obspy\mseed\headers.py", line 39, in <module>
raise ImportError(msg)
ImportError: Could not load shared library for obspy.mseed.
[Error 126] The specified module could not be found
Traceback (most recent call last):
File "C:\Anaconda\lib\site-packages\obspy-0.8.4_dirty-py2.7.egg\obspy\sac\tests\test_core.py", line 322, in test_notUsedButGivenHeaders
tr1 = read(self.file)[0]
File "C:\Anaconda\lib\site-packages\obspy-0.8.4_dirty-py2.7.egg\obspy\core\stream.py", line 247, in read
st.extend(_read(file, format, headonly, **kwargs).traces)
File "C:\Anaconda\lib\site-packages\obspy-0.8.4_dirty-py2.7.egg\obspy\core\util\decorator.py", line 151, in wrapped_func
result = func(filename, *args, **kwargs)
File "C:\Anaconda\lib\site-packages\obspy-0.8.4_dirty-py2.7.egg\obspy\core\stream.py", line 288, in _read
headonly=headonly, **kwargs)
File "C:\Anaconda\lib\site-packages\obspy-0.8.4_dirty-py2.7.egg\obspy\core\util\base.py", line 390, in _readFromPlugin
'isFormat')
File "build\bdist.win-amd64\egg\pkg_resources.py", line 337, in load_entry_point
return get_distribution(dist).load_entry_point(group, name)
File "build\bdist.win-amd64\egg\pkg_resources.py", line 2281, in load_entry_point
return ep.load()
File "build\bdist.win-amd64\egg\pkg_resources.py", line 1991, in load
entry = __import__(self.module_name, globals(),globals(), ['__name__'])
File "C:\Anaconda\lib\site-packages\obspy-0.8.4_dirty-py2.7.egg\obspy\mseed\core.py", line 6, in <module>
from headers import clibmseed, ENCODINGS, HPTMODULUS, SAMPLETYPE, DATATYPES, \
File "C:\Anaconda\lib\site-packages\obspy-0.8.4_dirty-py2.7.egg\obspy\mseed\headers.py", line 39, in <module>
raise ImportError(msg)
ImportError: Could not load shared library for obspy.mseed.
[Error 126] The specified module could not be found
Traceback (most recent call last):
File "C:\Anaconda\lib\site-packages\obspy-0.8.4_dirty-py2.7.egg\obspy\sac\tests\test_core.py", line 362, in test_nullTerminatedStrings
tr = read(null_file)[0]
File "C:\Anaconda\lib\site-packages\obspy-0.8.4_dirty-py2.7.egg\obspy\core\stream.py", line 247, in read
st.extend(_read(file, format, headonly, **kwargs).traces)
File "C:\Anaconda\lib\site-packages\obspy-0.8.4_dirty-py2.7.egg\obspy\core\util\decorator.py", line 151, in wrapped_func
result = func(filename, *args, **kwargs)
File "C:\Anaconda\lib\site-packages\obspy-0.8.4_dirty-py2.7.egg\obspy\core\stream.py", line 288, in _read
headonly=headonly, **kwargs)
File "C:\Anaconda\lib\site-packages\obspy-0.8.4_dirty-py2.7.egg\obspy\core\util\base.py", line 390, in _readFromPlugin
'isFormat')
File "build\bdist.win-amd64\egg\pkg_resources.py", line 337, in load_entry_point
return get_distribution(dist).load_entry_point(group, name)
File "build\bdist.win-amd64\egg\pkg_resources.py", line 2281, in load_entry_point
return ep.load()
File "build\bdist.win-amd64\egg\pkg_resources.py", line 1991, in load
entry = __import__(self.module_name, globals(),globals(), ['__name__'])
File "C:\Anaconda\lib\site-packages\obspy-0.8.4_dirty-py2.7.egg\obspy\mseed\core.py", line 6, in <module>
from headers import clibmseed, ENCODINGS, HPTMODULUS, SAMPLETYPE, DATATYPES, \
File "C:\Anaconda\lib\site-packages\obspy-0.8.4_dirty-py2.7.egg\obspy\mseed\headers.py", line 39, in <module>
raise ImportError(msg)
ImportError: Could not load shared library for obspy.mseed.
[Error 126] The specified module could not be found
Traceback (most recent call last):
File "C:\Anaconda\lib\site-packages\obspy-0.8.4_dirty-py2.7.egg\obspy\sac\tests\test_core.py", line 151, in test_readAndWriteViaObsPy
tr = read(self.file)[0]
File "C:\Anaconda\lib\site-packages\obspy-0.8.4_dirty-py2.7.egg\obspy\core\stream.py", line 247, in read
st.extend(_read(file, format, headonly, **kwargs).traces)
File "C:\Anaconda\lib\site-packages\obspy-0.8.4_dirty-py2.7.egg\obspy\core\util\decorator.py", line 151, in wrapped_func
result = func(filename, *args, **kwargs)
File "C:\Anaconda\lib\site-packages\obspy-0.8.4_dirty-py2.7.egg\obspy\core\stream.py", line 288, in _read
headonly=headonly, **kwargs)
File "C:\Anaconda\lib\site-packages\obspy-0.8.4_dirty-py2.7.egg\obspy\core\util\base.py", line 390, in _readFromPlugin
'isFormat')
File "build\bdist.win-amd64\egg\pkg_resources.py", line 337, in load_entry_point
return get_distribution(dist).load_entry_point(group, name)
File "build\bdist.win-amd64\egg\pkg_resources.py", line 2281, in load_entry_point
return ep.load()
File "build\bdist.win-amd64\egg\pkg_resources.py", line 1991, in load
entry = __import__(self.module_name, globals(),globals(), ['__name__'])
File "C:\Anaconda\lib\site-packages\obspy-0.8.4_dirty-py2.7.egg\obspy\mseed\core.py", line 6, in <module>
from headers import clibmseed, ENCODINGS, HPTMODULUS, SAMPLETYPE, DATATYPES, \
File "C:\Anaconda\lib\site-packages\obspy-0.8.4_dirty-py2.7.egg\obspy\mseed\headers.py", line 39, in <module>
raise ImportError(msg)
ImportError: Could not load shared library for obspy.mseed.
[Error 126] The specified module could not be found
Traceback (most recent call last):
File "C:\Anaconda\lib\site-packages\obspy-0.8.4_dirty-py2.7.egg\obspy\sac\tests\test_core.py", line 71, in test_readXYwriteXYViaObspy
tr1 = read(tempfile)[0]
File "C:\Anaconda\lib\site-packages\obspy-0.8.4_dirty-py2.7.egg\obspy\core\stream.py", line 247, in read
st.extend(_read(file, format, headonly, **kwargs).traces)
File "C:\Anaconda\lib\site-packages\obspy-0.8.4_dirty-py2.7.egg\obspy\core\util\decorator.py", line 151, in wrapped_func
result = func(filename, *args, **kwargs)
File "C:\Anaconda\lib\site-packages\obspy-0.8.4_dirty-py2.7.egg\obspy\core\stream.py", line 288, in _read
headonly=headonly, **kwargs)
File "C:\Anaconda\lib\site-packages\obspy-0.8.4_dirty-py2.7.egg\obspy\core\util\base.py", line 390, in _readFromPlugin
'isFormat')
File "build\bdist.win-amd64\egg\pkg_resources.py", line 337, in load_entry_point
return get_distribution(dist).load_entry_point(group, name)
File "build\bdist.win-amd64\egg\pkg_resources.py", line 2281, in load_entry_point
return ep.load()
File "build\bdist.win-amd64\egg\pkg_resources.py", line 1991, in load
entry = __import__(self.module_name, globals(),globals(), ['__name__'])
File "C:\Anaconda\lib\site-packages\obspy-0.8.4_dirty-py2.7.egg\obspy\mseed\core.py", line 6, in <module>
from headers import clibmseed, ENCODINGS, HPTMODULUS, SAMPLETYPE, DATATYPES, \
File "C:\Anaconda\lib\site-packages\obspy-0.8.4_dirty-py2.7.egg\obspy\mseed\headers.py", line 39, in <module>
raise ImportError(msg)
ImportError: Could not load shared library for obspy.mseed.
[Error 126] The specified module could not be found
Traceback (most recent call last):
File "C:\Anaconda\lib\site-packages\obspy-0.8.4_dirty-py2.7.egg\obspy\sac\tests\test_core.py", line 53, in test_readwriteViaObspy
tr1 = read(tempfile)[0]
File "C:\Anaconda\lib\site-packages\obspy-0.8.4_dirty-py2.7.egg\obspy\core\stream.py", line 247, in read
st.extend(_read(file, format, headonly, **kwargs).traces)
File "C:\Anaconda\lib\site-packages\obspy-0.8.4_dirty-py2.7.egg\obspy\core\util\decorator.py", line 151, in wrapped_func
result = func(filename, *args, **kwargs)
File "C:\Anaconda\lib\site-packages\obspy-0.8.4_dirty-py2.7.egg\obspy\core\stream.py", line 288, in _read
headonly=headonly, **kwargs)
File "C:\Anaconda\lib\site-packages\obspy-0.8.4_dirty-py2.7.egg\obspy\core\util\base.py", line 390, in _readFromPlugin
'isFormat')
File "build\bdist.win-amd64\egg\pkg_resources.py", line 337, in load_entry_point
return get_distribution(dist).load_entry_point(group, name)
File "build\bdist.win-amd64\egg\pkg_resources.py", line 2281, in load_entry_point
return ep.load()
File "build\bdist.win-amd64\egg\pkg_resources.py", line 1991, in load
entry = __import__(self.module_name, globals(),globals(), ['__name__'])
File "C:\Anaconda\lib\site-packages\obspy-0.8.4_dirty-py2.7.egg\obspy\mseed\core.py", line 6, in <module>
from headers import clibmseed, ENCODINGS, HPTMODULUS, SAMPLETYPE, DATATYPES, \
File "C:\Anaconda\lib\site-packages\obspy-0.8.4_dirty-py2.7.egg\obspy\mseed\headers.py", line 39, in <module>
raise ImportError(msg)
ImportError: Could not load shared library for obspy.mseed.
[Error 126] The specified module could not be found
Traceback (most recent call last):
File "C:\Anaconda\lib\site-packages\obspy-0.8.4_dirty-py2.7.egg\obspy\sac\tests\test_core.py", line 82, in test_readwriteXYViaObspy
tr1 = read(tempfile)[0]
File "C:\Anaconda\lib\site-packages\obspy-0.8.4_dirty-py2.7.egg\obspy\core\stream.py", line 247, in read
st.extend(_read(file, format, headonly, **kwargs).traces)
File "C:\Anaconda\lib\site-packages\obspy-0.8.4_dirty-py2.7.egg\obspy\core\util\decorator.py", line 151, in wrapped_func
result = func(filename, *args, **kwargs)
File "C:\Anaconda\lib\site-packages\obspy-0.8.4_dirty-py2.7.egg\obspy\core\stream.py", line 288, in _read
headonly=headonly, **kwargs)
File "C:\Anaconda\lib\site-packages\obspy-0.8.4_dirty-py2.7.egg\obspy\core\util\base.py", line 390, in _readFromPlugin
'isFormat')
File "build\bdist.win-amd64\egg\pkg_resources.py", line 337, in load_entry_point
return get_distribution(dist).load_entry_point(group, name)
File "build\bdist.win-amd64\egg\pkg_resources.py", line 2281, in load_entry_point
return ep.load()
File "build\bdist.win-amd64\egg\pkg_resources.py", line 1991, in load
entry = __import__(self.module_name, globals(),globals(), ['__name__'])
File "C:\Anaconda\lib\site-packages\obspy-0.8.4_dirty-py2.7.egg\obspy\mseed\core.py", line 6, in <module>
from headers import clibmseed, ENCODINGS, HPTMODULUS, SAMPLETYPE, DATATYPES, \
File "C:\Anaconda\lib\site-packages\obspy-0.8.4_dirty-py2.7.egg\obspy\mseed\headers.py", line 39, in <module>
raise ImportError(msg)
ImportError: Could not load shared library for obspy.mseed.
[Error 126] The specified module could not be found
Traceback (most recent call last):
File "C:\Anaconda\lib\site-packages\obspy-0.8.4_dirty-py2.7.egg\obspy\sac\tests\test_core.py", line 239, in test_referenceTime
tr = read(file)[0]
File "C:\Anaconda\lib\site-packages\obspy-0.8.4_dirty-py2.7.egg\obspy\core\stream.py", line 247, in read
st.extend(_read(file, format, headonly, **kwargs).traces)
File "C:\Anaconda\lib\site-packages\obspy-0.8.4_dirty-py2.7.egg\obspy\core\util\decorator.py", line 151, in wrapped_func
result = func(filename, *args, **kwargs)
File "C:\Anaconda\lib\site-packages\obspy-0.8.4_dirty-py2.7.egg\obspy\core\stream.py", line 288, in _read
headonly=headonly, **kwargs)
File "C:\Anaconda\lib\site-packages\obspy-0.8.4_dirty-py2.7.egg\obspy\core\util\base.py", line 390, in _readFromPlugin
'isFormat')
File "build\bdist.win-amd64\egg\pkg_resources.py", line 337, in load_entry_point
return get_distribution(dist).load_entry_point(group, name)
File "build\bdist.win-amd64\egg\pkg_resources.py", line 2281, in load_entry_point
return ep.load()
File "build\bdist.win-amd64\egg\pkg_resources.py", line 1991, in load
entry = __import__(self.module_name, globals(),globals(), ['__name__'])
File "C:\Anaconda\lib\site-packages\obspy-0.8.4_dirty-py2.7.egg\obspy\mseed\core.py", line 6, in <module>
from headers import clibmseed, ENCODINGS, HPTMODULUS, SAMPLETYPE, DATATYPES, \
File "C:\Anaconda\lib\site-packages\obspy-0.8.4_dirty-py2.7.egg\obspy\mseed\headers.py", line 39, in <module>
raise ImportError(msg)
ImportError: Could not load shared library for obspy.mseed.
[Error 126] The specified module could not be found
Traceback (most recent call last):
File "C:\Anaconda\lib\site-packages\obspy-0.8.4_dirty-py2.7.egg\obspy\sac\tests\test_core.py", line 261, in test_undefinedB
tr = read(self.file)[0]
File "C:\Anaconda\lib\site-packages\obspy-0.8.4_dirty-py2.7.egg\obspy\core\stream.py", line 247, in read
st.extend(_read(file, format, headonly, **kwargs).traces)
File "C:\Anaconda\lib\site-packages\obspy-0.8.4_dirty-py2.7.egg\obspy\core\util\decorator.py", line 151, in wrapped_func
result = func(filename, *args, **kwargs)
File "C:\Anaconda\lib\site-packages\obspy-0.8.4_dirty-py2.7.egg\obspy\core\stream.py", line 288, in _read
headonly=headonly, **kwargs)
File "C:\Anaconda\lib\site-packages\obspy-0.8.4_dirty-py2.7.egg\obspy\core\util\base.py", line 390, in _readFromPlugin
'isFormat')
File "build\bdist.win-amd64\egg\pkg_resources.py", line 337, in load_entry_point
return get_distribution(dist).load_entry_point(group, name)
File "build\bdist.win-amd64\egg\pkg_resources.py", line 2281, in load_entry_point
return ep.load()
File "build\bdist.win-amd64\egg\pkg_resources.py", line 1991, in load
entry = __import__(self.module_name, globals(),globals(), ['__name__'])
File "C:\Anaconda\lib\site-packages\obspy-0.8.4_dirty-py2.7.egg\obspy\mseed\core.py", line 6, in <module>
from headers import clibmseed, ENCODINGS, HPTMODULUS, SAMPLETYPE, DATATYPES, \
File "C:\Anaconda\lib\site-packages\obspy-0.8.4_dirty-py2.7.egg\obspy\mseed\headers.py", line 39, in <module>
raise ImportError(msg)
ImportError: Could not load shared library for obspy.mseed.
[Error 126] The specified module could not be found
Traceback (most recent call last):
File "C:\Anaconda\lib\site-packages\obspy-0.8.4_dirty-py2.7.egg\obspy\sac\tests\test_core.py", line 289, in test_issue156
st = read(sac_file)
File "C:\Anaconda\lib\site-packages\obspy-0.8.4_dirty-py2.7.egg\obspy\core\stream.py", line 247, in read
st.extend(_read(file, format, headonly, **kwargs).traces)
File "C:\Anaconda\lib\site-packages\obspy-0.8.4_dirty-py2.7.egg\obspy\core\util\decorator.py", line 151, in wrapped_func
result = func(filename, *args, **kwargs)
File "C:\Anaconda\lib\site-packages\obspy-0.8.4_dirty-py2.7.egg\obspy\core\stream.py", line 288, in _read
headonly=headonly, **kwargs)
File "C:\Anaconda\lib\site-packages\obspy-0.8.4_dirty-py2.7.egg\obspy\core\util\base.py", line 390, in _readFromPlugin
'isFormat')
File "build\bdist.win-amd64\egg\pkg_resources.py", line 337, in load_entry_point
return get_distribution(dist).load_entry_point(group, name)
File "build\bdist.win-amd64\egg\pkg_resources.py", line 2281, in load_entry_point
return ep.load()
File "build\bdist.win-amd64\egg\pkg_resources.py", line 1991, in load
entry = __import__(self.module_name, globals(),globals(), ['__name__'])
File "C:\Anaconda\lib\site-packages\obspy-0.8.4_dirty-py2.7.egg\obspy\mseed\core.py", line 6, in <module>
from headers import clibmseed, ENCODINGS, HPTMODULUS, SAMPLETYPE, DATATYPES, \
File "C:\Anaconda\lib\site-packages\obspy-0.8.4_dirty-py2.7.egg\obspy\mseed\headers.py", line 39, in <module>
raise ImportError(msg)
ImportError: Could not load shared library for obspy.mseed.
[Error 126] The specified module could not be found
Traceback (most recent call last):
File "C:\Anaconda\lib\site-packages\obspy-0.8.4_dirty-py2.7.egg\obspy\sac\tests\test_core.py", line 226, in test_defaultValues
tr = read(self.file)[0]
File "C:\Anaconda\lib\site-packages\obspy-0.8.4_dirty-py2.7.egg\obspy\core\stream.py", line 247, in read
st.extend(_read(file, format, headonly, **kwargs).traces)
File "C:\Anaconda\lib\site-packages\obspy-0.8.4_dirty-py2.7.egg\obspy\core\util\decorator.py", line 151, in wrapped_func
result = func(filename, *args, **kwargs)
File "C:\Anaconda\lib\site-packages\obspy-0.8.4_dirty-py2.7.egg\obspy\core\stream.py", line 288, in _read
headonly=headonly, **kwargs)
File "C:\Anaconda\lib\site-packages\obspy-0.8.4_dirty-py2.7.egg\obspy\core\util\base.py", line 390, in _readFromPlugin
'isFormat')
File "build\bdist.win-amd64\egg\pkg_resources.py", line 337, in load_entry_point
return get_distribution(dist).load_entry_point(group, name)
File "build\bdist.win-amd64\egg\pkg_resources.py", line 2281, in load_entry_point
return ep.load()
File "build\bdist.win-amd64\egg\pkg_resources.py", line 1991, in load
entry = __import__(self.module_name, globals(),globals(), ['__name__'])
File "C:\Anaconda\lib\site-packages\obspy-0.8.4_dirty-py2.7.egg\obspy\mseed\core.py", line 6, in <module>
from headers import clibmseed, ENCODINGS, HPTMODULUS, SAMPLETYPE, DATATYPES, \
File "C:\Anaconda\lib\site-packages\obspy-0.8.4_dirty-py2.7.egg\obspy\mseed\headers.py", line 39, in <module>
raise ImportError(msg)
ImportError: Could not load shared library for obspy.mseed.
[Error 126] The specified module could not be found
Traceback (most recent call last):
File "C:\Anaconda\lib\doctest.py", line 2226, in runTest
raise self.failureException(self.format_failure(new.getvalue()))
AssertionError: Failed doctest test for obspy.seisan.core.readSEISAN
File "C:\Anaconda\lib\site-packages\obspy-0.8.4_dirty-py2.7.egg\obspy\seisan\core.py", line 111, in readSEISAN
----------------------------------------------------------------------
File "C:\Anaconda\lib\site-packages\obspy-0.8.4_dirty-py2.7.egg\obspy\seisan\core.py", line 127, in obspy.seisan.core.readSEISAN
Failed example:
st = read("/path/to/2001-01-13-1742-24S.KONO__004")
Exception raised:
Traceback (most recent call last):
File "C:\Anaconda\lib\doctest.py", line 1315, in __run
compileflags, 1) in test.globs
File "<doctest obspy.seisan.core.readSEISAN[1]>", line 1, in <module>
st = read("/path/to/2001-01-13-1742-24S.KONO__004")
File "C:\Anaconda\lib\site-packages\obspy-0.8.4_dirty-py2.7.egg\obspy\core\stream.py", line 253, in read
raise IOError(2, "No such file or directory", pathname)
IOError: [Errno 2] No such file or directory: '/path/to/2001-01-13-1742-24S.KONO__004'
----------------------------------------------------------------------
File "C:\Anaconda\lib\site-packages\obspy-0.8.4_dirty-py2.7.egg\obspy\seisan\core.py", line 128, in obspy.seisan.core.readSEISAN
Failed example:
st # doctest: +ELLIPSIS
Exception raised:
Traceback (most recent call last):
File "C:\Anaconda\lib\doctest.py", line 1315, in __run
compileflags, 1) in test.globs
File "<doctest obspy.seisan.core.readSEISAN[2]>", line 1, in <module>
st # doctest: +ELLIPSIS
NameError: name 'st' is not defined
----------------------------------------------------------------------
File "C:\Anaconda\lib\site-packages\obspy-0.8.4_dirty-py2.7.egg\obspy\seisan\core.py", line 130, in obspy.seisan.core.readSEISAN
Failed example:
print(st) # doctest: +ELLIPSIS
Exception raised:
Traceback (most recent call last):
File "C:\Anaconda\lib\doctest.py", line 1315, in __run
compileflags, 1) in test.globs
File "<doctest obspy.seisan.core.readSEISAN[3]>", line 1, in <module>
print(st) # doctest: +ELLIPSIS
NameError: name 'st' is not defined
Traceback (most recent call last):
File "C:\Anaconda\lib\doctest.py", line 2226, in runTest
raise self.failureException(self.format_failure(new.getvalue()))
AssertionError: Failed doctest test for obspy.seisan.__init__
File "C:\Anaconda\lib\site-packages\obspy-0.8.4_dirty-py2.7.egg\obspy\seisan\__init__.py", line 1, in __init__
----------------------------------------------------------------------
File "C:\Anaconda\lib\site-packages\obspy-0.8.4_dirty-py2.7.egg\obspy\seisan\__init__.py", line 23, in obspy.seisan.__init__
Failed example:
st = read("/path/to/2001-01-13-1742-24S.KONO__004")
Exception raised:
Traceback (most recent call last):
File "C:\Anaconda\lib\doctest.py", line 1315, in __run
compileflags, 1) in test.globs
File "<doctest obspy.seisan.__init__[1]>", line 1, in <module>
st = read("/path/to/2001-01-13-1742-24S.KONO__004")
File "C:\Anaconda\lib\site-packages\obspy-0.8.4_dirty-py2.7.egg\obspy\core\stream.py", line 253, in read
raise IOError(2, "No such file or directory", pathname)
IOError: [Errno 2] No such file or directory: '/path/to/2001-01-13-1742-24S.KONO__004'
----------------------------------------------------------------------
File "C:\Anaconda\lib\site-packages\obspy-0.8.4_dirty-py2.7.egg\obspy\seisan\__init__.py", line 24, in obspy.seisan.__init__
Failed example:
st # doctest: +ELLIPSIS
Exception raised:
Traceback (most recent call last):
File "C:\Anaconda\lib\doctest.py", line 1315, in __run
compileflags, 1) in test.globs
File "<doctest obspy.seisan.__init__[2]>", line 1, in <module>
st # doctest: +ELLIPSIS
NameError: name 'st' is not defined
----------------------------------------------------------------------
File "C:\Anaconda\lib\site-packages\obspy-0.8.4_dirty-py2.7.egg\obspy\seisan\__init__.py", line 26, in obspy.seisan.__init__
Failed example:
print(st) # doctest: +ELLIPSIS
Exception raised:
Traceback (most recent call last):
File "C:\Anaconda\lib\doctest.py", line 1315, in __run
compileflags, 1) in test.globs
File "<doctest obspy.seisan.__init__[3]>", line 1, in <module>
print(st) # doctest: +ELLIPSIS
NameError: name 'st' is not defined
----------------------------------------------------------------------
File "C:\Anaconda\lib\site-packages\obspy-0.8.4_dirty-py2.7.egg\obspy\seisan\__init__.py", line 37, in obspy.seisan.__init__
Failed example:
print(st[0].stats) # doctest: +NORMALIZE_WHITESPACE
Exception raised:
Traceback (most recent call last):
File "C:\Anaconda\lib\doctest.py", line 1315, in __run
compileflags, 1) in test.globs
File "<doctest obspy.seisan.__init__[4]>", line 1, in <module>
print(st[0].stats) # doctest: +NORMALIZE_WHITESPACE
NameError: name 'st' is not defined
----------------------------------------------------------------------
File "C:\Anaconda\lib\site-packages\obspy-0.8.4_dirty-py2.7.egg\obspy\seisan\__init__.py", line 52, in obspy.seisan.__init__
Failed example:
print(st[0].data)
Exception raised:
Traceback (most recent call last):
File "C:\Anaconda\lib\doctest.py", line 1315, in __run
compileflags, 1) in test.globs
File "<doctest obspy.seisan.__init__[5]>", line 1, in <module>
print(st[0].data)
NameError: name 'st' is not defined
Traceback (most recent call last):
File "C:\Anaconda\lib\doctest.py", line 2226, in runTest
raise self.failureException(self.format_failure(new.getvalue()))
AssertionError: Failed doctest test for obspy.sh.__init__
File "C:\Anaconda\lib\site-packages\obspy-0.8.4_dirty-py2.7.egg\obspy\sh\__init__.py", line 0, in __init__
----------------------------------------------------------------------
File "C:\Anaconda\lib\site-packages\obspy-0.8.4_dirty-py2.7.egg\obspy\sh\__init__.py", line 23, in obspy.sh.__init__
Failed example:
st = read("/path/to/QFILE-TEST-ASC.ASC")
Exception raised:
Traceback (most recent call last):
File "C:\Anaconda\lib\doctest.py", line 1315, in __run
compileflags, 1) in test.globs
File "<doctest obspy.sh.__init__[1]>", line 1, in <module>
st = read("/path/to/QFILE-TEST-ASC.ASC")
File "C:\Anaconda\lib\site-packages\obspy-0.8.4_dirty-py2.7.egg\obspy\core\stream.py", line 253, in read
raise IOError(2, "No such file or directory", pathname)
IOError: [Errno 2] No such file or directory: '/path/to/QFILE-TEST-ASC.ASC'
----------------------------------------------------------------------
File "C:\Anaconda\lib\site-packages\obspy-0.8.4_dirty-py2.7.egg\obspy\sh\__init__.py", line 24, in obspy.sh.__init__
Failed example:
st #doctest: +ELLIPSIS
Exception raised:
Traceback (most recent call last):
File "C:\Anaconda\lib\doctest.py", line 1315, in __run
compileflags, 1) in test.globs
File "<doctest obspy.sh.__init__[2]>", line 1, in <module>
st #doctest: +ELLIPSIS
NameError: name 'st' is not defined
----------------------------------------------------------------------
File "C:\Anaconda\lib\site-packages\obspy-0.8.4_dirty-py2.7.egg\obspy\sh\__init__.py", line 26, in obspy.sh.__init__
Failed example:
print(st) # doctest: +ELLIPSIS
Exception raised:
Traceback (most recent call last):
File "C:\Anaconda\lib\doctest.py", line 1315, in __run
compileflags, 1) in test.globs
File "<doctest obspy.sh.__init__[3]>", line 1, in <module>
print(st) # doctest: +ELLIPSIS
NameError: name 'st' is not defined
----------------------------------------------------------------------
File "C:\Anaconda\lib\site-packages\obspy-0.8.4_dirty-py2.7.egg\obspy\sh\__init__.py", line 36, in obspy.sh.__init__
Failed example:
print(st[0].stats) #doctest: +NORMALIZE_WHITESPACE
Exception raised:
Traceback (most recent call last):
File "C:\Anaconda\lib\doctest.py", line 1315, in __run
compileflags, 1) in test.globs
File "<doctest obspy.sh.__init__[4]>", line 1, in <module>
print(st[0].stats) #doctest: +NORMALIZE_WHITESPACE
NameError: name 'st' is not defined
----------------------------------------------------------------------
File "C:\Anaconda\lib\site-packages\obspy-0.8.4_dirty-py2.7.egg\obspy\sh\__init__.py", line 52, in obspy.sh.__init__
Failed example:
st[0].data #doctest: +ELLIPSIS +NORMALIZE_WHITESPACE
Exception raised:
Traceback (most recent call last):
File "C:\Anaconda\lib\doctest.py", line 1315, in __run
compileflags, 1) in test.globs
File "<doctest obspy.sh.__init__[5]>", line 1, in <module>
st[0].data #doctest: +ELLIPSIS +NORMALIZE_WHITESPACE
NameError: name 'st' is not defined
Traceback (most recent call last):
File "C:\Anaconda\lib\doctest.py", line 2226, in runTest
raise self.failureException(self.format_failure(new.getvalue()))
AssertionError: Failed doctest test for obspy.sh.core.readQ
File "C:\Anaconda\lib\site-packages\obspy-0.8.4_dirty-py2.7.egg\obspy\sh\core.py", line 314, in readQ
----------------------------------------------------------------------
File "C:\Anaconda\lib\site-packages\obspy-0.8.4_dirty-py2.7.egg\obspy\sh\core.py", line 354, in obspy.sh.core.readQ
Failed example:
st = read("/path/to/QFILE-TEST.QHD")
Exception raised:
Traceback (most recent call last):
File "C:\Anaconda\lib\doctest.py", line 1315, in __run
compileflags, 1) in test.globs
File "<doctest obspy.sh.core.readQ[1]>", line 1, in <module>
st = read("/path/to/QFILE-TEST.QHD")
File "C:\Anaconda\lib\site-packages\obspy-0.8.4_dirty-py2.7.egg\obspy\core\stream.py", line 253, in read
raise IOError(2, "No such file or directory", pathname)
IOError: [Errno 2] No such file or directory: '/path/to/QFILE-TEST.QHD'
----------------------------------------------------------------------
File "C:\Anaconda\lib\site-packages\obspy-0.8.4_dirty-py2.7.egg\obspy\sh\core.py", line 355, in obspy.sh.core.readQ
Failed example:
st #doctest: +ELLIPSIS
Exception raised:
Traceback (most recent call last):
File "C:\Anaconda\lib\doctest.py", line 1315, in __run
compileflags, 1) in test.globs
File "<doctest obspy.sh.core.readQ[2]>", line 1, in <module>
st #doctest: +ELLIPSIS
NameError: name 'st' is not defined
----------------------------------------------------------------------
File "C:\Anaconda\lib\site-packages\obspy-0.8.4_dirty-py2.7.egg\obspy\sh\core.py", line 357, in obspy.sh.core.readQ
Failed example:
print(st) # doctest: +ELLIPSIS
Exception raised:
Traceback (most recent call last):
File "C:\Anaconda\lib\doctest.py", line 1315, in __run
compileflags, 1) in test.globs
File "<doctest obspy.sh.core.readQ[3]>", line 1, in <module>
print(st) # doctest: +ELLIPSIS
NameError: name 'st' is not defined
Traceback (most recent call last):
File "C:\Anaconda\lib\site-packages\obspy-0.8.4_dirty-py2.7.egg\obspy\sh\tests\test_core.py", line 148, in test_readAndWriteMultiChannelASCFileViaObsPy
stream2 = read(tempfile)
File "C:\Anaconda\lib\site-packages\obspy-0.8.4_dirty-py2.7.egg\obspy\core\stream.py", line 247, in read
st.extend(_read(file, format, headonly, **kwargs).traces)
File "C:\Anaconda\lib\site-packages\obspy-0.8.4_dirty-py2.7.egg\obspy\core\util\decorator.py", line 151, in wrapped_func
result = func(filename, *args, **kwargs)
File "C:\Anaconda\lib\site-packages\obspy-0.8.4_dirty-py2.7.egg\obspy\core\stream.py", line 288, in _read
headonly=headonly, **kwargs)
File "C:\Anaconda\lib\site-packages\obspy-0.8.4_dirty-py2.7.egg\obspy\core\util\base.py", line 390, in _readFromPlugin
'isFormat')
File "build\bdist.win-amd64\egg\pkg_resources.py", line 337, in load_entry_point
return get_distribution(dist).load_entry_point(group, name)
File "build\bdist.win-amd64\egg\pkg_resources.py", line 2281, in load_entry_point
return ep.load()
File "build\bdist.win-amd64\egg\pkg_resources.py", line 1991, in load
entry = __import__(self.module_name, globals(),globals(), ['__name__'])
File "C:\Anaconda\lib\site-packages\obspy-0.8.4_dirty-py2.7.egg\obspy\mseed\core.py", line 6, in <module>
from headers import clibmseed, ENCODINGS, HPTMODULUS, SAMPLETYPE, DATATYPES, \
File "C:\Anaconda\lib\site-packages\obspy-0.8.4_dirty-py2.7.egg\obspy\mseed\headers.py", line 39, in <module>
raise ImportError(msg)
ImportError: Could not load shared library for obspy.mseed.
[Error 126] The specified module could not be found
Traceback (most recent call last):
File "C:\Anaconda\lib\doctest.py", line 2226, in runTest
raise self.failureException(self.format_failure(new.getvalue()))
AssertionError: Failed doctest test for obspy.sh.core.readASC
File "C:\Anaconda\lib\site-packages\obspy-0.8.4_dirty-py2.7.egg\obspy\sh\core.py", line 89, in readASC
----------------------------------------------------------------------
File "C:\Anaconda\lib\site-packages\obspy-0.8.4_dirty-py2.7.egg\obspy\sh\core.py", line 116, in obspy.sh.core.readASC
Failed example:
st = read("/path/to/QFILE-TEST-ASC.ASC")
Exception raised:
Traceback (most recent call last):
File "C:\Anaconda\lib\doctest.py", line 1315, in __run
compileflags, 1) in test.globs
File "<doctest obspy.sh.core.readASC[1]>", line 1, in <module>
st = read("/path/to/QFILE-TEST-ASC.ASC")
File "C:\Anaconda\lib\site-packages\obspy-0.8.4_dirty-py2.7.egg\obspy\core\stream.py", line 253, in read
raise IOError(2, "No such file or directory", pathname)
IOError: [Errno 2] No such file or directory: '/path/to/QFILE-TEST-ASC.ASC'
----------------------------------------------------------------------
File "C:\Anaconda\lib\site-packages\obspy-0.8.4_dirty-py2.7.egg\obspy\sh\core.py", line 117, in obspy.sh.core.readASC
Failed example:
st # doctest: +ELLIPSIS
Exception raised:
Traceback (most recent call last):
File "C:\Anaconda\lib\doctest.py", line 1315, in __run
compileflags, 1) in test.globs
File "<doctest obspy.sh.core.readASC[2]>", line 1, in <module>
st # doctest: +ELLIPSIS
NameError: name 'st' is not defined
----------------------------------------------------------------------
File "C:\Anaconda\lib\site-packages\obspy-0.8.4_dirty-py2.7.egg\obspy\sh\core.py", line 119, in obspy.sh.core.readASC
Failed example:
print(st) # doctest: +ELLIPSIS
Exception raised:
Traceback (most recent call last):
File "C:\Anaconda\lib\doctest.py", line 1315, in __run
compileflags, 1) in test.globs
File "<doctest obspy.sh.core.readASC[3]>", line 1, in <module>
print(st) # doctest: +ELLIPSIS
NameError: name 'st' is not defined
Traceback (most recent call last):
File "C:\Anaconda\lib\site-packages\obspy-0.8.4_dirty-py2.7.egg\obspy\sh\tests\test_core.py", line 204, in test_readAndWriteMultiChannelQFileViaObsPy
stream2 = read(tempfile)
File "C:\Anaconda\lib\site-packages\obspy-0.8.4_dirty-py2.7.egg\obspy\core\stream.py", line 247, in read
st.extend(_read(file, format, headonly, **kwargs).traces)
File "C:\Anaconda\lib\site-packages\obspy-0.8.4_dirty-py2.7.egg\obspy\core\util\decorator.py", line 151, in wrapped_func
result = func(filename, *args, **kwargs)
File "C:\Anaconda\lib\site-packages\obspy-0.8.4_dirty-py2.7.egg\obspy\core\stream.py", line 288, in _read
headonly=headonly, **kwargs)
File "C:\Anaconda\lib\site-packages\obspy-0.8.4_dirty-py2.7.egg\obspy\core\util\base.py", line 390, in _readFromPlugin
'isFormat')
File "build\bdist.win-amd64\egg\pkg_resources.py", line 337, in load_entry_point
return get_distribution(dist).load_entry_point(group, name)
File "build\bdist.win-amd64\egg\pkg_resources.py", line 2281, in load_entry_point
return ep.load()
File "build\bdist.win-amd64\egg\pkg_resources.py", line 1991, in load
entry = __import__(self.module_name, globals(),globals(), ['__name__'])
File "C:\Anaconda\lib\site-packages\obspy-0.8.4_dirty-py2.7.egg\obspy\mseed\core.py", line 6, in <module>
from headers import clibmseed, ENCODINGS, HPTMODULUS, SAMPLETYPE, DATATYPES, \
File "C:\Anaconda\lib\site-packages\obspy-0.8.4_dirty-py2.7.egg\obspy\mseed\headers.py", line 39, in <module>
raise ImportError(msg)
ImportError: Could not load shared library for obspy.mseed.
[Error 126] The specified module could not be found
Traceback (most recent call last):
File "C:\Anaconda\lib\doctest.py", line 2226, in runTest
raise self.failureException(self.format_failure(new.getvalue()))
AssertionError: Failed doctest test for obspy.wav.core.readWAV
File "C:\Anaconda\lib\site-packages\obspy-0.8.4_dirty-py2.7.egg\obspy\wav\core.py", line 61, in readWAV
----------------------------------------------------------------------
File "C:\Anaconda\lib\site-packages\obspy-0.8.4_dirty-py2.7.egg\obspy\wav\core.py", line 80, in obspy.wav.core.readWAV
Failed example:
st = read("/path/to/3cssan.near.8.1.RNON.wav")
Exception raised:
Traceback (most recent call last):
File "C:\Anaconda\lib\doctest.py", line 1315, in __run
compileflags, 1) in test.globs
File "<doctest obspy.wav.core.readWAV[1]>", line 1, in <module>
st = read("/path/to/3cssan.near.8.1.RNON.wav")
File "C:\Anaconda\lib\site-packages\obspy-0.8.4_dirty-py2.7.egg\obspy\core\stream.py", line 247, in read
st.extend(_read(file, format, headonly, **kwargs).traces)
File "C:\Anaconda\lib\site-packages\obspy-0.8.4_dirty-py2.7.egg\obspy\core\util\decorator.py", line 151, in wrapped_func
result = func(filename, *args, **kwargs)
File "C:\Anaconda\lib\site-packages\obspy-0.8.4_dirty-py2.7.egg\obspy\core\stream.py", line 288, in _read
headonly=headonly, **kwargs)
File "C:\Anaconda\lib\site-packages\obspy-0.8.4_dirty-py2.7.egg\obspy\core\util\base.py", line 390, in _readFromPlugin
'isFormat')
File "build\bdist.win-amd64\egg\pkg_resources.py", line 337, in load_entry_point
return get_distribution(dist).load_entry_point(group, name)
File "build\bdist.win-amd64\egg\pkg_resources.py", line 2281, in load_entry_point
return ep.load()
File "build\bdist.win-amd64\egg\pkg_resources.py", line 1991, in load
entry = __import__(self.module_name, globals(),globals(), ['__name__'])
File "C:\Anaconda\lib\site-packages\obspy-0.8.4_dirty-py2.7.egg\obspy\mseed\core.py", line 6, in <module>
from headers import clibmseed, ENCODINGS, HPTMODULUS, SAMPLETYPE, DATATYPES, \
File "C:\Anaconda\lib\site-packages\obspy-0.8.4_dirty-py2.7.egg\obspy\mseed\headers.py", line 39, in <module>
raise ImportError(msg)
ImportError: Could not load shared library for obspy.mseed.
[Error 126] The specified module could not be found
----------------------------------------------------------------------
File "C:\Anaconda\lib\site-packages\obspy-0.8.4_dirty-py2.7.egg\obspy\wav\core.py", line 81, in obspy.wav.core.readWAV
Failed example:
print(st) #doctest: +NORMALIZE_WHITESPACE
Exception raised:
Traceback (most recent call last):
File "C:\Anaconda\lib\doctest.py", line 1315, in __run
compileflags, 1) in test.globs
File "<doctest obspy.wav.core.readWAV[2]>", line 1, in <module>
print(st) #doctest: +NORMALIZE_WHITESPACE
NameError: name 'st' is not defined
Traceback (most recent call last):
File "C:\Anaconda\lib\doctest.py", line 2226, in runTest
raise self.failureException(self.format_failure(new.getvalue()))
AssertionError: Failed doctest test for obspy.wav.__init__
File "C:\Anaconda\lib\site-packages\obspy-0.8.4_dirty-py2.7.egg\obspy\wav\__init__.py", line 0, in __init__
----------------------------------------------------------------------
File "C:\Anaconda\lib\site-packages\obspy-0.8.4_dirty-py2.7.egg\obspy\wav\__init__.py", line 22, in obspy.wav.__init__
Failed example:
st = read("/path/to/3cssan.near.8.1.RNON.wav")
Exception raised:
Traceback (most recent call last):
File "C:\Anaconda\lib\doctest.py", line 1315, in __run
compileflags, 1) in test.globs
File "<doctest obspy.wav.__init__[1]>", line 1, in <module>
st = read("/path/to/3cssan.near.8.1.RNON.wav")
File "C:\Anaconda\lib\site-packages\obspy-0.8.4_dirty-py2.7.egg\obspy\core\stream.py", line 247, in read
st.extend(_read(file, format, headonly, **kwargs).traces)
File "C:\Anaconda\lib\site-packages\obspy-0.8.4_dirty-py2.7.egg\obspy\core\util\decorator.py", line 151, in wrapped_func
result = func(filename, *args, **kwargs)
File "C:\Anaconda\lib\site-packages\obspy-0.8.4_dirty-py2.7.egg\obspy\core\stream.py", line 288, in _read
headonly=headonly, **kwargs)
File "C:\Anaconda\lib\site-packages\obspy-0.8.4_dirty-py2.7.egg\obspy\core\util\base.py", line 390, in _readFromPlugin
'isFormat')
File "build\bdist.win-amd64\egg\pkg_resources.py", line 337, in load_entry_point
return get_distribution(dist).load_entry_point(group, name)
File "build\bdist.win-amd64\egg\pkg_resources.py", line 2281, in load_entry_point
return ep.load()
File "build\bdist.win-amd64\egg\pkg_resources.py", line 1991, in load
entry = __import__(self.module_name, globals(),globals(), ['__name__'])
File "C:\Anaconda\lib\site-packages\obspy-0.8.4_dirty-py2.7.egg\obspy\mseed\core.py", line 6, in <module>
from headers import clibmseed, ENCODINGS, HPTMODULUS, SAMPLETYPE, DATATYPES, \
File "C:\Anaconda\lib\site-packages\obspy-0.8.4_dirty-py2.7.egg\obspy\mseed\headers.py", line 39, in <module>
raise ImportError(msg)
ImportError: Could not load shared library for obspy.mseed.
[Error 126] The specified module could not be found
----------------------------------------------------------------------
File "C:\Anaconda\lib\site-packages\obspy-0.8.4_dirty-py2.7.egg\obspy\wav\__init__.py", line 23, in obspy.wav.__init__
Failed example:
print(st) #doctest: +NORMALIZE_WHITESPACE
Exception raised:
Traceback (most recent call last):
File "C:\Anaconda\lib\doctest.py", line 1315, in __run
compileflags, 1) in test.globs
File "<doctest obspy.wav.__init__[2]>", line 1, in <module>
print(st) #doctest: +NORMALIZE_WHITESPACE
NameError: name 'st' is not defined
----------------------------------------------------------------------
File "C:\Anaconda\lib\site-packages\obspy-0.8.4_dirty-py2.7.egg\obspy\wav\__init__.py", line 33, in obspy.wav.__init__
Failed example:
print(st[0].stats) #doctest: +NORMALIZE_WHITESPACE
Exception raised:
Traceback (most recent call last):
File "C:\Anaconda\lib\doctest.py", line 1315, in __run
compileflags, 1) in test.globs
File "<doctest obspy.wav.__init__[3]>", line 1, in <module>
print(st[0].stats) #doctest: +NORMALIZE_WHITESPACE
NameError: name 'st' is not defined
----------------------------------------------------------------------
File "C:\Anaconda\lib\site-packages\obspy-0.8.4_dirty-py2.7.egg\obspy\wav\__init__.py", line 48, in obspy.wav.__init__
Failed example:
st[0].data
Exception raised:
Traceback (most recent call last):
File "C:\Anaconda\lib\doctest.py", line 1315, in __run
compileflags, 1) in test.globs
File "<doctest obspy.wav.__init__[4]>", line 1, in <module>
st[0].data
NameError: name 'st' is not defined
Traceback (most recent call last):
File "C:\Anaconda\lib\site-packages\obspy-0.8.4_dirty-py2.7.egg\obspy\wav\tests\test_core.py", line 31, in test_readViaObsPy
tr = read(self.file)[0]
File "C:\Anaconda\lib\site-packages\obspy-0.8.4_dirty-py2.7.egg\obspy\core\stream.py", line 247, in read
st.extend(_read(file, format, headonly, **kwargs).traces)
File "C:\Anaconda\lib\site-packages\obspy-0.8.4_dirty-py2.7.egg\obspy\core\util\decorator.py", line 151, in wrapped_func
result = func(filename, *args, **kwargs)
File "C:\Anaconda\lib\site-packages\obspy-0.8.4_dirty-py2.7.egg\obspy\core\stream.py", line 288, in _read
headonly=headonly, **kwargs)
File "C:\Anaconda\lib\site-packages\obspy-0.8.4_dirty-py2.7.egg\obspy\core\util\base.py", line 390, in _readFromPlugin
'isFormat')
File "build\bdist.win-amd64\egg\pkg_resources.py", line 337, in load_entry_point
return get_distribution(dist).load_entry_point(group, name)
File "build\bdist.win-amd64\egg\pkg_resources.py", line 2281, in load_entry_point
return ep.load()
File "build\bdist.win-amd64\egg\pkg_resources.py", line 1991, in load
entry = __import__(self.module_name, globals(),globals(), ['__name__'])
File "C:\Anaconda\lib\site-packages\obspy-0.8.4_dirty-py2.7.egg\obspy\mseed\core.py", line 6, in <module>
from headers import clibmseed, ENCODINGS, HPTMODULUS, SAMPLETYPE, DATATYPES, \
File "C:\Anaconda\lib\site-packages\obspy-0.8.4_dirty-py2.7.egg\obspy\mseed\headers.py", line 39, in <module>
raise ImportError(msg)
ImportError: Could not load shared library for obspy.mseed.
[Error 126] The specified module could not be found
Traceback (most recent call last):
File "C:\Anaconda\lib\site-packages\obspy-0.8.4_dirty-py2.7.egg\obspy\wav\tests\test_core.py", line 109, in test_writeStreamViaObsPy
tr30 = read(testfile0)[0]
File "C:\Anaconda\lib\site-packages\obspy-0.8.4_dirty-py2.7.egg\obspy\core\stream.py", line 247, in read
st.extend(_read(file, format, headonly, **kwargs).traces)
File "C:\Anaconda\lib\site-packages\obspy-0.8.4_dirty-py2.7.egg\obspy\core\util\decorator.py", line 151, in wrapped_func
result = func(filename, *args, **kwargs)
File "C:\Anaconda\lib\site-packages\obspy-0.8.4_dirty-py2.7.egg\obspy\core\stream.py", line 288, in _read
headonly=headonly, **kwargs)
File "C:\Anaconda\lib\site-packages\obspy-0.8.4_dirty-py2.7.egg\obspy\core\util\base.py", line 390, in _readFromPlugin
'isFormat')
File "build\bdist.win-amd64\egg\pkg_resources.py", line 337, in load_entry_point
return get_distribution(dist).load_entry_point(group, name)
File "build\bdist.win-amd64\egg\pkg_resources.py", line 2281, in load_entry_point
return ep.load()
File "build\bdist.win-amd64\egg\pkg_resources.py", line 1991, in load
entry = __import__(self.module_name, globals(),globals(), ['__name__'])
File "C:\Anaconda\lib\site-packages\obspy-0.8.4_dirty-py2.7.egg\obspy\mseed\core.py", line 6, in <module>
from headers import clibmseed, ENCODINGS, HPTMODULUS, SAMPLETYPE, DATATYPES, \
File "C:\Anaconda\lib\site-packages\obspy-0.8.4_dirty-py2.7.egg\obspy\mseed\headers.py", line 39, in <module>
raise ImportError(msg)
ImportError: Could not load shared library for obspy.mseed.
[Error 126] The specified module could not be found
Traceback (most recent call last):
File "C:\Anaconda\lib\site-packages\obspy-0.8.4_dirty-py2.7.egg\obspy\wav\tests\test_core.py", line 67, in test_readAndWriteViaObsPy
tr3 = read(testfile)[0]
File "C:\Anaconda\lib\site-packages\obspy-0.8.4_dirty-py2.7.egg\obspy\core\stream.py", line 247, in read
st.extend(_read(file, format, headonly, **kwargs).traces)
File "C:\Anaconda\lib\site-packages\obspy-0.8.4_dirty-py2.7.egg\obspy\core\util\decorator.py", line 151, in wrapped_func
result = func(filename, *args, **kwargs)
File "C:\Anaconda\lib\site-packages\obspy-0.8.4_dirty-py2.7.egg\obspy\core\stream.py", line 288, in _read
headonly=headonly, **kwargs)
File "C:\Anaconda\lib\site-packages\obspy-0.8.4_dirty-py2.7.egg\obspy\core\util\base.py", line 390, in _readFromPlugin
'isFormat')
File "build\bdist.win-amd64\egg\pkg_resources.py", line 337, in load_entry_point
return get_distribution(dist).load_entry_point(group, name)
File "build\bdist.win-amd64\egg\pkg_resources.py", line 2281, in load_entry_point
return ep.load()
File "build\bdist.win-amd64\egg\pkg_resources.py", line 1991, in load
entry = __import__(self.module_name, globals(),globals(), ['__name__'])
File "C:\Anaconda\lib\site-packages\obspy-0.8.4_dirty-py2.7.egg\obspy\mseed\core.py", line 6, in <module>
from headers import clibmseed, ENCODINGS, HPTMODULUS, SAMPLETYPE, DATATYPES, \
File "C:\Anaconda\lib\site-packages\obspy-0.8.4_dirty-py2.7.egg\obspy\mseed\headers.py", line 39, in <module>
raise ImportError(msg)
ImportError: Could not load shared library for obspy.mseed.
[Error 126] The specified module could not be found
Traceback (most recent call last):
File "C:\Anaconda\lib\site-packages\obspy-0.8.4_dirty-py2.7.egg\obspy\wav\tests\test_core.py", line 44, in test_readHeadViaObsPy
tr = read(self.file, headonly=True)[0]
File "C:\Anaconda\lib\site-packages\obspy-0.8.4_dirty-py2.7.egg\obspy\core\stream.py", line 247, in read
st.extend(_read(file, format, headonly, **kwargs).traces)
File "C:\Anaconda\lib\site-packages\obspy-0.8.4_dirty-py2.7.egg\obspy\core\util\decorator.py", line 151, in wrapped_func
result = func(filename, *args, **kwargs)
File "C:\Anaconda\lib\site-packages\obspy-0.8.4_dirty-py2.7.egg\obspy\core\stream.py", line 288, in _read
headonly=headonly, **kwargs)
File "C:\Anaconda\lib\site-packages\obspy-0.8.4_dirty-py2.7.egg\obspy\core\util\base.py", line 390, in _readFromPlugin
'isFormat')
File "build\bdist.win-amd64\egg\pkg_resources.py", line 337, in load_entry_point
return get_distribution(dist).load_entry_point(group, name)
File "build\bdist.win-amd64\egg\pkg_resources.py", line 2281, in load_entry_point
return ep.load()
File "build\bdist.win-amd64\egg\pkg_resources.py", line 1991, in load
entry = __import__(self.module_name, globals(),globals(), ['__name__'])
File "C:\Anaconda\lib\site-packages\obspy-0.8.4_dirty-py2.7.egg\obspy\mseed\core.py", line 6, in <module>
from headers import clibmseed, ENCODINGS, HPTMODULUS, SAMPLETYPE, DATATYPES, \
File "C:\Anaconda\lib\site-packages\obspy-0.8.4_dirty-py2.7.egg\obspy\mseed\headers.py", line 39, in <module>
raise ImportError(msg)
ImportError: Could not load shared library for obspy.mseed.
[Error 126] The specified module could not be found
Traceback (most recent call last):
File "C:\Anaconda\lib\doctest.py", line 2226, in runTest
raise self.failureException(self.format_failure(new.getvalue()))
AssertionError: Failed doctest test for obspy.xseed.__init__
File "C:\Anaconda\lib\site-packages\obspy-0.8.4_dirty-py2.7.egg\obspy\xseed\__init__.py", line 1, in __init__
----------------------------------------------------------------------
File "C:\Anaconda\lib\site-packages\obspy-0.8.4_dirty-py2.7.egg\obspy\xseed\__init__.py", line 22, in obspy.xseed.__init__
Failed example:
sp = Parser("/path/to/dataless.seed.BW_FURT")
Exception raised:
Traceback (most recent call last):
File "C:\Anaconda\lib\doctest.py", line 1315, in __run
compileflags, 1) in test.globs
File "<doctest obspy.xseed.__init__[1]>", line 1, in <module>
sp = Parser("/path/to/dataless.seed.BW_FURT")
File "C:\Anaconda\lib\site-packages\obspy-0.8.4_dirty-py2.7.egg\obspy\xseed\parser.py", line 95, in __init__
self.read(data)
File "C:\Anaconda\lib\site-packages\obspy-0.8.4_dirty-py2.7.egg\obspy\xseed\parser.py", line 172, in read
raise IOError
IOError

Chuck Norris Fact

Chuck Norris doesn't need a debugger, he just stares down the bug until the code confesses.