#90002 Report by node docker-deb-debian_8_jessie_32bit covering 1953 tests from 54 modules resulted into 3 errors

Report

ObsPy Version
1.1.0
Continuous Integration
-
GitHub Pull Request
-
Report File
XML Document
Total Runtime
726.2 sec
Report Date/Time
2017-10-28 12:47:51

System / Python

Architecture
32bit
Machine
x86_64
Node
docker-deb-debian_8_jessie_32bit
Processor
None
Python Compiler
GCC 4.9.1
Python Implementation
CPython
Python Version
3.4.2
Release
4.9.49-moby
System
Linux
Version
#1 SMP Wed Sep 27 23:17:17 UTC 2017

Dependencies

cartopy
---
decorator
3.4.0
flake8
2.2.2
future
0.16.0
geographiclib
---
lxml.etree
3.4.0
m2crypto
---
matplotlib
1.4.2
mock
1.0.1
mpl_toolkits.basemap
---
numpy
1.8.2
pep8-naming
---
pyflakes
0.8.1
pyimgur
0.5.3
pyproj
1.8.9
requests
2.4.3
scipy
0.14.0
setuptools
5.5.1
shapefile
1.2.1
sqlalchemy
0.9.8

Modules (54)

Module Errors /
Failures
Tracebacks
obspy.clients.arclink 2 1 2
obspy.clients.earthworm - -
obspy.clients.fdsn - -
obspy.clients.filesystem - -
obspy.clients.iris - -
obspy.clients.neic - -
obspy.clients.nrl - -
obspy.clients.seedlink - -
obspy.clients.seishub - -
obspy.clients.syngine 1 3
obspy.core - -
obspy.db - -
obspy.geodetics - -
obspy.imaging - -
obspy.io.ah - -
obspy.io.arclink - -
obspy.io.ascii - -
obspy.io.cmtsolution - -
obspy.io.cnv - -
obspy.io.css - -
obspy.io.gcf - -
obspy.io.gse2 - -
obspy.io.iaspei - -
obspy.io.json - -
obspy.io.kinemetrics - -
obspy.io.kml - -
obspy.io.mseed - -
obspy.io.ndk - -
obspy.io.nied - -
obspy.io.nlloc - -
obspy.io.nordic - -
obspy.io.pdas - -
obspy.io.pde - -
obspy.io.quakeml - -
obspy.io.reftek - -
obspy.io.sac - -
obspy.io.scardec - -
obspy.io.seg2 - -
obspy.io.segy - -
obspy.io.seisan - -
obspy.io.seiscomp - -
obspy.io.sh - -
obspy.io.shapefile - -
obspy.io.stationtxt - -
obspy.io.stationxml - -
obspy.io.wav - -
obspy.io.win - -
obspy.io.xseed - -
obspy.io.y - -
obspy.io.zmap - -
obspy.realtime - -
obspy.scripts - -
obspy.signal - -
obspy.taup - -
Summary 3 3

Tracebacks (3)

Traceback (most recent call last):
File "/usr/lib/python3/dist-packages/obspy/clients/arclink/tests/test_client.py", line 600, in test_get_paz
paz = client.get_paz('BW', 'MANZ', '', 'EHZ', dt)
File "/usr/lib/python3/dist-packages/obspy/clients/arclink/client.py", line 947, in get_paz
instruments=True, route=route)
File "/usr/lib/python3/dist-packages/obspy/clients/arclink/client.py", line 1123, in get_inventory
result = self._fetch(rtype, rdata, route=route)
File "/usr/lib/python3/dist-packages/obspy/clients/arclink/client.py", line 219, in _fetch
return self._request(request_type, request_data)
File "/usr/lib/python3/dist-packages/obspy/clients/arclink/client.py", line 278, in _request
self._read_ln(b'OK')
File "/usr/lib/python3/dist-packages/obspy/clients/arclink/client.py", line 191, in _read_ln
raise ArcLinkException(msg % (value, line.decode()))
obspy.clients.arclink.client.ArcLinkException: Timeout waiting for expected b'OK', got 21932226
Traceback (most recent call last):
File "/usr/lib/python3/dist-packages/obspy/clients/arclink/tests/test_client.py", line 693, in test_issue_311
metadata=False)
File "/usr/lib/python3/dist-packages/obspy/clients/arclink/client.py", line 444, in get_waveforms
compressed=compressed, route=route)
File "/usr/lib/python3/dist-packages/obspy/clients/arclink/client.py", line 565, in save_waveforms
data = self._fetch(rtype, rdata, route=route)
File "/usr/lib/python3/dist-packages/obspy/clients/arclink/client.py", line 225, in _fetch
endtime=request_data[1])
File "/usr/lib/python3/dist-packages/obspy/clients/arclink/client.py", line 622, in get_routing
result = self._fetch(rtype, rdata, route=False)
File "/usr/lib/python3/dist-packages/obspy/clients/arclink/client.py", line 219, in _fetch
return self._request(request_type, request_data)
File "/usr/lib/python3/dist-packages/obspy/clients/arclink/client.py", line 278, in _request
self._read_ln(b'OK')
File "/usr/lib/python3/dist-packages/obspy/clients/arclink/client.py", line 191, in _read_ln
raise ArcLinkException(msg % (value, line.decode()))
obspy.clients.arclink.client.ArcLinkException: Timeout waiting for expected b'OK', got 111987300
Traceback (most recent call last):
File "/usr/lib/python3.4/doctest.py", line 2193, in runTest
raise self.failureException(self.format_failure(new.getvalue()))
AssertionError: Failed doctest test for obspy.clients.syngine.client.Client.get_waveforms_bulk
File "/usr/lib/python3/dist-packages/obspy/clients/syngine/client.py", line 386, in get_waveforms_bulk
----------------------------------------------------------------------
File "/usr/lib/python3/dist-packages/obspy/clients/syngine/client.py", line 419, in obspy.clients.syngine.client.Client.get_waveforms_bulk
Failed example:
st = c.get_waveforms_bulk(
model="ak135f_5s", bulk=bulk, sourcelatitude=12.3,
sourcelongitude=75.3, sourcedepthinmeters=54321,
sourcemomenttensor=[1E19, 1E19, 1E19, 0, 0, 0],
components="Z")
Exception raised:
Traceback (most recent call last):
File "/usr/lib/python3.4/doctest.py", line 1324, in __run
compileflags, 1), test.globs)
File "<doctest obspy.clients.syngine.client.Client.get_waveforms_bulk[3]>", line 5, in <module>
components="Z")
File "/usr/lib/python3/dist-packages/obspy/clients/syngine/client.py", line 608, in get_waveforms_bulk
data=buf, filename=filename)
File "/usr/lib/python3/dist-packages/obspy/clients/base.py", line 245, in _download
self._handle_requests_http_error(r)
File "/usr/lib/python3/dist-packages/obspy/clients/syngine/client.py", line 62, in _handle_requests_http_error
raise ClientHTTPException(msg.strip())
obspy.clients.base.ClientHTTPException: HTTP code 500 when downloading 'http://service.iris.edu/irisws/syngine/1/query':
Error 500: Error calling metadata service, code 500 [Can't connect to service.iris.edu:80 (Bad hostname)
LWP::Protocol::http::Socket: Bad hostname 'service.iris.edu' at /usr/share/perl5/LWP/Protocol/http.pm line 51.
]
More Details:
handler exited, code: 1 reason: Internal Server Error
Request:
http://service.iris.edu/irisws/syngine/1/query
Request Submitted:
2017/10/28 17:43:59 UTC
Service version:
Service: irisws-syngine version: 1.0.4
----------------------------------------------------------------------
File "/usr/lib/python3/dist-packages/obspy/clients/syngine/client.py", line 424, in obspy.clients.syngine.client.Client.get_waveforms_bulk
Failed example:
print(st.sort()) # doctest: +ELLIPSIS
Exception raised:
Traceback (most recent call last):
File "/usr/lib/python3.4/doctest.py", line 1324, in __run
compileflags, 1), test.globs)
File "<doctest obspy.clients.syngine.client.Client.get_waveforms_bulk[4]>", line 1, in <module>
print(st.sort()) # doctest: +ELLIPSIS
NameError: name 'st' is not defined

Skipped Tests (53)

Submodule Test Skip Message
geodetics test_gps_2_dist_azimuth_with_geographiclib (obspy.geodetics.tests.test_util_geodetics.UtilGeodeticsTestCase) Module geographiclib is not installed
geodetics test_issue_375 (obspy.geodetics.tests.test_util_geodetics.UtilGeodeticsTestCase) Module geographiclib is not installed
clients.seishub test_get_channel_ids (obspy.clients.seishub.tests.test_client.ClientTestCase) Seishub test server not reachable.
clients.seishub test_get_coordinates (obspy.clients.seishub.tests.test_client.ClientTestCase) Seishub test server not reachable.
clients.seishub test_get_event_list (obspy.clients.seishub.tests.test_client.ClientTestCase) Seishub test server not reachable.
clients.seishub test_get_location_ids (obspy.clients.seishub.tests.test_client.ClientTestCase) Seishub test server not reachable.
clients.seishub test_get_network_ids (obspy.clients.seishub.tests.test_client.ClientTestCase) Seishub test server not reachable.
clients.seishub test_get_paz (obspy.clients.seishub.tests.test_client.ClientTestCase) Seishub test server not reachable.
clients.seishub test_get_preview (obspy.clients.seishub.tests.test_client.ClientTestCase) Seishub test server not reachable.
clients.seishub test_get_preview_by_ids (obspy.clients.seishub.tests.test_client.ClientTestCase) Seishub test server not reachable.
clients.seishub test_get_station_ids (obspy.clients.seishub.tests.test_client.ClientTestCase) Seishub test server not reachable.
clients.seishub test_get_waveform_with_metadata (obspy.clients.seishub.tests.test_client.ClientTestCase) Seishub test server not reachable.
clients.seishub test_get_waveforms (obspy.clients.seishub.tests.test_client.ClientTestCase) Seishub test server not reachable.
clients.seishub test_localcache (obspy.clients.seishub.tests.test_client.ClientTestCase) Seishub test server not reachable.
clients.seishub test_ping (obspy.clients.seishub.tests.test_client.ClientTestCase) Seishub test server not reachable.
core test_catalog_plot_global (obspy.core.tests.test_event.CatalogBasemapTestCase) basemap not installed
core test_catalog_plot_local (obspy.core.tests.test_event.CatalogBasemapTestCase) basemap not installed
core test_catalog_plot_ortho (obspy.core.tests.test_event.CatalogBasemapTestCase) basemap not installed
core test_catalog_plot_ortho_longitude_wrap (obspy.core.tests.test_event.CatalogBasemapTestCase) basemap not installed
core test_catalog_plot_global (obspy.core.tests.test_event.CatalogCartopyTestCase) Cartopy not installed or too old
core test_catalog_plot_local (obspy.core.tests.test_event.CatalogCartopyTestCase) Cartopy not installed or too old
core test_catalog_plot_ortho (obspy.core.tests.test_event.CatalogCartopyTestCase) Cartopy not installed or too old
core test_catalog_plot_ortho_longitude_wrap (obspy.core.tests.test_event.CatalogCartopyTestCase) Cartopy not installed or too old
core test_plot_farfield_without_quiver_with_maps (obspy.core.tests.test_event.EventTestCase) basemap not installed
core test_location_plot_global (obspy.core.tests.test_network.NetworkBasemapTestCase) basemap not installed
core test_location_plot_local (obspy.core.tests.test_network.NetworkBasemapTestCase) basemap not installed
core test_location_plot_ortho (obspy.core.tests.test_network.NetworkBasemapTestCase) basemap not installed
core test_location_plot_global (obspy.core.tests.test_network.NetworkCartopyTestCase) cartopy not installed
core test_location_plot_local (obspy.core.tests.test_network.NetworkCartopyTestCase) cartopy not installed
core test_location_plot_ortho (obspy.core.tests.test_network.NetworkCartopyTestCase) cartopy not installed
core test_flake8 (obspy.core.tests.test_code_formatting.CodeFormattingTestCase) No code formatting tests for release builds
core test_use_obspy_deprecation_warning (obspy.core.tests.test_code_formatting.CodeFormattingTestCase) No code formatting tests for release builds
core test_future_imports_in_every_file (obspy.core.tests.test_code_formatting.FutureUsageTestCase) No code formatting tests for release builds
core test_no_pyplot_import_in_any_file (obspy.core.tests.test_code_formatting.MatplotlibBackendUsageTestCase) No code formatting tests for release builds
core test_combined_station_event_plot (obspy.core.tests.test_inventory.InventoryBasemapTestCase) basemap not installed
core test_location_plot_global (obspy.core.tests.test_inventory.InventoryBasemapTestCase) basemap not installed
core test_location_plot_local (obspy.core.tests.test_inventory.InventoryBasemapTestCase) basemap not installed
core test_location_plot_ortho (obspy.core.tests.test_inventory.InventoryBasemapTestCase) basemap not installed
core test_location_plot_global (obspy.core.tests.test_inventory.InventoryCartopyTestCase) cartopy not installed
core test_location_plot_local (obspy.core.tests.test_inventory.InventoryCartopyTestCase) cartopy not installed
core test_location_plot_ortho (obspy.core.tests.test_inventory.InventoryCartopyTestCase) cartopy not installed
clients.seedlink test_info (obspy.clients.seedlink.tests.test_slclient.SLClientTestCase) test must be started manually
clients.seedlink test_issue708 (obspy.clients.seedlink.tests.test_slclient.SLClientTestCase) test must be started manually
clients.seedlink test_time_window (obspy.clients.seedlink.tests.test_slclient.SLClientTestCase) test must be started manually
clients.arclink test_m2crypto (obspy.clients.arclink.tests.test_decrypt.ClientTestCase) M2Crypto is not installed
clients.arclink test_pycrypto (obspy.clients.arclink.tests.test_decrypt.ClientTestCase) PyCrypto is not installed
taup test_compute_ray_paths (obspy.taup.tests.test_ray_paths.RayPathCalculationsTestCase) test needs geographiclib >= 1.34
taup test_path_geo (obspy.taup.tests.test_taup_geo.TaupGeoTestCase) Module geographiclib is not installed or too old.
taup test_path_resampling (obspy.taup.tests.test_taup_geo.TaupGeoTestCase) Module geographiclib is not installed or too old.
taup test_p_iasp91_geo_manual (obspy.taup.tests.test_tau.TauPyModelTestCase) Module geographiclib is not installed
taup test_pierce_p_iasp91_geo (obspy.taup.tests.test_tau.TauPyModelTestCase) test needs geographiclib >= 1.34
taup test_single_path_geo_iasp91 (obspy.taup.tests.test_tau.TauPyModelTestCase) test needs geographiclib >= 1.34
imaging test_script_plot (obspy.imaging.tests.test_mopad_script.MopadTestCase) Currently broken until further review.

Slowest Tests (20)

Runtime Test
31.002s test_get_networks (obspy.clients.arclink.tests.test_client.ClientTestCase)
24.837s test_evalresp (obspy.clients.iris.tests.test_client.ClientTestCase)
21.419s test_issue_372 (obspy.clients.arclink.tests.test_client.ClientTestCase)
21.273s test_get_not_existing_waveform (obspy.clients.arclink.tests.test_client.ClientTestCase)
20.659s get_waveforms_bulk (obspy.clients.syngine.client.Client)
20.549s test_issue_311 (obspy.clients.arclink.tests.test_client.ClientTestCase)
20.388s test_get_paz (obspy.clients.arclink.tests.test_client.ClientTestCase)
15.851s test_dataselect_bulk (obspy.clients.fdsn.tests.test_client.ClientTestCase)
13.881s test_get_waveform_instrument_change (obspy.clients.arclink.tests.test_client.ClientTestCase)
12.656s __init__ (obspy.clients.fdsn)
12.454s test_redirection_auth (obspy.clients.fdsn.tests.test_client.ClientTestCase)
11.958s test_get_waveforms (obspy.clients.syngine.tests.test_client.ClientTestCase)
11.245s test_ppsd_restricted_stacks (obspy.signal.tests.test_spectral_estimation.PsdTestCase)
10.621s test_redirection (obspy.clients.fdsn.tests.test_client.ClientTestCase)
10.521s __init__ (obspy.clients.syngine)
10.483s get_waveforms (obspy.clients.fdsn.client.Client)
10.289s test_iris_example_queries_dataselect (obspy.clients.fdsn.tests.test_client.ClientTestCase)
10.241s test_get_inventory (obspy.clients.arclink.tests.test_client.ClientTestCase)
10.179s test_get_routing (obspy.clients.arclink.tests.test_client.ClientTestCase)
8.957s test_get_waveform_with_metadata (obspy.clients.arclink.tests.test_client.ClientTestCase)

Chuck Norris Fact

Chuck Norris can install a 64 bit OS on 32 bit machines.