#90478 Report by node sphinx covering 1956 tests from 54 modules resulted into 4 errors

Report

ObsPy Version
1.1.0.post0+19.g0ed7a93a56....
Continuous Integration
-
GitHub Pull Request
-
Report File
XML Document
Total Runtime
785.5 sec
Report Date/Time
2017-11-15 00:03:26

System / Python

Architecture
32bit
Machine
i686
Node
sphinx
Processor
i686
Python Compiler
GCC 4.4.7 20120313 (Red Hat 4.4.7-1)
Python Implementation
CPython
Python Version
3.4.4
Release
2.6.32-042stab124.2
System
Linux
Version
#1 SMP Fri Sep 1 20:42:18 MSK 2017

Dependencies

cartopy
---
decorator
4.0.6
flake8
2.5.1
future
0.15.2
geographiclib
---
lxml.etree
3.3.5
m2crypto
---
matplotlib
2.0.2
mock
1.3.0
mpl_toolkits.basemap
1.0.7
numpy
1.10.4
pep8-naming
---
pyflakes
1.0.0
pyimgur
---
pyproj
1.9.4
requests
2.9.1
scipy
0.17.0
setuptools
19.6.2
shapefile
---
sqlalchemy
1.0.11

Modules (54)

Module Errors /
Failures
Tracebacks
obspy.clients.arclink - -
obspy.clients.earthworm - -
obspy.clients.fdsn - -
obspy.clients.filesystem - -
obspy.clients.iris - -
obspy.clients.neic - -
obspy.clients.nrl - -
obspy.clients.seedlink 2 1 2
obspy.clients.seishub - -
obspy.clients.syngine 2 3 4
obspy.core - -
obspy.db - -
obspy.geodetics - -
obspy.imaging - -
obspy.io.ah - -
obspy.io.arclink - -
obspy.io.ascii - -
obspy.io.cmtsolution - -
obspy.io.cnv - -
obspy.io.css - -
obspy.io.gcf - -
obspy.io.gse2 - -
obspy.io.iaspei - -
obspy.io.json - -
obspy.io.kinemetrics - -
obspy.io.kml - -
obspy.io.mseed - -
obspy.io.ndk - -
obspy.io.nied - -
obspy.io.nlloc - -
obspy.io.nordic - -
obspy.io.pdas - -
obspy.io.pde - -
obspy.io.quakeml - -
obspy.io.reftek - -
obspy.io.sac - -
obspy.io.scardec - -
obspy.io.seg2 - -
obspy.io.segy - -
obspy.io.seisan - -
obspy.io.seiscomp - -
obspy.io.sh - -
obspy.io.shapefile - -
obspy.io.stationtxt - -
obspy.io.stationxml - -
obspy.io.wav - -
obspy.io.win - -
obspy.io.xseed - -
obspy.io.y - -
obspy.io.zmap - -
obspy.realtime - -
obspy.scripts - -
obspy.signal - -
obspy.taup - -
Summary 4 4

Tracebacks (4)

Traceback (most recent call last):
File "/home/obspy/anaconda3/envs/tmp_build_docs/lib/python3.4/doctest.py", line 2187, in runTest
raise self.failureException(self.format_failure(new.getvalue()))
AssertionError: Failed doctest test for obspy.clients.seedlink.basic_client.Client.get_waveforms
File "/private-backup/home/obspy/update-docs/src/obspy/obspy/clients/seedlink/basic_client.py", line 62, in get_waveforms
----------------------------------------------------------------------
File "/private-backup/home/obspy/update-docs/src/obspy/obspy/clients/seedlink/basic_client.py", line 70, in obspy.clients.seedlink.basic_client.Client.get_waveforms
Failed example:
print(st) # doctest: +ELLIPSIS
Expected:
1 Trace(s) in Stream:
G.FDF.00.BHZ | 20... | 20.0 Hz, ... samples
Got:
0 Trace(s) in Stream:
<BLANKLINE>
----------------------------------------------------------------------
File "/private-backup/home/obspy/update-docs/src/obspy/obspy/clients/seedlink/basic_client.py", line 79, in obspy.clients.seedlink.basic_client.Client.get_waveforms
Failed example:
print(st) # doctest: +ELLIPSIS
Expected:
3 Trace(s) in Stream:
G.FDF.00.BHZ | 20... | 20.0 Hz, ... samples
G.FDF.00.BHN | 20... | 20.0 Hz, ... samples
G.FDF.00.BHE | 20... | 20.0 Hz, ... samples
Got:
0 Trace(s) in Stream:
<BLANKLINE>
Traceback (most recent call last):
File "/private-backup/home/obspy/update-docs/src/obspy/obspy/clients/seedlink/tests/test_basic_client.py", line 42, in test_get_waveform
_test_offset_from_realtime(offset)
File "/private-backup/home/obspy/update-docs/src/obspy/obspy/clients/seedlink/tests/test_basic_client.py", line 25, in _test_offset_from_realtime
self.assertGreater(len(st), 0)
AssertionError: 0 not greater than 0
Traceback (most recent call last):
File "/private-backup/home/obspy/update-docs/src/obspy/obspy/clients/syngine/tests/test_client.py", line 456, in test_reading_saczip_files
self.assertEqual(st, st_bulk)
AssertionError: <obspy.core.stream.Stream object at 0xacbc716c> != <obspy.core.stream.Stream object at 0xae34e38c>
Traceback (most recent call last):
File "/home/obspy/anaconda3/envs/tmp_build_docs/lib/python3.4/doctest.py", line 2187, in runTest
raise self.failureException(self.format_failure(new.getvalue()))
AssertionError: Failed doctest test for obspy.clients.syngine.__init__
File "/private-backup/home/obspy/update-docs/src/obspy/obspy/clients/syngine/__init__.py", line 1, in __init__
----------------------------------------------------------------------
File "/private-backup/home/obspy/update-docs/src/obspy/obspy/clients/syngine/__init__.py", line 54, in obspy.clients.syngine.__init__
Failed example:
st = client.get_waveforms(model="ak135f_5s", network="IU", station="AN*",
eventid="GCMT:C201002270634A",
starttime="P-10", endtime="P+20")
Exception raised:
Traceback (most recent call last):
File "/home/obspy/anaconda3/envs/tmp_build_docs/lib/python3.4/doctest.py", line 1318, in __run
compileflags, 1), test.globs)
File "<doctest obspy.clients.syngine.__init__[5]>", line 3, in <module>
starttime="P-10", endtime="P+20")
File "/private-backup/home/obspy/update-docs/src/obspy/obspy/clients/syngine/client.py", line 371, in get_waveforms
filename=filename)
File "/private-backup/home/obspy/update-docs/src/obspy/obspy/clients/base.py", line 245, in _download
self._handle_requests_http_error(r)
File "/private-backup/home/obspy/update-docs/src/obspy/obspy/clients/syngine/client.py", line 62, in _handle_requests_http_error
raise ClientHTTPException(msg.strip())
obspy.clients.base.ClientHTTPException: HTTP code 400 when downloading 'http://service.iris.edu/irisws/syngine/1/query?station=AN%2A&starttime=P-10&eventid=GCMT%3AC201002270634A&format=miniseed&model=ak135f_5s&network=IU&endtime=P%2B20':
Error 400: RECEIVER lat:39.678769, lon:32.7934, netcode:IU, stacode:ANTO, STATUS: Instaseis Error [400]: No seismograms found for the given phase relative offsets. This could either be due to the chosen phase not existing for the specific source-receiver geometry or arriving too late/with too large offsets if the database is not long enough.
More Details:
handler exited, code: 3 reason: Bad Request
Request:
http://service.iris.edu/irisws/syngine/1/query?station=AN%2A&starttime=P-10&eventid=GCMT%3AC201002270634A&format=miniseed&model=ak135f_5s&network=IU&endtime=P%2B20
Request Submitted:
2017/11/15 05:56:16 UTC
Service version:
Service: irisws-syngine version: 1.0.4

Skipped Tests (42)

Submodule Test Skip Message
taup test_compute_ray_paths (obspy.taup.tests.test_ray_paths.RayPathCalculationsTestCase) test needs geographiclib >= 1.34
taup test_path_geo (obspy.taup.tests.test_taup_geo.TaupGeoTestCase) Module geographiclib is not installed or too old.
taup test_path_resampling (obspy.taup.tests.test_taup_geo.TaupGeoTestCase) Module geographiclib is not installed or too old.
taup test_p_iasp91_geo_manual (obspy.taup.tests.test_tau.TauPyModelTestCase) Module geographiclib is not installed
taup test_pierce_p_iasp91_geo (obspy.taup.tests.test_tau.TauPyModelTestCase) test needs geographiclib >= 1.34
taup test_single_path_geo_iasp91 (obspy.taup.tests.test_tau.TauPyModelTestCase) test needs geographiclib >= 1.34
clients.seedlink test_info (obspy.clients.seedlink.tests.test_slclient.SLClientTestCase) test must be started manually
clients.seedlink test_issue708 (obspy.clients.seedlink.tests.test_slclient.SLClientTestCase) test must be started manually
clients.seedlink test_time_window (obspy.clients.seedlink.tests.test_slclient.SLClientTestCase) test must be started manually
core test_flake8 (obspy.core.tests.test_code_formatting.CodeFormattingTestCase) Formatting tests require at least flake8 3.0.
core test_location_plot_global (obspy.core.tests.test_network.NetworkCartopyTestCase) cartopy not installed
core test_location_plot_local (obspy.core.tests.test_network.NetworkCartopyTestCase) cartopy not installed
core test_location_plot_ortho (obspy.core.tests.test_network.NetworkCartopyTestCase) cartopy not installed
core test_location_plot_global (obspy.core.tests.test_inventory.InventoryCartopyTestCase) cartopy not installed
core test_location_plot_local (obspy.core.tests.test_inventory.InventoryCartopyTestCase) cartopy not installed
core test_location_plot_ortho (obspy.core.tests.test_inventory.InventoryCartopyTestCase) cartopy not installed
core test_catalog_plot_global (obspy.core.tests.test_event.CatalogCartopyTestCase) Cartopy not installed or too old
core test_catalog_plot_local (obspy.core.tests.test_event.CatalogCartopyTestCase) Cartopy not installed or too old
core test_catalog_plot_ortho (obspy.core.tests.test_event.CatalogCartopyTestCase) Cartopy not installed or too old
core test_catalog_plot_ortho_longitude_wrap (obspy.core.tests.test_event.CatalogCartopyTestCase) Cartopy not installed or too old
geodetics test_gps_2_dist_azimuth_with_geographiclib (obspy.geodetics.tests.test_util_geodetics.UtilGeodeticsTestCase) Module geographiclib is not installed
geodetics test_issue_375 (obspy.geodetics.tests.test_util_geodetics.UtilGeodeticsTestCase) Module geographiclib is not installed
clients.arclink test_get_waveform_with_default_dcid_key_file (obspy.clients.arclink.tests.test_decrypt.ClientTestCase) $HOME/dcidpasswords.txt already exists
clients.arclink test_m2crypto (obspy.clients.arclink.tests.test_decrypt.ClientTestCase) M2Crypto is not installed
io.shapefile test_write_catalog_shapefile (obspy.io.shapefile.tests.test_core.ShapefileTestCase) pyshp not installed
io.shapefile test_write_catalog_shapefile_via_plugin (obspy.io.shapefile.tests.test_core.ShapefileTestCase) pyshp not installed
io.shapefile test_write_inventory_shapefile (obspy.io.shapefile.tests.test_core.ShapefileTestCase) pyshp not installed
io.shapefile test_write_inventory_shapefile_via_plugin (obspy.io.shapefile.tests.test_core.ShapefileTestCase) pyshp not installed
imaging test_script_plot (obspy.imaging.tests.test_mopad_script.MopadTestCase) Currently broken until further review.
clients.seishub test_get_channel_ids (obspy.clients.seishub.tests.test_client.ClientTestCase) Seishub test server not reachable.
clients.seishub test_get_coordinates (obspy.clients.seishub.tests.test_client.ClientTestCase) Seishub test server not reachable.
clients.seishub test_get_event_list (obspy.clients.seishub.tests.test_client.ClientTestCase) Seishub test server not reachable.
clients.seishub test_get_location_ids (obspy.clients.seishub.tests.test_client.ClientTestCase) Seishub test server not reachable.
clients.seishub test_get_network_ids (obspy.clients.seishub.tests.test_client.ClientTestCase) Seishub test server not reachable.
clients.seishub test_get_paz (obspy.clients.seishub.tests.test_client.ClientTestCase) Seishub test server not reachable.
clients.seishub test_get_preview (obspy.clients.seishub.tests.test_client.ClientTestCase) Seishub test server not reachable.
clients.seishub test_get_preview_by_ids (obspy.clients.seishub.tests.test_client.ClientTestCase) Seishub test server not reachable.
clients.seishub test_get_station_ids (obspy.clients.seishub.tests.test_client.ClientTestCase) Seishub test server not reachable.
clients.seishub test_get_waveform_with_metadata (obspy.clients.seishub.tests.test_client.ClientTestCase) Seishub test server not reachable.
clients.seishub test_get_waveforms (obspy.clients.seishub.tests.test_client.ClientTestCase) Seishub test server not reachable.
clients.seishub test_localcache (obspy.clients.seishub.tests.test_client.ClientTestCase) Seishub test server not reachable.
clients.seishub test_ping (obspy.clients.seishub.tests.test_client.ClientTestCase) Seishub test server not reachable.

Slowest Tests (20)

Runtime Test
41.435s get_waveforms (obspy.clients.seedlink.basic_client.Client)
20.663s test_get_waveform (obspy.clients.seedlink.tests.test_basic_client.ClientTestCase)
20.591s test_plot_farfield_without_quiver_with_maps (obspy.core.tests.test_event.EventTestCase)
20.145s test_get_networks (obspy.clients.arclink.tests.test_client.ClientTestCase)
11.819s test_dataselect_bulk (obspy.clients.fdsn.tests.test_client.ClientTestCase)
11.694s test_response_calculation_from_seed_and_xseed (obspy.io.xseed.tests.test_core.CoreTestCase)
11.479s test_delayed_request (obspy.clients.arclink.tests.test_client.ClientTestCase)
11.290s __init__ (obspy.taup)
11.055s test_redirection_auth (obspy.clients.fdsn.tests.test_client.ClientTestCase)
9.870s test_get_waveform_instrument_change (obspy.clients.arclink.tests.test_client.ClientTestCase)
9.808s test_plot_multiple_traces (obspy.imaging.tests.test_waveform.WaveformTestCase)
9.363s test_redirection (obspy.clients.fdsn.tests.test_client.ClientTestCase)
8.231s test_plot_wiggles_vertical_section (obspy.imaging.tests.test_waveform.WaveformTestCase)
8.102s test_shoot_existing_ray_param (obspy.taup.tests.test_seismic_phase.TauPySeismicPhaseTestCase)
8.024s test_ppsd_restricted_stacks (obspy.signal.tests.test_spectral_estimation.PsdTestCase)
8.006s test_evalresp (obspy.clients.iris.tests.test_client.ClientTestCase)
7.680s test_plot_wiggles_horizontal_section (obspy.imaging.tests.test_waveform.WaveformTestCase)
7.553s test_plot_wiggles_negative_section (obspy.imaging.tests.test_waveform.WaveformTestCase)
7.548s test_plot_wiggles_positive_section (obspy.imaging.tests.test_waveform.WaveformTestCase)
7.512s test_plot_azim_section (obspy.imaging.tests.test_waveform.WaveformTestCase)

Chuck Norris Fact

No statement can catch the ChuckNorrisException.