#92847 Report by node docker-deb-debian_8_jessie_armhf covering 1953 tests from 54 modules resulted into 15 errors

Report

ObsPy Version
1.1.0
Continuous Integration
-
GitHub Pull Request
-
Report File
XML Document
Total Runtime
5494.6 sec
Report Date/Time
2018-03-05 10:30:07

System / Python

Architecture
32bit
Machine
armv7l
Node
docker-deb-debian_8_jessie_armhf
Processor
None
Python Compiler
GCC 4.9.1
Python Implementation
CPython
Python Version
3.4.2
Release
4.9.0-0.bpo.5-amd64
System
Linux
Version
#1 SMP Debian 4.9.65-3+deb9u2~bpo8+1 (2017-01-05)

Dependencies

cartopy
---
decorator
3.4.0
flake8
2.2.2
future
0.16.0
geographiclib
---
lxml.etree
3.4.0
m2crypto
---
matplotlib
1.4.2
mock
1.0.1
mpl_toolkits.basemap
---
numpy
1.8.2
pep8-naming
---
pyflakes
0.8.1
pyimgur
0.5.3
pyproj
1.8.9
requests
2.4.3
scipy
0.14.0
setuptools
5.5.1
shapefile
1.2.1
sqlalchemy
0.9.8

Modules (54)

Module Errors /
Failures
Tracebacks
obspy.clients.arclink 2 1 2
obspy.clients.earthworm - -
obspy.clients.fdsn 2 3 4
obspy.clients.filesystem - -
obspy.clients.iris - -
obspy.clients.neic 5 5 6 7 8 9
obspy.clients.nrl - -
obspy.clients.seedlink - -
obspy.clients.seishub - -
obspy.clients.syngine 6 10 11 12 13 14 15
obspy.core - -
obspy.db - -
obspy.geodetics - -
obspy.imaging - -
obspy.io.ah - -
obspy.io.arclink - -
obspy.io.ascii - -
obspy.io.cmtsolution - -
obspy.io.cnv - -
obspy.io.css - -
obspy.io.gcf - -
obspy.io.gse2 - -
obspy.io.iaspei - -
obspy.io.json - -
obspy.io.kinemetrics - -
obspy.io.kml - -
obspy.io.mseed - -
obspy.io.ndk - -
obspy.io.nied - -
obspy.io.nlloc - -
obspy.io.nordic - -
obspy.io.pdas - -
obspy.io.pde - -
obspy.io.quakeml - -
obspy.io.reftek - -
obspy.io.sac - -
obspy.io.scardec - -
obspy.io.seg2 - -
obspy.io.segy - -
obspy.io.seisan - -
obspy.io.seiscomp - -
obspy.io.sh - -
obspy.io.shapefile - -
obspy.io.stationtxt - -
obspy.io.stationxml - -
obspy.io.wav - -
obspy.io.win - -
obspy.io.xseed - -
obspy.io.y - -
obspy.io.zmap - -
obspy.realtime - -
obspy.scripts - -
obspy.signal - -
obspy.taup - -
Summary 15 15

Tracebacks (15)

Traceback (most recent call last):
File "/usr/lib/python3/dist-packages/obspy/clients/arclink/tests/test_client.py", line 142, in test_get_routing
results = client.get_routing('GE', 'APE', dt, dt + 1)
File "/usr/lib/python3/dist-packages/obspy/clients/arclink/client.py", line 622, in get_routing
result = self._fetch(rtype, rdata, route=False)
File "/usr/lib/python3/dist-packages/obspy/clients/arclink/client.py", line 219, in _fetch
return self._request(request_type, request_data)
File "/usr/lib/python3/dist-packages/obspy/clients/arclink/client.py", line 278, in _request
self._read_ln(b'OK')
File "/usr/lib/python3/dist-packages/obspy/clients/arclink/client.py", line 191, in _read_ln
raise ArcLinkException(msg % (value, line.decode()))
obspy.clients.arclink.client.ArcLinkException: Timeout waiting for expected b'OK', got 127011084
Traceback (most recent call last):
File "/usr/lib/python3/dist-packages/obspy/clients/arclink/tests/test_client.py", line 773, in test_get_waveform_instrument_change
metadata=True)
File "/usr/lib/python3/dist-packages/obspy/clients/arclink/client.py", line 458, in get_waveforms
instruments=True, route=route)
File "/usr/lib/python3/dist-packages/obspy/clients/arclink/client.py", line 1123, in get_inventory
result = self._fetch(rtype, rdata, route=route)
File "/usr/lib/python3/dist-packages/obspy/clients/arclink/client.py", line 225, in _fetch
endtime=request_data[1])
File "/usr/lib/python3/dist-packages/obspy/clients/arclink/client.py", line 622, in get_routing
result = self._fetch(rtype, rdata, route=False)
File "/usr/lib/python3/dist-packages/obspy/clients/arclink/client.py", line 219, in _fetch
return self._request(request_type, request_data)
File "/usr/lib/python3/dist-packages/obspy/clients/arclink/client.py", line 324, in _request
raise ArcLinkException("%s %s" % (err_code, msg))
obspy.clients.arclink.client.ArcLinkException: b'UNSET'
Traceback (most recent call last):
File "/usr/lib/python3/dist-packages/obspy/clients/fdsn/tests/test_eidaws_routing_client.py", line 363, in test_get_stations_integration_test
self.assertEqual(inv.get_contents(), inv2.get_contents())
AssertionError: {'channels': [], 'networks': ['BA', 'BE', 'BN', 'BS', 'BW'], 'stations': []} != {'channels': [], 'networks': ['BA', 'BE', 'BN', 'BW'], 'stations': []}
- {'channels': [], 'networks': ['BA', 'BE', 'BN', 'BS', 'BW'], 'stations': []}
? ------
+ {'channels': [], 'networks': ['BA', 'BE', 'BN', 'BW'], 'stations': []}
Traceback (most recent call last):
File "/usr/lib/python3/dist-packages/obspy/clients/fdsn/tests/test_federator_routing_client.py", line 342, in test_get_stations_integration_test
channel="LHZ", level="network")
File "<string>", line 2, in get_stations
File "/usr/lib/python3/dist-packages/obspy/clients/fdsn/routing/routing_client.py", line 79, in _assert_filename_not_in_kwargs
return f(*args, **kwargs)
File "/usr/lib/python3/dist-packages/obspy/clients/fdsn/routing/federator_routing_client.py", line 110, in get_stations
return super(FederatorRoutingClient, self).get_stations(**kwargs)
File "<string>", line 2, in get_stations
File "/usr/lib/python3/dist-packages/obspy/clients/fdsn/routing/routing_client.py", line 79, in _assert_filename_not_in_kwargs
return f(*args, **kwargs)
File "/usr/lib/python3/dist-packages/obspy/clients/fdsn/routing/routing_client.py", line 344, in get_stations
return self.get_stations_bulk([bulk], **kwargs)
File "<string>", line 2, in get_stations_bulk
File "/usr/lib/python3/dist-packages/obspy/clients/fdsn/routing/routing_client.py", line 79, in _assert_filename_not_in_kwargs
return f(*args, **kwargs)
File "/usr/lib/python3/dist-packages/obspy/clients/fdsn/routing/federator_routing_client.py", line 143, in get_stations_bulk
r = self._download(self._url + "/query", data=bulk_str)
File "/usr/lib/python3/dist-packages/obspy/clients/base.py", line 245, in _download
self._handle_requests_http_error(r)
File "/usr/lib/python3/dist-packages/obspy/clients/fdsn/routing/routing_client.py", line 280, in _handle_requests_http_error
raise_on_error(r.status_code, get_reason_from_response(r))
File "/usr/lib/python3/dist-packages/obspy/clients/fdsn/client.py", line 1710, in raise_on_error
raise FDSNException(msg, server_info)
obspy.clients.fdsn.header.FDSNException: Bad request. If you think your request was valid please contact the developers.
Traceback (most recent call last):
File "/usr/lib/python3/dist-packages/obspy/clients/neic/tests/test_client.py", line 50, in test_get_waveform_nscl
st = client.get_waveforms_nscl("IUANMO BH.00", t, duration_long)
File "/usr/lib/python3/dist-packages/obspy/clients/neic/client.py", line 191, in get_waveforms_nscl
s.connect((self.host, self.port))
TimeoutError: [Errno 110] Connection timed out
Traceback (most recent call last):
File "/usr/lib/python3.4/doctest.py", line 2193, in runTest
raise self.failureException(self.format_failure(new.getvalue()))
AssertionError: Failed doctest test for obspy.clients.neic.client.Client.get_waveforms
File "/usr/lib/python3/dist-packages/obspy/clients/neic/client.py", line 73, in get_waveforms
----------------------------------------------------------------------
File "/usr/lib/python3/dist-packages/obspy/clients/neic/client.py", line 112, in obspy.clients.neic.client.Client.get_waveforms
Failed example:
st = client.get_waveforms("IU", "ANMO", "0?", "BH?", t, t + 10)
Exception raised:
Traceback (most recent call last):
File "/usr/lib/python3.4/doctest.py", line 1324, in __run
compileflags, 1), test.globs)
File "<doctest obspy.clients.neic.client.Client.get_waveforms[3]>", line 1, in <module>
st = client.get_waveforms("IU", "ANMO", "0?", "BH?", t, t + 10)
File "/usr/lib/python3/dist-packages/obspy/clients/neic/client.py", line 128, in get_waveforms
endtime - starttime)
File "/usr/lib/python3/dist-packages/obspy/clients/neic/client.py", line 191, in get_waveforms_nscl
s.connect((self.host, self.port))
TimeoutError: [Errno 110] Connection timed out
----------------------------------------------------------------------
File "/usr/lib/python3/dist-packages/obspy/clients/neic/client.py", line 113, in obspy.clients.neic.client.Client.get_waveforms
Failed example:
print(st) # doctest: +ELLIPSIS
Exception raised:
Traceback (most recent call last):
File "/usr/lib/python3.4/doctest.py", line 1324, in __run
compileflags, 1), test.globs)
File "<doctest obspy.clients.neic.client.Client.get_waveforms[4]>", line 1, in <module>
print(st) # doctest: +ELLIPSIS
NameError: name 'st' is not defined
Traceback (most recent call last):
File "/usr/lib/python3/dist-packages/obspy/clients/neic/tests/test_client.py", line 27, in test_get_waveform
st = client.get_waveforms_nscl("IUANMO BH.00", t, duration)
File "/usr/lib/python3/dist-packages/obspy/clients/neic/client.py", line 191, in get_waveforms_nscl
s.connect((self.host, self.port))
TimeoutError: [Errno 110] Connection timed out
Traceback (most recent call last):
File "/usr/lib/python3.4/doctest.py", line 2193, in runTest
raise self.failureException(self.format_failure(new.getvalue()))
AssertionError: Failed doctest test for obspy.clients.neic.client.Client
File "/usr/lib/python3/dist-packages/obspy/clients/neic/client.py", line 25, in Client
----------------------------------------------------------------------
File "/usr/lib/python3/dist-packages/obspy/clients/neic/client.py", line 45, in obspy.clients.neic.client.Client
Failed example:
st = client.get_waveforms("IU", "ANMO", "00", "BH?", t, t + 10)
Exception raised:
Traceback (most recent call last):
File "/usr/lib/python3.4/doctest.py", line 1324, in __run
compileflags, 1), test.globs)
File "<doctest obspy.clients.neic.client.Client[3]>", line 1, in <module>
st = client.get_waveforms("IU", "ANMO", "00", "BH?", t, t + 10)
File "/usr/lib/python3/dist-packages/obspy/clients/neic/client.py", line 128, in get_waveforms
endtime - starttime)
File "/usr/lib/python3/dist-packages/obspy/clients/neic/client.py", line 191, in get_waveforms_nscl
s.connect((self.host, self.port))
TimeoutError: [Errno 110] Connection timed out
----------------------------------------------------------------------
File "/usr/lib/python3/dist-packages/obspy/clients/neic/client.py", line 46, in obspy.clients.neic.client.Client
Failed example:
print(st) # doctest: +ELLIPSIS
Exception raised:
Traceback (most recent call last):
File "/usr/lib/python3.4/doctest.py", line 1324, in __run
compileflags, 1), test.globs)
File "<doctest obspy.clients.neic.client.Client[4]>", line 1, in <module>
print(st) # doctest: +ELLIPSIS
NameError: name 'st' is not defined
----------------------------------------------------------------------
File "/usr/lib/python3/dist-packages/obspy/clients/neic/client.py", line 51, in obspy.clients.neic.client.Client
Failed example:
st = client.get_waveforms_nscl("IUANMO BH.00", t, 10)
Exception raised:
Traceback (most recent call last):
File "/usr/lib/python3.4/doctest.py", line 1324, in __run
compileflags, 1), test.globs)
File "<doctest obspy.clients.neic.client.Client[5]>", line 1, in <module>
st = client.get_waveforms_nscl("IUANMO BH.00", t, 10)
File "/usr/lib/python3/dist-packages/obspy/clients/neic/client.py", line 191, in get_waveforms_nscl
s.connect((self.host, self.port))
TimeoutError: [Errno 110] Connection timed out
----------------------------------------------------------------------
File "/usr/lib/python3/dist-packages/obspy/clients/neic/client.py", line 52, in obspy.clients.neic.client.Client
Failed example:
print(st) # doctest: +ELLIPSIS
Exception raised:
Traceback (most recent call last):
File "/usr/lib/python3.4/doctest.py", line 1324, in __run
compileflags, 1), test.globs)
File "<doctest obspy.clients.neic.client.Client[6]>", line 1, in <module>
print(st) # doctest: +ELLIPSIS
NameError: name 'st' is not defined
Traceback (most recent call last):
File "/usr/lib/python3.4/doctest.py", line 2193, in runTest
raise self.failureException(self.format_failure(new.getvalue()))
AssertionError: Failed doctest test for obspy.clients.neic.client.Client.get_waveforms_nscl
File "/usr/lib/python3/dist-packages/obspy/clients/neic/client.py", line 130, in get_waveforms_nscl
----------------------------------------------------------------------
File "/usr/lib/python3/dist-packages/obspy/clients/neic/client.py", line 163, in obspy.clients.neic.client.Client.get_waveforms_nscl
Failed example:
st = client.get_waveforms_nscl("IUANMO BH.00", t, 10)
Exception raised:
Traceback (most recent call last):
File "/usr/lib/python3.4/doctest.py", line 1324, in __run
compileflags, 1), test.globs)
File "<doctest obspy.clients.neic.client.Client.get_waveforms_nscl[4]>", line 1, in <module>
st = client.get_waveforms_nscl("IUANMO BH.00", t, 10)
File "/usr/lib/python3/dist-packages/obspy/clients/neic/client.py", line 191, in get_waveforms_nscl
s.connect((self.host, self.port))
TimeoutError: [Errno 110] Connection timed out
----------------------------------------------------------------------
File "/usr/lib/python3/dist-packages/obspy/clients/neic/client.py", line 164, in obspy.clients.neic.client.Client.get_waveforms_nscl
Failed example:
print(st) # doctest: +ELLIPSIS
Exception raised:
Traceback (most recent call last):
File "/usr/lib/python3.4/doctest.py", line 1324, in __run
compileflags, 1), test.globs)
File "<doctest obspy.clients.neic.client.Client.get_waveforms_nscl[5]>", line 1, in <module>
print(st) # doctest: +ELLIPSIS
NameError: name 'st' is not defined
Traceback (most recent call last):
File "/usr/lib/python3.4/doctest.py", line 2193, in runTest
raise self.failureException(self.format_failure(new.getvalue()))
AssertionError: Failed doctest test for obspy.clients.syngine.__init__
File "/usr/lib/python3/dist-packages/obspy/clients/syngine/__init__.py", line 1, in __init__
----------------------------------------------------------------------
File "/usr/lib/python3/dist-packages/obspy/clients/syngine/__init__.py", line 28, in obspy.clients.syngine.__init__
Failed example:
st = client.get_waveforms(model="ak135f_5s", network="IU", station="ANMO",
eventid="GCMT:C201002270634A")
Exception raised:
Traceback (most recent call last):
File "/usr/lib/python3.4/doctest.py", line 1324, in __run
compileflags, 1), test.globs)
File "<doctest obspy.clients.syngine.__init__[2]>", line 2, in <module>
eventid="GCMT:C201002270634A")
File "/usr/lib/python3/dist-packages/obspy/clients/syngine/client.py", line 371, in get_waveforms
filename=filename)
File "/usr/lib/python3/dist-packages/obspy/clients/base.py", line 245, in _download
self._handle_requests_http_error(r)
File "/usr/lib/python3/dist-packages/obspy/clients/syngine/client.py", line 62, in _handle_requests_http_error
raise ClientHTTPException(msg.strip())
obspy.clients.base.ClientHTTPException: HTTP code 500 when downloading 'http://service.iris.edu/irisws/syngine/1/query?network=IU&eventid=GCMT%3AC201002270634A&format=miniseed&station=ANMO&model=ak135f_5s':
Error 500: GCMT lookup error [404]: <!DOCTYPE HTML PUBLIC "-//IETF//DTD HTML 2.0//EN">
<html><head>
<title>404 Not Found</title>
</head><body>
<h1>Not Found</h1>
<p>The requested URL /spudservice/momenttensor/gcmtid/C201002270634A/ndk was not found on this server.</p>
<p>Additionally, a 302 Found
error was encountered while trying to use an ErrorDocument to handle the request.</p>
<hr>
<address>Apache/2.2.15 (CentOS) Server at ds.iris.edu Port 80</address>
</body></html>
More Details:
handler exited, code: 1 reason: Internal Server Error
Request:
http://service.iris.edu/irisws/syngine/1/query?network=IU&eventid=GCMT%3AC201002270634A&format=miniseed&station=ANMO&model=ak135f_5s
Request Submitted:
2018/03/05 15:19:22 UTC
Service version:
Service: irisws-syngine version: 1.0.4
----------------------------------------------------------------------
File "/usr/lib/python3/dist-packages/obspy/clients/syngine/__init__.py", line 30, in obspy.clients.syngine.__init__
Failed example:
print(st) # doctest: +ELLIPSIS
Exception raised:
Traceback (most recent call last):
File "/usr/lib/python3.4/doctest.py", line 1324, in __run
compileflags, 1), test.globs)
File "<doctest obspy.clients.syngine.__init__[3]>", line 1, in <module>
print(st) # doctest: +ELLIPSIS
NameError: name 'st' is not defined
----------------------------------------------------------------------
File "/usr/lib/python3/dist-packages/obspy/clients/syngine/__init__.py", line 54, in obspy.clients.syngine.__init__
Failed example:
st = client.get_waveforms(model="ak135f_5s", network="IU", station="AN*",
eventid="GCMT:C201002270634A",
starttime="P-10", endtime="P+20")
Exception raised:
Traceback (most recent call last):
File "/usr/lib/python3.4/doctest.py", line 1324, in __run
compileflags, 1), test.globs)
File "<doctest obspy.clients.syngine.__init__[5]>", line 3, in <module>
starttime="P-10", endtime="P+20")
File "/usr/lib/python3/dist-packages/obspy/clients/syngine/client.py", line 371, in get_waveforms
filename=filename)
File "/usr/lib/python3/dist-packages/obspy/clients/base.py", line 245, in _download
self._handle_requests_http_error(r)
File "/usr/lib/python3/dist-packages/obspy/clients/syngine/client.py", line 62, in _handle_requests_http_error
raise ClientHTTPException(msg.strip())
obspy.clients.base.ClientHTTPException: HTTP code 500 when downloading 'http://service.iris.edu/irisws/syngine/1/query?station=AN%2A&starttime=P-10&model=ak135f_5s&network=IU&eventid=GCMT%3AC201002270634A&format=miniseed&endtime=P%2B20':
Error 500: GCMT lookup error [404]: <!DOCTYPE HTML PUBLIC "-//IETF//DTD HTML 2.0//EN">
<html><head>
<title>404 Not Found</title>
</head><body>
<h1>Not Found</h1>
<p>The requested URL /spudservice/momenttensor/gcmtid/C201002270634A/ndk was not found on this server.</p>
<p>Additionally, a 302 Found
error was encountered while trying to use an ErrorDocument to handle the request.</p>
<hr>
<address>Apache/2.2.15 (CentOS) Server at ds.iris.edu Port 80</address>
</body></html>
More Details:
handler exited, code: 1 reason: Internal Server Error
Request:
http://service.iris.edu/irisws/syngine/1/query?station=AN%2A&starttime=P-10&model=ak135f_5s&network=IU&eventid=GCMT%3AC201002270634A&format=miniseed&endtime=P%2B20
Request Submitted:
2018/03/05 15:19:22 UTC
Service version:
Service: irisws-syngine version: 1.0.4
----------------------------------------------------------------------
File "/usr/lib/python3/dist-packages/obspy/clients/syngine/__init__.py", line 79, in obspy.clients.syngine.__init__
Failed example:
st = client.get_waveforms_bulk(
model="ak135f_5s", eventid="GCMT:C201002270634A",
bulk=bulk, starttime="P-10", endtime="P+20")
Exception raised:
Traceback (most recent call last):
File "/usr/lib/python3.4/doctest.py", line 1324, in __run
compileflags, 1), test.globs)
File "<doctest obspy.clients.syngine.__init__[8]>", line 3, in <module>
bulk=bulk, starttime="P-10", endtime="P+20")
File "/usr/lib/python3/dist-packages/obspy/clients/syngine/client.py", line 608, in get_waveforms_bulk
data=buf, filename=filename)
File "/usr/lib/python3/dist-packages/obspy/clients/base.py", line 245, in _download
self._handle_requests_http_error(r)
File "/usr/lib/python3/dist-packages/obspy/clients/syngine/client.py", line 62, in _handle_requests_http_error
raise ClientHTTPException(msg.strip())
obspy.clients.base.ClientHTTPException: HTTP code 500 when downloading 'http://service.iris.edu/irisws/syngine/1/query':
Error 500: GCMT lookup error [404]: <!DOCTYPE HTML PUBLIC "-//IETF//DTD HTML 2.0//EN">
<html><head>
<title>404 Not Found</title>
</head><body>
<h1>Not Found</h1>
<p>The requested URL /spudservice/momenttensor/gcmtid/C201002270634A/ndk was not found on this server.</p>
<p>Additionally, a 302 Found
error was encountered while trying to use an ErrorDocument to handle the request.</p>
<hr>
<address>Apache/2.2.15 (CentOS) Server at ds.iris.edu Port 80</address>
</body></html>
More Details:
handler exited, code: 1 reason: Internal Server Error
Request:
http://service.iris.edu/irisws/syngine/1/query
Request Submitted:
2018/03/05 15:19:23 UTC
Service version:
Service: irisws-syngine version: 1.0.4
----------------------------------------------------------------------
File "/usr/lib/python3/dist-packages/obspy/clients/syngine/__init__.py", line 82, in obspy.clients.syngine.__init__
Failed example:
print(st) # doctest: +ELLIPSIS
Exception raised:
Traceback (most recent call last):
File "/usr/lib/python3.4/doctest.py", line 1324, in __run
compileflags, 1), test.globs)
File "<doctest obspy.clients.syngine.__init__[9]>", line 1, in <module>
print(st) # doctest: +ELLIPSIS
NameError: name 'st' is not defined
Traceback (most recent call last):
File "/usr/lib/python3/dist-packages/obspy/clients/syngine/tests/test_client.py", line 264, in test_error_handling
self.assertIn("HTTP code 400 when", msg)
AssertionError: 'HTTP code 400 when' not found in 'HTTP code 500 when downloading \'http://service.iris.edu/irisws/syngine/1/query?station=ANMO&components=ABC&network=IU&eventid=GCMT%3AC201002270634A&format=miniseed&model=ak135f_5s\':\n\nError 500: GCMT lookup error [404]: <!DOCTYPE HTML PUBLIC "-//IETF//DTD HTML 2.0//EN">\n<html><head>\n<title>404 Not Found</title>\n</head><body>\n<h1>Not Found</h1>\n<p>The requested URL /spudservice/momenttensor/gcmtid/C201002270634A/ndk was not found on this server.</p>\n<p>Additionally, a 302 Found\nerror was encountered while trying to use an ErrorDocument to handle the request.</p>\n<hr>\n<address>Apache/2.2.15 (CentOS) Server at ds.iris.edu Port 80</address>\n</body></html>\n\n\n\nMore Details:\nhandler exited, code: 1 reason: Internal Server Error\n\nRequest:\nhttp://service.iris.edu/irisws/syngine/1/query?station=ANMO&components=ABC&network=IU&eventid=GCMT%3AC201002270634A&format=miniseed&model=ak135f_5s\n\nRequest Submitted:\n2018/03/05 15:19:28 UTC\n\nService version:\nService: irisws-syngine version: 1.0.4'
Traceback (most recent call last):
File "/usr/lib/python3/dist-packages/obspy/clients/syngine/tests/test_client.py", line 353, in test_get_waveforms
components="Z")
File "/usr/lib/python3/dist-packages/obspy/clients/syngine/client.py", line 371, in get_waveforms
filename=filename)
File "/usr/lib/python3/dist-packages/obspy/clients/base.py", line 245, in _download
self._handle_requests_http_error(r)
File "/usr/lib/python3/dist-packages/obspy/clients/syngine/client.py", line 62, in _handle_requests_http_error
raise ClientHTTPException(msg.strip())
obspy.clients.base.ClientHTTPException: HTTP code 500 when downloading 'http://service.iris.edu/irisws/syngine/1/query?station=ANMO&components=Z&network=IU&eventid=GCMT%3AC201002270634A&format=miniseed&model=test':
Error 500: GCMT lookup error [404]: <!DOCTYPE HTML PUBLIC "-//IETF//DTD HTML 2.0//EN">
<html><head>
<title>404 Not Found</title>
</head><body>
<h1>Not Found</h1>
<p>The requested URL /spudservice/momenttensor/gcmtid/C201002270634A/ndk was not found on this server.</p>
<p>Additionally, a 302 Found
error was encountered while trying to use an ErrorDocument to handle the request.</p>
<hr>
<address>Apache/2.2.15 (CentOS) Server at ds.iris.edu Port 80</address>
</body></html>
More Details:
handler exited, code: 1 reason: Internal Server Error
Request:
http://service.iris.edu/irisws/syngine/1/query?station=ANMO&components=Z&network=IU&eventid=GCMT%3AC201002270634A&format=miniseed&model=test
Request Submitted:
2018/03/05 15:19:31 UTC
Service version:
Service: irisws-syngine version: 1.0.4
Traceback (most recent call last):
File "/usr/lib/python3.4/doctest.py", line 2193, in runTest
raise self.failureException(self.format_failure(new.getvalue()))
AssertionError: Failed doctest test for obspy.clients.syngine.client.Client.get_waveforms
File "/usr/lib/python3/dist-packages/obspy/clients/syngine/client.py", line 213, in get_waveforms
----------------------------------------------------------------------
File "/usr/lib/python3/dist-packages/obspy/clients/syngine/client.py", line 227, in obspy.clients.syngine.client.Client.get_waveforms
Failed example:
st = client.get_waveforms(model="ak135f_5s", network="IU",
station="ANMO",
eventid="GCMT:C201002270634A")
Exception raised:
Traceback (most recent call last):
File "/usr/lib/python3.4/doctest.py", line 1324, in __run
compileflags, 1), test.globs)
File "<doctest obspy.clients.syngine.client.Client.get_waveforms[2]>", line 3, in <module>
eventid="GCMT:C201002270634A")
File "/usr/lib/python3/dist-packages/obspy/clients/syngine/client.py", line 371, in get_waveforms
filename=filename)
File "/usr/lib/python3/dist-packages/obspy/clients/base.py", line 245, in _download
self._handle_requests_http_error(r)
File "/usr/lib/python3/dist-packages/obspy/clients/syngine/client.py", line 62, in _handle_requests_http_error
raise ClientHTTPException(msg.strip())
obspy.clients.base.ClientHTTPException: HTTP code 500 when downloading 'http://service.iris.edu/irisws/syngine/1/query?network=IU&eventid=GCMT%3AC201002270634A&format=miniseed&station=ANMO&model=ak135f_5s':
Error 500: GCMT lookup error [404]: <!DOCTYPE HTML PUBLIC "-//IETF//DTD HTML 2.0//EN">
<html><head>
<title>404 Not Found</title>
</head><body>
<h1>Not Found</h1>
<p>The requested URL /spudservice/momenttensor/gcmtid/C201002270634A/ndk was not found on this server.</p>
<p>Additionally, a 302 Found
error was encountered while trying to use an ErrorDocument to handle the request.</p>
<hr>
<address>Apache/2.2.15 (CentOS) Server at ds.iris.edu Port 80</address>
</body></html>
More Details:
handler exited, code: 1 reason: Internal Server Error
Request:
http://service.iris.edu/irisws/syngine/1/query?network=IU&eventid=GCMT%3AC201002270634A&format=miniseed&station=ANMO&model=ak135f_5s
Request Submitted:
2018/03/05 15:19:25 UTC
Service version:
Service: irisws-syngine version: 1.0.4
----------------------------------------------------------------------
File "/usr/lib/python3/dist-packages/obspy/clients/syngine/client.py", line 230, in obspy.clients.syngine.client.Client.get_waveforms
Failed example:
print(st) # doctest: +ELLIPSIS
Exception raised:
Traceback (most recent call last):
File "/usr/lib/python3.4/doctest.py", line 1324, in __run
compileflags, 1), test.globs)
File "<doctest obspy.clients.syngine.client.Client.get_waveforms[3]>", line 1, in <module>
print(st) # doctest: +ELLIPSIS
NameError: name 'st' is not defined
Traceback (most recent call last):
File "/usr/lib/python3/dist-packages/obspy/clients/syngine/tests/test_client.py", line 423, in test_saving_directly_to_file
endtime="P+10", components="Z", filename=tf)
File "/usr/lib/python3/dist-packages/obspy/clients/syngine/client.py", line 371, in get_waveforms
filename=filename)
File "/usr/lib/python3/dist-packages/obspy/clients/base.py", line 245, in _download
self._handle_requests_http_error(r)
File "/usr/lib/python3/dist-packages/obspy/clients/syngine/client.py", line 62, in _handle_requests_http_error
raise ClientHTTPException(msg.strip())
obspy.clients.base.ClientHTTPException: HTTP code 500 when downloading 'http://service.iris.edu/irisws/syngine/1/query?station=ANMO&starttime=P-10&components=Z&network=IU&eventid=GCMT%3AC201002270634A&format=miniseed&model=test&endtime=P%2B10':
Error 500: GCMT lookup error [404]: <!DOCTYPE HTML PUBLIC "-//IETF//DTD HTML 2.0//EN">
<html><head>
<title>404 Not Found</title>
</head><body>
<h1>Not Found</h1>
<p>The requested URL /spudservice/momenttensor/gcmtid/C201002270634A/ndk was not found on this server.</p>
<p>Additionally, a 302 Found
error was encountered while trying to use an ErrorDocument to handle the request.</p>
<hr>
<address>Apache/2.2.15 (CentOS) Server at ds.iris.edu Port 80</address>
</body></html>
More Details:
handler exited, code: 1 reason: Internal Server Error
Request:
http://service.iris.edu/irisws/syngine/1/query?station=ANMO&starttime=P-10&components=Z&network=IU&eventid=GCMT%3AC201002270634A&format=miniseed&model=test&endtime=P%2B10
Request Submitted:
2018/03/05 15:19:32 UTC
Service version:
Service: irisws-syngine version: 1.0.4
Traceback (most recent call last):
File "/usr/lib/python3/dist-packages/obspy/clients/syngine/tests/test_client.py", line 447, in test_reading_saczip_files
endtime="P+10", components="Z", format="saczip")
File "/usr/lib/python3/dist-packages/obspy/clients/syngine/client.py", line 371, in get_waveforms
filename=filename)
File "/usr/lib/python3/dist-packages/obspy/clients/base.py", line 245, in _download
self._handle_requests_http_error(r)
File "/usr/lib/python3/dist-packages/obspy/clients/syngine/client.py", line 62, in _handle_requests_http_error
raise ClientHTTPException(msg.strip())
obspy.clients.base.ClientHTTPException: HTTP code 500 when downloading 'http://service.iris.edu/irisws/syngine/1/query?station=ANMO&starttime=P-10&components=Z&network=IU&eventid=GCMT%3AC201002270634A&format=saczip&model=test&endtime=P%2B10':
Error 500: GCMT lookup error [404]: <!DOCTYPE HTML PUBLIC "-//IETF//DTD HTML 2.0//EN">
<html><head>
<title>404 Not Found</title>
</head><body>
<h1>Not Found</h1>
<p>The requested URL /spudservice/momenttensor/gcmtid/C201002270634A/ndk was not found on this server.</p>
<p>Additionally, a 302 Found
error was encountered while trying to use an ErrorDocument to handle the request.</p>
<hr>
<address>Apache/2.2.15 (CentOS) Server at ds.iris.edu Port 80</address>
</body></html>
More Details:
handler exited, code: 1 reason: Internal Server Error
Request:
http://service.iris.edu/irisws/syngine/1/query?station=ANMO&starttime=P-10&components=Z&network=IU&eventid=GCMT%3AC201002270634A&format=saczip&model=test&endtime=P%2B10
Request Submitted:
2018/03/05 15:19:32 UTC
Service version:
Service: irisws-syngine version: 1.0.4

Skipped Tests (40)

Submodule Test Skip Message
clients.arclink test_m2crypto (obspy.clients.arclink.tests.test_decrypt.ClientTestCase) M2Crypto is not installed
clients.arclink test_pycrypto (obspy.clients.arclink.tests.test_decrypt.ClientTestCase) PyCrypto is not installed
geodetics test_gps_2_dist_azimuth_with_geographiclib (obspy.geodetics.tests.test_util_geodetics.UtilGeodeticsTestCase) Module geographiclib is not installed
geodetics test_issue_375 (obspy.geodetics.tests.test_util_geodetics.UtilGeodeticsTestCase) Module geographiclib is not installed
core test_location_plot_global (obspy.core.tests.test_network.NetworkBasemapTestCase) basemap not installed
core test_location_plot_local (obspy.core.tests.test_network.NetworkBasemapTestCase) basemap not installed
core test_location_plot_ortho (obspy.core.tests.test_network.NetworkBasemapTestCase) basemap not installed
core test_location_plot_global (obspy.core.tests.test_network.NetworkCartopyTestCase) cartopy not installed
core test_location_plot_local (obspy.core.tests.test_network.NetworkCartopyTestCase) cartopy not installed
core test_location_plot_ortho (obspy.core.tests.test_network.NetworkCartopyTestCase) cartopy not installed
core test_catalog_plot_global (obspy.core.tests.test_event.CatalogBasemapTestCase) basemap not installed
core test_catalog_plot_local (obspy.core.tests.test_event.CatalogBasemapTestCase) basemap not installed
core test_catalog_plot_ortho (obspy.core.tests.test_event.CatalogBasemapTestCase) basemap not installed
core test_catalog_plot_ortho_longitude_wrap (obspy.core.tests.test_event.CatalogBasemapTestCase) basemap not installed
core test_catalog_plot_global (obspy.core.tests.test_event.CatalogCartopyTestCase) Cartopy not installed or too old
core test_catalog_plot_local (obspy.core.tests.test_event.CatalogCartopyTestCase) Cartopy not installed or too old
core test_catalog_plot_ortho (obspy.core.tests.test_event.CatalogCartopyTestCase) Cartopy not installed or too old
core test_catalog_plot_ortho_longitude_wrap (obspy.core.tests.test_event.CatalogCartopyTestCase) Cartopy not installed or too old
core test_plot_farfield_without_quiver_with_maps (obspy.core.tests.test_event.EventTestCase) basemap not installed
core test_flake8 (obspy.core.tests.test_code_formatting.CodeFormattingTestCase) No code formatting tests for release builds
core test_use_obspy_deprecation_warning (obspy.core.tests.test_code_formatting.CodeFormattingTestCase) No code formatting tests for release builds
core test_future_imports_in_every_file (obspy.core.tests.test_code_formatting.FutureUsageTestCase) No code formatting tests for release builds
core test_no_pyplot_import_in_any_file (obspy.core.tests.test_code_formatting.MatplotlibBackendUsageTestCase) No code formatting tests for release builds
core test_combined_station_event_plot (obspy.core.tests.test_inventory.InventoryBasemapTestCase) basemap not installed
core test_location_plot_global (obspy.core.tests.test_inventory.InventoryBasemapTestCase) basemap not installed
core test_location_plot_local (obspy.core.tests.test_inventory.InventoryBasemapTestCase) basemap not installed
core test_location_plot_ortho (obspy.core.tests.test_inventory.InventoryBasemapTestCase) basemap not installed
core test_location_plot_global (obspy.core.tests.test_inventory.InventoryCartopyTestCase) cartopy not installed
core test_location_plot_local (obspy.core.tests.test_inventory.InventoryCartopyTestCase) cartopy not installed
core test_location_plot_ortho (obspy.core.tests.test_inventory.InventoryCartopyTestCase) cartopy not installed
taup test_path_geo (obspy.taup.tests.test_taup_geo.TaupGeoTestCase) Module geographiclib is not installed or too old.
taup test_path_resampling (obspy.taup.tests.test_taup_geo.TaupGeoTestCase) Module geographiclib is not installed or too old.
taup test_compute_ray_paths (obspy.taup.tests.test_ray_paths.RayPathCalculationsTestCase) test needs geographiclib >= 1.34
taup test_p_iasp91_geo_manual (obspy.taup.tests.test_tau.TauPyModelTestCase) Module geographiclib is not installed
taup test_pierce_p_iasp91_geo (obspy.taup.tests.test_tau.TauPyModelTestCase) test needs geographiclib >= 1.34
taup test_single_path_geo_iasp91 (obspy.taup.tests.test_tau.TauPyModelTestCase) test needs geographiclib >= 1.34
clients.seedlink test_info (obspy.clients.seedlink.tests.test_slclient.SLClientTestCase) test must be started manually
clients.seedlink test_issue708 (obspy.clients.seedlink.tests.test_slclient.SLClientTestCase) test must be started manually
clients.seedlink test_time_window (obspy.clients.seedlink.tests.test_slclient.SLClientTestCase) test must be started manually
imaging test_script_plot (obspy.imaging.tests.test_mopad_script.MopadTestCase) Currently broken until further review.

Slowest Tests (20)

Runtime Test
260.309s Client (obspy.clients.neic.client)
187.136s test_relcal_different_overlaps (obspy.signal.tests.test_calibration.CalibrationTestCase)
159.556s test_plot_wiggles_horizontal_section (obspy.imaging.tests.test_waveform.WaveformTestCase)
158.743s test_plot_wiggles_positive_section (obspy.imaging.tests.test_waveform.WaveformTestCase)
157.591s test_plot_wiggles_negative_section (obspy.imaging.tests.test_waveform.WaveformTestCase)
155.970s test_plot_default_section (obspy.imaging.tests.test_waveform.WaveformTestCase)
155.495s test_plot_colored_section (obspy.imaging.tests.test_waveform.WaveformTestCase)
155.034s test_plot_azim_section (obspy.imaging.tests.test_waveform.WaveformTestCase)
154.545s test_plot_ref_time_section (obspy.imaging.tests.test_waveform.WaveformTestCase)
154.074s test_plot_horizontal_section (obspy.imaging.tests.test_waveform.WaveformTestCase)
153.931s test_plot_wiggles_vertical_section (obspy.imaging.tests.test_waveform.WaveformTestCase)
131.073s get_waveforms (obspy.clients.neic.client.Client)
131.071s get_waveforms_nscl (obspy.clients.neic.client.Client)
131.071s test_get_waveform_nscl (obspy.clients.neic.tests.test_client.ClientTestCase)
131.069s test_get_waveform (obspy.clients.neic.tests.test_client.ClientTestCase)
116.004s test_evalresp_file_like_object (obspy.signal.tests.test_invsim.InvSimTestCase)
106.498s test_response_calculation_from_seed_and_xseed (obspy.io.xseed.tests.test_core.CoreTestCase)
102.452s __init__ (obspy.taup)
74.265s test_shoot_existing_ray_param (obspy.taup.tests.test_seismic_phase.TauPySeismicPhaseTestCase)
60.911s test_get_stations_integration_test (obspy.clients.fdsn.tests.test_eidaws_routing_client.EIDAWSRoutingClientTestCase)

Chuck Norris Fact

Don't worry about tests, Chuck Norris's test cases cover your code too.