#92968 Report by node travis-ci covering 1991 tests from 54 modules resulted into 18 errors

Report

ObsPy Version
1.1.0.post0+207.g08c02f7762...
Continuous Integration
https://travis-ci.org/obspy/obspy/jobs/352226495
GitHub Pull Request
-
Report File
XML Document
Total Runtime
1517.9 sec
Report Date/Time
2018-03-12 04:19:18

System / Python

Architecture
64bit
Machine
x86_64
Node
travis-ci
Processor
x86_64
Python Compiler
GCC 4.4.7 20120313 (Red Hat 4.4.7-1)
Python Implementation
CPython
Python Version
3.4.5
Release
4.14.12-041412-generic
System
Linux
Version
#201801051649 SMP Fri Jan 5 16:50:54 UTC 2018

Dependencies

cartopy
---
decorator
4.0.11
flake8
---
future
0.16.0
geographiclib
1.49
lxml.etree
3.7.2
m2crypto
---
matplotlib
2.0.0
mock
2.0.0
mpl_toolkits.basemap
1.0.7
numpy
1.11.3
pep8-naming
---
pyflakes
---
pyimgur
0.5.2
pyproj
1.9.5.1
requests
2.14.2
scipy
0.18.1
setuptools
27.2.0
shapefile
1.2.12
sqlalchemy
1.1.5

Modules (54)

Module Errors /
Failures
Tracebacks
obspy.clients.arclink 15 1 2 3 4 5 6 7 8 9 10 11 12 13 14 15
obspy.clients.earthworm - -
obspy.clients.fdsn 1 16
obspy.clients.filesystem - -
obspy.clients.iris - -
obspy.clients.neic - -
obspy.clients.nrl - -
obspy.clients.seedlink - -
obspy.clients.seishub - -
obspy.clients.syngine 2 17 18
obspy.core - -
obspy.db - -
obspy.geodetics - -
obspy.imaging - -
obspy.io.ah - -
obspy.io.arclink - -
obspy.io.ascii - -
obspy.io.cmtsolution - -
obspy.io.cnv - -
obspy.io.css - -
obspy.io.gcf - -
obspy.io.gse2 - -
obspy.io.iaspei - -
obspy.io.json - -
obspy.io.kinemetrics - -
obspy.io.kml - -
obspy.io.mseed - -
obspy.io.ndk - -
obspy.io.nied - -
obspy.io.nlloc - -
obspy.io.nordic - -
obspy.io.pdas - -
obspy.io.pde - -
obspy.io.quakeml - -
obspy.io.reftek - -
obspy.io.sac - -
obspy.io.scardec - -
obspy.io.seg2 - -
obspy.io.segy - -
obspy.io.seisan - -
obspy.io.seiscomp - -
obspy.io.sh - -
obspy.io.shapefile - -
obspy.io.stationtxt - -
obspy.io.stationxml - -
obspy.io.wav - -
obspy.io.win - -
obspy.io.xseed - -
obspy.io.y - -
obspy.io.zmap - -
obspy.realtime - -
obspy.scripts - -
obspy.signal - -
obspy.taup - -
Summary 18 18

Tracebacks (18)

Traceback (most recent call last):
File "/home/travis/miniconda/envs/test-environment/lib/python3.4/site-packages/obspy/clients/arclink/tests/test_client.py", line 667, in test_srl
st = client.get_waveforms("BW", "RJOB", "", "EHZ", t, t + 30)
File "/home/travis/miniconda/envs/test-environment/lib/python3.4/site-packages/obspy/clients/arclink/client.py", line 444, in get_waveforms
compressed=compressed, route=route)
File "/home/travis/miniconda/envs/test-environment/lib/python3.4/site-packages/obspy/clients/arclink/client.py", line 565, in save_waveforms
data = self._fetch(rtype, rdata, route=route)
File "/home/travis/miniconda/envs/test-environment/lib/python3.4/site-packages/obspy/clients/arclink/client.py", line 225, in _fetch
endtime=request_data[1])
File "/home/travis/miniconda/envs/test-environment/lib/python3.4/site-packages/obspy/clients/arclink/client.py", line 622, in get_routing
result = self._fetch(rtype, rdata, route=False)
File "/home/travis/miniconda/envs/test-environment/lib/python3.4/site-packages/obspy/clients/arclink/client.py", line 219, in _fetch
return self._request(request_type, request_data)
File "/home/travis/miniconda/envs/test-environment/lib/python3.4/site-packages/obspy/clients/arclink/client.py", line 324, in _request
raise ArcLinkException("%s %s" % (err_code, msg))
obspy.clients.arclink.client.ArcLinkException: b'UNSET'
Traceback (most recent call last):
File "/home/travis/miniconda/envs/test-environment/lib/python3.4/site-packages/obspy/clients/arclink/tests/test_client.py", line 527, in test_save_waveform_no_compression
end, compressed=False)
File "/home/travis/miniconda/envs/test-environment/lib/python3.4/site-packages/obspy/clients/arclink/client.py", line 565, in save_waveforms
data = self._fetch(rtype, rdata, route=route)
File "/home/travis/miniconda/envs/test-environment/lib/python3.4/site-packages/obspy/clients/arclink/client.py", line 225, in _fetch
endtime=request_data[1])
File "/home/travis/miniconda/envs/test-environment/lib/python3.4/site-packages/obspy/clients/arclink/client.py", line 622, in get_routing
result = self._fetch(rtype, rdata, route=False)
File "/home/travis/miniconda/envs/test-environment/lib/python3.4/site-packages/obspy/clients/arclink/client.py", line 219, in _fetch
return self._request(request_type, request_data)
File "/home/travis/miniconda/envs/test-environment/lib/python3.4/site-packages/obspy/clients/arclink/client.py", line 324, in _request
raise ArcLinkException("%s %s" % (err_code, msg))
obspy.clients.arclink.client.ArcLinkException: b'UNSET'
Traceback (most recent call last):
File "/home/travis/miniconda/envs/test-environment/lib/python3.4/site-packages/obspy/clients/arclink/tests/test_client.py", line 634, in test_save_response
client.save_response(tempfile, 'BW', 'MANZ', '', 'EHZ', start, end)
File "/home/travis/miniconda/envs/test-environment/lib/python3.4/site-packages/obspy/clients/arclink/client.py", line 1008, in save_response
data = self._fetch(rtype, rdata, route=route)
File "/home/travis/miniconda/envs/test-environment/lib/python3.4/site-packages/obspy/clients/arclink/client.py", line 219, in _fetch
return self._request(request_type, request_data)
File "/home/travis/miniconda/envs/test-environment/lib/python3.4/site-packages/obspy/clients/arclink/client.py", line 324, in _request
raise ArcLinkException("%s %s" % (err_code, msg))
obspy.clients.arclink.client.ArcLinkException: b'UNSET'
Traceback (most recent call last):
File "/home/travis/miniconda/envs/test-environment/lib/python3.4/site-packages/obspy/clients/arclink/tests/test_client.py", line 161, in test_get_inventory
endtime=dt + 1)
File "/home/travis/miniconda/envs/test-environment/lib/python3.4/site-packages/obspy/clients/arclink/client.py", line 1123, in get_inventory
result = self._fetch(rtype, rdata, route=route)
File "/home/travis/miniconda/envs/test-environment/lib/python3.4/site-packages/obspy/clients/arclink/client.py", line 219, in _fetch
return self._request(request_type, request_data)
File "/home/travis/miniconda/envs/test-environment/lib/python3.4/site-packages/obspy/clients/arclink/client.py", line 324, in _request
raise ArcLinkException("%s %s" % (err_code, msg))
obspy.clients.arclink.client.ArcLinkException: b'UNSET'
Traceback (most recent call last):
File "/home/travis/miniconda/envs/test-environment/lib/python3.4/site-packages/obspy/clients/arclink/tests/test_client.py", line 564, in test_save_waveform_compressed
end, unpack=False)
File "/home/travis/miniconda/envs/test-environment/lib/python3.4/site-packages/obspy/clients/arclink/client.py", line 565, in save_waveforms
data = self._fetch(rtype, rdata, route=route)
File "/home/travis/miniconda/envs/test-environment/lib/python3.4/site-packages/obspy/clients/arclink/client.py", line 225, in _fetch
endtime=request_data[1])
File "/home/travis/miniconda/envs/test-environment/lib/python3.4/site-packages/obspy/clients/arclink/client.py", line 622, in get_routing
result = self._fetch(rtype, rdata, route=False)
File "/home/travis/miniconda/envs/test-environment/lib/python3.4/site-packages/obspy/clients/arclink/client.py", line 219, in _fetch
return self._request(request_type, request_data)
File "/home/travis/miniconda/envs/test-environment/lib/python3.4/site-packages/obspy/clients/arclink/client.py", line 324, in _request
raise ArcLinkException("%s %s" % (err_code, msg))
obspy.clients.arclink.client.ArcLinkException: b'UNSET'
Traceback (most recent call last):
File "/home/travis/miniconda/envs/test-environment/lib/python3.4/site-packages/obspy/clients/arclink/tests/test_client.py", line 391, in test_get_networks
result = client.get_networks(start, end)
File "/home/travis/miniconda/envs/test-environment/lib/python3.4/site-packages/obspy/clients/arclink/client.py", line 1358, in get_networks
endtime=endtime, route=route)
File "/home/travis/miniconda/envs/test-environment/lib/python3.4/site-packages/obspy/clients/arclink/client.py", line 1121, in get_inventory
result = self._fetch(rtype, rdata, route=False)
File "/home/travis/miniconda/envs/test-environment/lib/python3.4/site-packages/obspy/clients/arclink/client.py", line 219, in _fetch
return self._request(request_type, request_data)
File "/home/travis/miniconda/envs/test-environment/lib/python3.4/site-packages/obspy/clients/arclink/client.py", line 324, in _request
raise ArcLinkException("%s %s" % (err_code, msg))
obspy.clients.arclink.client.ArcLinkException: b'UNSET'
Traceback (most recent call last):
File "/home/travis/miniconda/envs/test-environment/lib/python3.4/site-packages/obspy/clients/arclink/tests/test_client.py", line 256, in test_get_inventory_twice
client.get_inventory('BW', 'MANZ', starttime=dt, endtime=dt + 1)
File "/home/travis/miniconda/envs/test-environment/lib/python3.4/site-packages/obspy/clients/arclink/client.py", line 1123, in get_inventory
result = self._fetch(rtype, rdata, route=route)
File "/home/travis/miniconda/envs/test-environment/lib/python3.4/site-packages/obspy/clients/arclink/client.py", line 219, in _fetch
return self._request(request_type, request_data)
File "/home/travis/miniconda/envs/test-environment/lib/python3.4/site-packages/obspy/clients/arclink/client.py", line 324, in _request
raise ArcLinkException("%s %s" % (err_code, msg))
obspy.clients.arclink.client.ArcLinkException: b'UNSET'
Traceback (most recent call last):
File "/home/travis/miniconda/envs/test-environment/lib/python3.4/site-packages/obspy/clients/arclink/tests/test_client.py", line 404, in test_get_stations
result = client.get_stations(start, end, 'BW')
File "/home/travis/miniconda/envs/test-environment/lib/python3.4/site-packages/obspy/clients/arclink/client.py", line 1379, in get_stations
endtime=endtime, route=route)
File "/home/travis/miniconda/envs/test-environment/lib/python3.4/site-packages/obspy/clients/arclink/client.py", line 1123, in get_inventory
result = self._fetch(rtype, rdata, route=route)
File "/home/travis/miniconda/envs/test-environment/lib/python3.4/site-packages/obspy/clients/arclink/client.py", line 219, in _fetch
return self._request(request_type, request_data)
File "/home/travis/miniconda/envs/test-environment/lib/python3.4/site-packages/obspy/clients/arclink/client.py", line 324, in _request
raise ArcLinkException("%s %s" % (err_code, msg))
obspy.clients.arclink.client.ArcLinkException: b'UNSET'
Traceback (most recent call last):
File "/home/travis/miniconda/envs/test-environment/lib/python3.4/site-packages/obspy/clients/arclink/tests/test_client.py", line 270, in test_get_waveform_with_metadata
metadata=True)
File "/home/travis/miniconda/envs/test-environment/lib/python3.4/site-packages/obspy/clients/arclink/client.py", line 444, in get_waveforms
compressed=compressed, route=route)
File "/home/travis/miniconda/envs/test-environment/lib/python3.4/site-packages/obspy/clients/arclink/client.py", line 565, in save_waveforms
data = self._fetch(rtype, rdata, route=route)
File "/home/travis/miniconda/envs/test-environment/lib/python3.4/site-packages/obspy/clients/arclink/client.py", line 225, in _fetch
endtime=request_data[1])
File "/home/travis/miniconda/envs/test-environment/lib/python3.4/site-packages/obspy/clients/arclink/client.py", line 622, in get_routing
result = self._fetch(rtype, rdata, route=False)
File "/home/travis/miniconda/envs/test-environment/lib/python3.4/site-packages/obspy/clients/arclink/client.py", line 219, in _fetch
return self._request(request_type, request_data)
File "/home/travis/miniconda/envs/test-environment/lib/python3.4/site-packages/obspy/clients/arclink/client.py", line 324, in _request
raise ArcLinkException("%s %s" % (err_code, msg))
obspy.clients.arclink.client.ArcLinkException: b'UNSET'
Traceback (most recent call last):
File "/home/travis/miniconda/envs/test-environment/lib/python3.4/site-packages/obspy/clients/arclink/tests/test_client.py", line 757, in test_get_waveform_instrument_change
metadata=True)
File "/home/travis/miniconda/envs/test-environment/lib/python3.4/site-packages/obspy/clients/arclink/client.py", line 444, in get_waveforms
compressed=compressed, route=route)
File "/home/travis/miniconda/envs/test-environment/lib/python3.4/site-packages/obspy/clients/arclink/client.py", line 565, in save_waveforms
data = self._fetch(rtype, rdata, route=route)
File "/home/travis/miniconda/envs/test-environment/lib/python3.4/site-packages/obspy/clients/arclink/client.py", line 225, in _fetch
endtime=request_data[1])
File "/home/travis/miniconda/envs/test-environment/lib/python3.4/site-packages/obspy/clients/arclink/client.py", line 622, in get_routing
result = self._fetch(rtype, rdata, route=False)
File "/home/travis/miniconda/envs/test-environment/lib/python3.4/site-packages/obspy/clients/arclink/client.py", line 219, in _fetch
return self._request(request_type, request_data)
File "/home/travis/miniconda/envs/test-environment/lib/python3.4/site-packages/obspy/clients/arclink/client.py", line 324, in _request
raise ArcLinkException("%s %s" % (err_code, msg))
obspy.clients.arclink.client.ArcLinkException: b'UNSET'
Traceback (most recent call last):
File "/home/travis/miniconda/envs/test-environment/lib/python3.4/site-packages/obspy/clients/arclink/tests/test_client.py", line 99, in test_delayed_request
results = client.get_routing('GR', 'FUR', start, end)
File "/home/travis/miniconda/envs/test-environment/lib/python3.4/site-packages/obspy/clients/arclink/client.py", line 622, in get_routing
result = self._fetch(rtype, rdata, route=False)
File "/home/travis/miniconda/envs/test-environment/lib/python3.4/site-packages/obspy/clients/arclink/client.py", line 219, in _fetch
return self._request(request_type, request_data)
File "/home/travis/miniconda/envs/test-environment/lib/python3.4/site-packages/obspy/clients/arclink/client.py", line 324, in _request
raise ArcLinkException("%s %s" % (err_code, msg))
obspy.clients.arclink.client.ArcLinkException: b'UNSET'
Traceback (most recent call last):
File "/home/travis/miniconda/envs/test-environment/lib/python3.4/site-packages/obspy/clients/arclink/tests/test_client.py", line 126, in test_get_routing
results = client.get_routing('BW', 'RJOB', dt, dt + 1)
File "/home/travis/miniconda/envs/test-environment/lib/python3.4/site-packages/obspy/clients/arclink/client.py", line 622, in get_routing
result = self._fetch(rtype, rdata, route=False)
File "/home/travis/miniconda/envs/test-environment/lib/python3.4/site-packages/obspy/clients/arclink/client.py", line 219, in _fetch
return self._request(request_type, request_data)
File "/home/travis/miniconda/envs/test-environment/lib/python3.4/site-packages/obspy/clients/arclink/client.py", line 324, in _request
raise ArcLinkException("%s %s" % (err_code, msg))
obspy.clients.arclink.client.ArcLinkException: b'UNSET'
Traceback (most recent call last):
File "/home/travis/miniconda/envs/test-environment/lib/python3.4/site-packages/obspy/clients/arclink/tests/test_client.py", line 35, in test_get_waveform
stream = client.get_waveforms('BW', 'MANZ', '', 'EH*', start, end)
File "/home/travis/miniconda/envs/test-environment/lib/python3.4/site-packages/obspy/clients/arclink/client.py", line 444, in get_waveforms
compressed=compressed, route=route)
File "/home/travis/miniconda/envs/test-environment/lib/python3.4/site-packages/obspy/clients/arclink/client.py", line 565, in save_waveforms
data = self._fetch(rtype, rdata, route=route)
File "/home/travis/miniconda/envs/test-environment/lib/python3.4/site-packages/obspy/clients/arclink/client.py", line 225, in _fetch
endtime=request_data[1])
File "/home/travis/miniconda/envs/test-environment/lib/python3.4/site-packages/obspy/clients/arclink/client.py", line 622, in get_routing
result = self._fetch(rtype, rdata, route=False)
File "/home/travis/miniconda/envs/test-environment/lib/python3.4/site-packages/obspy/clients/arclink/client.py", line 219, in _fetch
return self._request(request_type, request_data)
File "/home/travis/miniconda/envs/test-environment/lib/python3.4/site-packages/obspy/clients/arclink/client.py", line 324, in _request
raise ArcLinkException("%s %s" % (err_code, msg))
obspy.clients.arclink.client.ArcLinkException: b'UNSET'
Traceback (most recent call last):
File "/home/travis/miniconda/envs/test-environment/lib/python3.4/site-packages/obspy/clients/arclink/tests/test_client.py", line 693, in test_issue_311
metadata=False)
File "/home/travis/miniconda/envs/test-environment/lib/python3.4/site-packages/obspy/clients/arclink/client.py", line 444, in get_waveforms
compressed=compressed, route=route)
File "/home/travis/miniconda/envs/test-environment/lib/python3.4/site-packages/obspy/clients/arclink/client.py", line 565, in save_waveforms
data = self._fetch(rtype, rdata, route=route)
File "/home/travis/miniconda/envs/test-environment/lib/python3.4/site-packages/obspy/clients/arclink/client.py", line 225, in _fetch
endtime=request_data[1])
File "/home/travis/miniconda/envs/test-environment/lib/python3.4/site-packages/obspy/clients/arclink/client.py", line 622, in get_routing
result = self._fetch(rtype, rdata, route=False)
File "/home/travis/miniconda/envs/test-environment/lib/python3.4/site-packages/obspy/clients/arclink/client.py", line 219, in _fetch
return self._request(request_type, request_data)
File "/home/travis/miniconda/envs/test-environment/lib/python3.4/site-packages/obspy/clients/arclink/client.py", line 324, in _request
raise ArcLinkException("%s %s" % (err_code, msg))
obspy.clients.arclink.client.ArcLinkException: b'UNSET'
Traceback (most recent call last):
File "/home/travis/miniconda/envs/test-environment/lib/python3.4/site-packages/obspy/clients/arclink/tests/test_client.py", line 508, in test_get_waveform_no_compression
compressed=False)
File "/home/travis/miniconda/envs/test-environment/lib/python3.4/site-packages/obspy/clients/arclink/client.py", line 444, in get_waveforms
compressed=compressed, route=route)
File "/home/travis/miniconda/envs/test-environment/lib/python3.4/site-packages/obspy/clients/arclink/client.py", line 565, in save_waveforms
data = self._fetch(rtype, rdata, route=route)
File "/home/travis/miniconda/envs/test-environment/lib/python3.4/site-packages/obspy/clients/arclink/client.py", line 225, in _fetch
endtime=request_data[1])
File "/home/travis/miniconda/envs/test-environment/lib/python3.4/site-packages/obspy/clients/arclink/client.py", line 622, in get_routing
result = self._fetch(rtype, rdata, route=False)
File "/home/travis/miniconda/envs/test-environment/lib/python3.4/site-packages/obspy/clients/arclink/client.py", line 219, in _fetch
return self._request(request_type, request_data)
File "/home/travis/miniconda/envs/test-environment/lib/python3.4/site-packages/obspy/clients/arclink/client.py", line 324, in _request
raise ArcLinkException("%s %s" % (err_code, msg))
obspy.clients.arclink.client.ArcLinkException: b'UNSET'
Traceback (most recent call last):
File "/home/travis/miniconda/envs/test-environment/lib/python3.4/site-packages/obspy/clients/fdsn/tests/test_federator_routing_client.py", line 342, in test_get_stations_integration_test
channel="LHZ", level="network")
File "<decorator-gen-68>", line 2, in get_stations
File "/home/travis/miniconda/envs/test-environment/lib/python3.4/site-packages/obspy/clients/fdsn/routing/routing_client.py", line 79, in _assert_filename_not_in_kwargs
return f(*args, **kwargs)
File "/home/travis/miniconda/envs/test-environment/lib/python3.4/site-packages/obspy/clients/fdsn/routing/federator_routing_client.py", line 110, in get_stations
return super(FederatorRoutingClient, self).get_stations(**kwargs)
File "<decorator-gen-61>", line 2, in get_stations
File "/home/travis/miniconda/envs/test-environment/lib/python3.4/site-packages/obspy/clients/fdsn/routing/routing_client.py", line 79, in _assert_filename_not_in_kwargs
return f(*args, **kwargs)
File "/home/travis/miniconda/envs/test-environment/lib/python3.4/site-packages/obspy/clients/fdsn/routing/routing_client.py", line 344, in get_stations
return self.get_stations_bulk([bulk], **kwargs)
File "<decorator-gen-69>", line 2, in get_stations_bulk
File "/home/travis/miniconda/envs/test-environment/lib/python3.4/site-packages/obspy/clients/fdsn/routing/routing_client.py", line 79, in _assert_filename_not_in_kwargs
return f(*args, **kwargs)
File "/home/travis/miniconda/envs/test-environment/lib/python3.4/site-packages/obspy/clients/fdsn/routing/federator_routing_client.py", line 143, in get_stations_bulk
r = self._download(self._url + "/query", data=bulk_str)
File "/home/travis/miniconda/envs/test-environment/lib/python3.4/site-packages/obspy/clients/base.py", line 245, in _download
self._handle_requests_http_error(r)
File "/home/travis/miniconda/envs/test-environment/lib/python3.4/site-packages/obspy/clients/fdsn/routing/routing_client.py", line 280, in _handle_requests_http_error
raise_on_error(r.status_code, get_reason_from_response(r))
File "/home/travis/miniconda/envs/test-environment/lib/python3.4/site-packages/obspy/clients/fdsn/client.py", line 1710, in raise_on_error
raise FDSNException(msg, server_info)
obspy.clients.fdsn.header.FDSNException: Bad request. If you think your request was valid please contact the developers.
Traceback (most recent call last):
File "/home/travis/miniconda/envs/test-environment/lib/python3.4/site-packages/obspy/clients/syngine/tests/test_client.py", line 456, in test_reading_saczip_files
self.assertEqual(st, st_bulk)
AssertionError: <obspy.core.stream.Stream object at 0x7fc28dbdf390> != <obspy.core.stream.Stream object at 0x7fc2bbeb36a0>
Traceback (most recent call last):
File "/home/travis/miniconda/envs/test-environment/lib/python3.4/doctest.py", line 2187, in runTest
raise self.failureException(self.format_failure(new.getvalue()))
AssertionError: Failed doctest test for obspy.clients.syngine.__init__
File "/home/travis/miniconda/envs/test-environment/lib/python3.4/site-packages/obspy/clients/syngine/__init__.py", line 1, in __init__
----------------------------------------------------------------------
File "/home/travis/miniconda/envs/test-environment/lib/python3.4/site-packages/obspy/clients/syngine/__init__.py", line 54, in obspy.clients.syngine.__init__
Failed example:
st = client.get_waveforms(model="ak135f_5s", network="IU", station="AN*",
eventid="GCMT:C201002270634A",
starttime="P-10", endtime="P+20")
Exception raised:
Traceback (most recent call last):
File "/home/travis/miniconda/envs/test-environment/lib/python3.4/doctest.py", line 1318, in __run
compileflags, 1), test.globs)
File "<doctest obspy.clients.syngine.__init__[5]>", line 3, in <module>
starttime="P-10", endtime="P+20")
File "/home/travis/miniconda/envs/test-environment/lib/python3.4/site-packages/obspy/clients/syngine/client.py", line 371, in get_waveforms
filename=filename)
File "/home/travis/miniconda/envs/test-environment/lib/python3.4/site-packages/obspy/clients/base.py", line 245, in _download
self._handle_requests_http_error(r)
File "/home/travis/miniconda/envs/test-environment/lib/python3.4/site-packages/obspy/clients/syngine/client.py", line 62, in _handle_requests_http_error
raise ClientHTTPException(msg.strip())
obspy.clients.base.ClientHTTPException: HTTP code 400 when downloading 'http://service.iris.edu/irisws/syngine/1/query?station=AN%2A&network=IU&format=miniseed&eventid=GCMT%3AC201002270634A&starttime=P-10&model=ak135f_5s&endtime=P%2B20':
Error 400: RECEIVER lat:39.678769, lon:32.7934, netcode:IU, stacode:ANTO, STATUS: Instaseis Error [400]: No seismograms found for the given phase relative offsets. This could either be due to the chosen phase not existing for the specific source-receiver geometry or arriving too late/with too large offsets if the database is not long enough.
More Details:
handler exited, code: 3 reason: Bad Request
Request:
http://service.iris.edu/irisws/syngine/1/query?station=AN%2A&network=IU&format=miniseed&eventid=GCMT%3AC201002270634A&starttime=P-10&model=ak135f_5s&endtime=P%2B20
Request Submitted:
2018/03/12 09:11:16 UTC
Service version:
Service: irisws-syngine version: 1.0.4

Skipped Tests (31)

Submodule Test Skip Message
clients.seedlink test_info (obspy.clients.seedlink.tests.test_slclient.SLClientTestCase) test must be started manually
clients.seedlink test_issue708 (obspy.clients.seedlink.tests.test_slclient.SLClientTestCase) test must be started manually
clients.seedlink test_time_window (obspy.clients.seedlink.tests.test_slclient.SLClientTestCase) test must be started manually
clients.seishub test_get_channel_ids (obspy.clients.seishub.tests.test_client.ClientTestCase) Seishub test server not reachable.
clients.seishub test_get_coordinates (obspy.clients.seishub.tests.test_client.ClientTestCase) Seishub test server not reachable.
clients.seishub test_get_event_list (obspy.clients.seishub.tests.test_client.ClientTestCase) Seishub test server not reachable.
clients.seishub test_get_location_ids (obspy.clients.seishub.tests.test_client.ClientTestCase) Seishub test server not reachable.
clients.seishub test_get_network_ids (obspy.clients.seishub.tests.test_client.ClientTestCase) Seishub test server not reachable.
clients.seishub test_get_paz (obspy.clients.seishub.tests.test_client.ClientTestCase) Seishub test server not reachable.
clients.seishub test_get_preview (obspy.clients.seishub.tests.test_client.ClientTestCase) Seishub test server not reachable.
clients.seishub test_get_preview_by_ids (obspy.clients.seishub.tests.test_client.ClientTestCase) Seishub test server not reachable.
clients.seishub test_get_station_ids (obspy.clients.seishub.tests.test_client.ClientTestCase) Seishub test server not reachable.
clients.seishub test_get_waveform_with_metadata (obspy.clients.seishub.tests.test_client.ClientTestCase) Seishub test server not reachable.
clients.seishub test_get_waveforms (obspy.clients.seishub.tests.test_client.ClientTestCase) Seishub test server not reachable.
clients.seishub test_localcache (obspy.clients.seishub.tests.test_client.ClientTestCase) Seishub test server not reachable.
clients.seishub test_ping (obspy.clients.seishub.tests.test_client.ClientTestCase) Seishub test server not reachable.
geodetics test_gps_2_dist_azimuth_bug150 (obspy.geodetics.tests.test_util_geodetics.UtilGeodeticsTestCase) Module geographiclib is installed, not using calc_vincenty_inverse
clients.arclink test_m2crypto (obspy.clients.arclink.tests.test_decrypt.ClientTestCase) M2Crypto is not installed
clients.arclink test_pycrypto (obspy.clients.arclink.tests.test_decrypt.ClientTestCase) PyCrypto is not installed
imaging test_script_plot (obspy.imaging.tests.test_mopad_script.MopadTestCase) Currently broken until further review.
core test_flake8 (obspy.core.tests.test_code_formatting.CodeFormattingTestCase) Formatting tests require at least flake8 3.0.
core test_catalog_plot_global (obspy.core.tests.test_event.CatalogCartopyTestCase) Cartopy not installed or too old
core test_catalog_plot_local (obspy.core.tests.test_event.CatalogCartopyTestCase) Cartopy not installed or too old
core test_catalog_plot_ortho (obspy.core.tests.test_event.CatalogCartopyTestCase) Cartopy not installed or too old
core test_catalog_plot_ortho_longitude_wrap (obspy.core.tests.test_event.CatalogCartopyTestCase) Cartopy not installed or too old
core test_location_plot_global (obspy.core.tests.test_inventory.InventoryCartopyTestCase) cartopy not installed
core test_location_plot_local (obspy.core.tests.test_inventory.InventoryCartopyTestCase) cartopy not installed
core test_location_plot_ortho (obspy.core.tests.test_inventory.InventoryCartopyTestCase) cartopy not installed
core test_location_plot_global (obspy.core.tests.test_network.NetworkCartopyTestCase) cartopy not installed
core test_location_plot_local (obspy.core.tests.test_network.NetworkCartopyTestCase) cartopy not installed
core test_location_plot_ortho (obspy.core.tests.test_network.NetworkCartopyTestCase) cartopy not installed

Slowest Tests (20)

Runtime Test
76.806s test_get_not_existing_waveform (obspy.clients.arclink.tests.test_client.ClientTestCase)
52.063s test_delayed_request (obspy.clients.arclink.tests.test_client.ClientTestCase)
41.546s test_cryptography (obspy.clients.arclink.tests.test_decrypt.ClientTestCase)
40.531s test_get_routing (obspy.clients.arclink.tests.test_client.ClientTestCase)
40.242s test_get_waveform_no_routing (obspy.clients.arclink.tests.test_client.ClientTestCase)
38.944s test_get_stations (obspy.clients.arclink.tests.test_client.ClientTestCase)
38.796s test_get_waveform_with_metadata (obspy.clients.arclink.tests.test_client.ClientTestCase)
38.764s test_get_inventory_twice (obspy.clients.arclink.tests.test_client.ClientTestCase)
38.688s test_get_waveform_no_compression (obspy.clients.arclink.tests.test_client.ClientTestCase)
38.364s test_get_waveform (obspy.clients.arclink.tests.test_client.ClientTestCase)
38.284s test_srl (obspy.clients.arclink.tests.test_client.ClientTestCase)
38.265s test_save_waveform_no_compression (obspy.clients.arclink.tests.test_client.ClientTestCase)
38.241s test_get_networks (obspy.clients.arclink.tests.test_client.ClientTestCase)
38.231s test_save_response (obspy.clients.arclink.tests.test_client.ClientTestCase)
38.197s test_save_waveform_compressed (obspy.clients.arclink.tests.test_client.ClientTestCase)
38.197s test_get_waveform_wrong_pattern (obspy.clients.arclink.tests.test_client.ClientTestCase)
38.195s test_get_inventory (obspy.clients.arclink.tests.test_client.ClientTestCase)
38.138s test_issue_372 (obspy.clients.arclink.tests.test_client.ClientTestCase)
37.615s test_issue_311 (obspy.clients.arclink.tests.test_client.ClientTestCase)
37.337s test_get_stations_inconsistency (obspy.clients.arclink.tests.test_client.ClientTestCase)

Chuck Norris Fact

Chuck Norris can compile syntax errors.