#93598 Report by node sphinx covering 2002 tests from 54 modules resulted into 15 errors

Report

ObsPy Version
1.1.0.post0+295.g8f409524ad...
Continuous Integration
-
GitHub Pull Request
-
Report File
XML Document
Total Runtime
1104.9 sec
Report Date/Time
2018-04-16 00:08:55

System / Python

Architecture
32bit
Machine
i686
Node
sphinx
Processor
i686
Python Compiler
GCC 4.4.7 20120313 (Red Hat 4.4.7-1)
Python Implementation
CPython
Python Version
3.4.4
Release
2.6.32-042stab127.2
System
Linux
Version
#1 SMP Thu Jan 4 16:41:44 MSK 2018

Dependencies

cartopy
---
decorator
4.0.6
flake8
2.5.1
future
0.15.2
geographiclib
---
lxml.etree
3.3.5
m2crypto
---
matplotlib
2.0.2
mock
1.3.0
mpl_toolkits.basemap
1.0.7
numpy
1.10.4
pep8-naming
---
pyflakes
1.0.0
pyimgur
---
pyproj
1.9.4
requests
2.9.1
scipy
0.17.0
setuptools
19.6.2
shapefile
---
sqlalchemy
1.0.11

Modules (54)

Module Errors /
Failures
Tracebacks
obspy.clients.arclink 12 1 2 3 4 5 6 7 8 9 10 11 12
obspy.clients.earthworm - -
obspy.clients.fdsn 2 13 14
obspy.clients.filesystem - -
obspy.clients.iris - -
obspy.clients.neic - -
obspy.clients.nrl - -
obspy.clients.seedlink - -
obspy.clients.seishub - -
obspy.clients.syngine 1 15
obspy.core - -
obspy.db - -
obspy.geodetics - -
obspy.imaging - -
obspy.io.ah - -
obspy.io.arclink - -
obspy.io.ascii - -
obspy.io.cmtsolution - -
obspy.io.cnv - -
obspy.io.css - -
obspy.io.gcf - -
obspy.io.gse2 - -
obspy.io.iaspei - -
obspy.io.json - -
obspy.io.kinemetrics - -
obspy.io.kml - -
obspy.io.mseed - -
obspy.io.ndk - -
obspy.io.nied - -
obspy.io.nlloc - -
obspy.io.nordic - -
obspy.io.pdas - -
obspy.io.pde - -
obspy.io.quakeml - -
obspy.io.reftek - -
obspy.io.sac - -
obspy.io.scardec - -
obspy.io.seg2 - -
obspy.io.segy - -
obspy.io.seisan - -
obspy.io.seiscomp - -
obspy.io.sh - -
obspy.io.shapefile - -
obspy.io.stationtxt - -
obspy.io.stationxml - -
obspy.io.wav - -
obspy.io.win - -
obspy.io.xseed - -
obspy.io.y - -
obspy.io.zmap - -
obspy.realtime - -
obspy.scripts - -
obspy.signal - -
obspy.taup - -
Summary 15 15

Tracebacks (15)

Traceback (most recent call last):
File "/private-backup/home/obspy/update-docs/src/obspy/obspy/clients/arclink/tests/test_client.py", line 508, in test_get_waveform_no_compression
compressed=False)
File "/private-backup/home/obspy/update-docs/src/obspy/obspy/clients/arclink/client.py", line 444, in get_waveforms
compressed=compressed, route=route)
File "/private-backup/home/obspy/update-docs/src/obspy/obspy/clients/arclink/client.py", line 565, in save_waveforms
data = self._fetch(rtype, rdata, route=route)
File "/private-backup/home/obspy/update-docs/src/obspy/obspy/clients/arclink/client.py", line 225, in _fetch
endtime=request_data[1])
File "/private-backup/home/obspy/update-docs/src/obspy/obspy/clients/arclink/client.py", line 622, in get_routing
result = self._fetch(rtype, rdata, route=False)
File "/private-backup/home/obspy/update-docs/src/obspy/obspy/clients/arclink/client.py", line 219, in _fetch
return self._request(request_type, request_data)
File "/private-backup/home/obspy/update-docs/src/obspy/obspy/clients/arclink/client.py", line 324, in _request
raise ArcLinkException("%s %s" % (err_code, msg))
obspy.clients.arclink.client.ArcLinkException: b'UNSET'
Traceback (most recent call last):
File "/home/obspy/anaconda3/envs/tmp_build_docs/lib/python3.4/doctest.py", line 2187, in runTest
raise self.failureException(self.format_failure(new.getvalue()))
AssertionError: Failed doctest test for obspy.clients.arclink.client.Client.get_metadata
File "/private-backup/home/obspy/update-docs/src/obspy/obspy/clients/arclink/client.py", line 751, in get_metadata
----------------------------------------------------------------------
File "/private-backup/home/obspy/update-docs/src/obspy/obspy/clients/arclink/client.py", line 777, in obspy.clients.arclink.client.Client.get_metadata
Failed example:
data = client.get_metadata('BW', 'MANZ', '', 'EHZ', t)
Exception raised:
Traceback (most recent call last):
File "/home/obspy/anaconda3/envs/tmp_build_docs/lib/python3.4/doctest.py", line 1318, in __run
compileflags, 1), test.globs)
File "<doctest obspy.clients.arclink.client.Client.get_metadata[4]>", line 1, in <module>
data = client.get_metadata('BW', 'MANZ', '', 'EHZ', t)
File "/private-backup/home/obspy/update-docs/src/obspy/obspy/clients/arclink/client.py", line 805, in get_metadata
instruments=True, route=route)
File "/private-backup/home/obspy/update-docs/src/obspy/obspy/clients/arclink/client.py", line 1123, in get_inventory
result = self._fetch(rtype, rdata, route=route)
File "/private-backup/home/obspy/update-docs/src/obspy/obspy/clients/arclink/client.py", line 219, in _fetch
return self._request(request_type, request_data)
File "/private-backup/home/obspy/update-docs/src/obspy/obspy/clients/arclink/client.py", line 324, in _request
raise ArcLinkException("%s %s" % (err_code, msg))
obspy.clients.arclink.client.ArcLinkException: b'UNSET'
Traceback (most recent call last):
File "/private-backup/home/obspy/update-docs/src/obspy/obspy/clients/arclink/tests/test_client.py", line 574, in test_save_waveform_compressed
end, format="FSEED", unpack=False)
File "/private-backup/home/obspy/update-docs/src/obspy/obspy/clients/arclink/client.py", line 565, in save_waveforms
data = self._fetch(rtype, rdata, route=route)
File "/private-backup/home/obspy/update-docs/src/obspy/obspy/clients/arclink/client.py", line 225, in _fetch
endtime=request_data[1])
File "/private-backup/home/obspy/update-docs/src/obspy/obspy/clients/arclink/client.py", line 622, in get_routing
result = self._fetch(rtype, rdata, route=False)
File "/private-backup/home/obspy/update-docs/src/obspy/obspy/clients/arclink/client.py", line 219, in _fetch
return self._request(request_type, request_data)
File "/private-backup/home/obspy/update-docs/src/obspy/obspy/clients/arclink/client.py", line 324, in _request
raise ArcLinkException("%s %s" % (err_code, msg))
obspy.clients.arclink.client.ArcLinkException: b'UNSET'
Traceback (most recent call last):
File "/private-backup/home/obspy/update-docs/src/obspy/obspy/clients/arclink/tests/test_client.py", line 527, in test_save_waveform_no_compression
end, compressed=False)
File "/private-backup/home/obspy/update-docs/src/obspy/obspy/clients/arclink/client.py", line 565, in save_waveforms
data = self._fetch(rtype, rdata, route=route)
File "/private-backup/home/obspy/update-docs/src/obspy/obspy/clients/arclink/client.py", line 260, in _fetch
return self._request(request_type, request_data)
File "/private-backup/home/obspy/update-docs/src/obspy/obspy/clients/arclink/client.py", line 324, in _request
raise ArcLinkException("%s %s" % (err_code, msg))
obspy.clients.arclink.client.ArcLinkException: b'UNSET'
Traceback (most recent call last):
File "/private-backup/home/obspy/update-docs/src/obspy/obspy/clients/arclink/tests/test_client.py", line 270, in test_get_waveform_with_metadata
metadata=True)
File "/private-backup/home/obspy/update-docs/src/obspy/obspy/clients/arclink/client.py", line 444, in get_waveforms
compressed=compressed, route=route)
File "/private-backup/home/obspy/update-docs/src/obspy/obspy/clients/arclink/client.py", line 565, in save_waveforms
data = self._fetch(rtype, rdata, route=route)
File "/private-backup/home/obspy/update-docs/src/obspy/obspy/clients/arclink/client.py", line 225, in _fetch
endtime=request_data[1])
File "/private-backup/home/obspy/update-docs/src/obspy/obspy/clients/arclink/client.py", line 622, in get_routing
result = self._fetch(rtype, rdata, route=False)
File "/private-backup/home/obspy/update-docs/src/obspy/obspy/clients/arclink/client.py", line 219, in _fetch
return self._request(request_type, request_data)
File "/private-backup/home/obspy/update-docs/src/obspy/obspy/clients/arclink/client.py", line 324, in _request
raise ArcLinkException("%s %s" % (err_code, msg))
obspy.clients.arclink.client.ArcLinkException: b'UNSET'
Traceback (most recent call last):
File "/private-backup/home/obspy/update-docs/src/obspy/obspy/clients/arclink/tests/test_decrypt.py", line 38, in test_get_waveform_with_dcid_key
stream2 = client2.get_waveforms('GE', 'APE', '', 'BHZ', start, end)
File "/private-backup/home/obspy/update-docs/src/obspy/obspy/clients/arclink/client.py", line 444, in get_waveforms
compressed=compressed, route=route)
File "/private-backup/home/obspy/update-docs/src/obspy/obspy/clients/arclink/client.py", line 565, in save_waveforms
data = self._fetch(rtype, rdata, route=route)
File "/private-backup/home/obspy/update-docs/src/obspy/obspy/clients/arclink/client.py", line 260, in _fetch
return self._request(request_type, request_data)
File "/private-backup/home/obspy/update-docs/src/obspy/obspy/clients/arclink/client.py", line 324, in _request
raise ArcLinkException("%s %s" % (err_code, msg))
obspy.clients.arclink.client.ArcLinkException: b'UNSET'
Traceback (most recent call last):
File "/private-backup/home/obspy/update-docs/src/obspy/obspy/clients/arclink/tests/test_decrypt.py", line 158, in test_cryptography
self.test_get_waveform_with_dcid_key()
File "/private-backup/home/obspy/update-docs/src/obspy/obspy/clients/arclink/tests/test_decrypt.py", line 38, in test_get_waveform_with_dcid_key
stream2 = client2.get_waveforms('GE', 'APE', '', 'BHZ', start, end)
File "/private-backup/home/obspy/update-docs/src/obspy/obspy/clients/arclink/client.py", line 444, in get_waveforms
compressed=compressed, route=route)
File "/private-backup/home/obspy/update-docs/src/obspy/obspy/clients/arclink/client.py", line 565, in save_waveforms
data = self._fetch(rtype, rdata, route=route)
File "/private-backup/home/obspy/update-docs/src/obspy/obspy/clients/arclink/client.py", line 260, in _fetch
return self._request(request_type, request_data)
File "/private-backup/home/obspy/update-docs/src/obspy/obspy/clients/arclink/client.py", line 324, in _request
raise ArcLinkException("%s %s" % (err_code, msg))
obspy.clients.arclink.client.ArcLinkException: b'UNSET'
Traceback (most recent call last):
File "/home/obspy/anaconda3/envs/tmp_build_docs/lib/python3.4/doctest.py", line 2187, in runTest
raise self.failureException(self.format_failure(new.getvalue()))
AssertionError: Failed doctest test for obspy.clients.arclink.client.Client.get_waveforms
File "/private-backup/home/obspy/update-docs/src/obspy/obspy/clients/arclink/client.py", line 391, in get_waveforms
----------------------------------------------------------------------
File "/private-backup/home/obspy/update-docs/src/obspy/obspy/clients/arclink/client.py", line 429, in obspy.clients.arclink.client.Client.get_waveforms
Failed example:
st = client.get_waveforms("BW", "RJOB", "", "EH*", t - 3, t + 15)
Exception raised:
Traceback (most recent call last):
File "/home/obspy/anaconda3/envs/tmp_build_docs/lib/python3.4/doctest.py", line 1318, in __run
compileflags, 1), test.globs)
File "<doctest obspy.clients.arclink.client.Client.get_waveforms[4]>", line 1, in <module>
st = client.get_waveforms("BW", "RJOB", "", "EH*", t - 3, t + 15)
File "/private-backup/home/obspy/update-docs/src/obspy/obspy/clients/arclink/client.py", line 444, in get_waveforms
compressed=compressed, route=route)
File "/private-backup/home/obspy/update-docs/src/obspy/obspy/clients/arclink/client.py", line 565, in save_waveforms
data = self._fetch(rtype, rdata, route=route)
File "/private-backup/home/obspy/update-docs/src/obspy/obspy/clients/arclink/client.py", line 225, in _fetch
endtime=request_data[1])
File "/private-backup/home/obspy/update-docs/src/obspy/obspy/clients/arclink/client.py", line 622, in get_routing
result = self._fetch(rtype, rdata, route=False)
File "/private-backup/home/obspy/update-docs/src/obspy/obspy/clients/arclink/client.py", line 219, in _fetch
return self._request(request_type, request_data)
File "/private-backup/home/obspy/update-docs/src/obspy/obspy/clients/arclink/client.py", line 324, in _request
raise ArcLinkException("%s %s" % (err_code, msg))
obspy.clients.arclink.client.ArcLinkException: b'UNSET'
Traceback (most recent call last):
File "/private-backup/home/obspy/update-docs/src/obspy/obspy/clients/arclink/tests/test_decrypt.py", line 82, in test_get_waveform_with_dcid_key_file
stream2 = client2.get_waveforms('GE', 'APE', '', 'BHZ', start, end)
File "/private-backup/home/obspy/update-docs/src/obspy/obspy/clients/arclink/client.py", line 444, in get_waveforms
compressed=compressed, route=route)
File "/private-backup/home/obspy/update-docs/src/obspy/obspy/clients/arclink/client.py", line 565, in save_waveforms
data = self._fetch(rtype, rdata, route=route)
File "/private-backup/home/obspy/update-docs/src/obspy/obspy/clients/arclink/client.py", line 260, in _fetch
return self._request(request_type, request_data)
File "/private-backup/home/obspy/update-docs/src/obspy/obspy/clients/arclink/client.py", line 324, in _request
raise ArcLinkException("%s %s" % (err_code, msg))
obspy.clients.arclink.client.ArcLinkException: b'UNSET'
Traceback (most recent call last):
File "/private-backup/home/obspy/update-docs/src/obspy/obspy/clients/arclink/tests/test_client.py", line 48, in test_get_waveform
stream = client.get_waveforms('GE', 'APE', '', 'BHE', start, end)
File "/private-backup/home/obspy/update-docs/src/obspy/obspy/clients/arclink/client.py", line 444, in get_waveforms
compressed=compressed, route=route)
File "/private-backup/home/obspy/update-docs/src/obspy/obspy/clients/arclink/client.py", line 565, in save_waveforms
data = self._fetch(rtype, rdata, route=route)
File "/private-backup/home/obspy/update-docs/src/obspy/obspy/clients/arclink/client.py", line 260, in _fetch
return self._request(request_type, request_data)
File "/private-backup/home/obspy/update-docs/src/obspy/obspy/clients/arclink/client.py", line 324, in _request
raise ArcLinkException("%s %s" % (err_code, msg))
obspy.clients.arclink.client.ArcLinkException: b'UNSET'
Traceback (most recent call last):
File "/private-backup/home/obspy/update-docs/src/obspy/obspy/clients/arclink/tests/test_client.py", line 773, in test_get_waveform_instrument_change
metadata=True)
File "/private-backup/home/obspy/update-docs/src/obspy/obspy/clients/arclink/client.py", line 458, in get_waveforms
instruments=True, route=route)
File "/private-backup/home/obspy/update-docs/src/obspy/obspy/clients/arclink/client.py", line 1123, in get_inventory
result = self._fetch(rtype, rdata, route=route)
File "/private-backup/home/obspy/update-docs/src/obspy/obspy/clients/arclink/client.py", line 225, in _fetch
endtime=request_data[1])
File "/private-backup/home/obspy/update-docs/src/obspy/obspy/clients/arclink/client.py", line 622, in get_routing
result = self._fetch(rtype, rdata, route=False)
File "/private-backup/home/obspy/update-docs/src/obspy/obspy/clients/arclink/client.py", line 219, in _fetch
return self._request(request_type, request_data)
File "/private-backup/home/obspy/update-docs/src/obspy/obspy/clients/arclink/client.py", line 324, in _request
raise ArcLinkException("%s %s" % (err_code, msg))
obspy.clients.arclink.client.ArcLinkException: b'UNSET'
Traceback (most recent call last):
File "/home/obspy/anaconda3/envs/tmp_build_docs/lib/python3.4/doctest.py", line 2187, in runTest
raise self.failureException(self.format_failure(new.getvalue()))
AssertionError: Failed doctest test for obspy.clients.arclink.__init__
File "/private-backup/home/obspy/update-docs/src/obspy/obspy/clients/arclink/__init__.py", line 1, in __init__
----------------------------------------------------------------------
File "/private-backup/home/obspy/update-docs/src/obspy/obspy/clients/arclink/__init__.py", line 79, in obspy.clients.arclink.__init__
Failed example:
paz = client.get_paz('BW', 'MANZ', '', 'EHZ', dt)
Exception raised:
Traceback (most recent call last):
File "/home/obspy/anaconda3/envs/tmp_build_docs/lib/python3.4/doctest.py", line 1318, in __run
compileflags, 1), test.globs)
File "<doctest obspy.clients.arclink.__init__[10]>", line 1, in <module>
paz = client.get_paz('BW', 'MANZ', '', 'EHZ', dt)
File "/private-backup/home/obspy/update-docs/src/obspy/obspy/clients/arclink/client.py", line 947, in get_paz
instruments=True, route=route)
File "/private-backup/home/obspy/update-docs/src/obspy/obspy/clients/arclink/client.py", line 1123, in get_inventory
result = self._fetch(rtype, rdata, route=route)
File "/private-backup/home/obspy/update-docs/src/obspy/obspy/clients/arclink/client.py", line 219, in _fetch
return self._request(request_type, request_data)
File "/private-backup/home/obspy/update-docs/src/obspy/obspy/clients/arclink/client.py", line 324, in _request
raise ArcLinkException("%s %s" % (err_code, msg))
obspy.clients.arclink.client.ArcLinkException: b'UNSET'
Traceback (most recent call last):
File "/private-backup/home/obspy/update-docs/src/obspy/obspy/clients/fdsn/tests/test_federator_routing_client.py", line 342, in test_get_stations_integration_test
channel="LHZ", level="network")
File "<decorator-gen-64>", line 2, in get_stations
File "/private-backup/home/obspy/update-docs/src/obspy/obspy/clients/fdsn/routing/routing_client.py", line 79, in _assert_filename_not_in_kwargs
return f(*args, **kwargs)
File "/private-backup/home/obspy/update-docs/src/obspy/obspy/clients/fdsn/routing/federator_routing_client.py", line 110, in get_stations
return super(FederatorRoutingClient, self).get_stations(**kwargs)
File "<decorator-gen-61>", line 2, in get_stations
File "/private-backup/home/obspy/update-docs/src/obspy/obspy/clients/fdsn/routing/routing_client.py", line 79, in _assert_filename_not_in_kwargs
return f(*args, **kwargs)
File "/private-backup/home/obspy/update-docs/src/obspy/obspy/clients/fdsn/routing/routing_client.py", line 344, in get_stations
return self.get_stations_bulk([bulk], **kwargs)
File "<decorator-gen-65>", line 2, in get_stations_bulk
File "/private-backup/home/obspy/update-docs/src/obspy/obspy/clients/fdsn/routing/routing_client.py", line 79, in _assert_filename_not_in_kwargs
return f(*args, **kwargs)
File "/private-backup/home/obspy/update-docs/src/obspy/obspy/clients/fdsn/routing/federator_routing_client.py", line 143, in get_stations_bulk
r = self._download(self._url + "/query", data=bulk_str)
File "/private-backup/home/obspy/update-docs/src/obspy/obspy/clients/base.py", line 245, in _download
self._handle_requests_http_error(r)
File "/private-backup/home/obspy/update-docs/src/obspy/obspy/clients/fdsn/routing/routing_client.py", line 280, in _handle_requests_http_error
raise_on_error(r.status_code, get_reason_from_response(r))
File "/private-backup/home/obspy/update-docs/src/obspy/obspy/clients/fdsn/client.py", line 1710, in raise_on_error
raise FDSNException(msg, server_info)
obspy.clients.fdsn.header.FDSNException: Bad request. If you think your request was valid please contact the developers.
Traceback (most recent call last):
File "/private-backup/home/obspy/update-docs/src/obspy/obspy/clients/fdsn/tests/test_client.py", line 1265, in test_eida_token_resolution
user, password = client._resolve_eida_token(token=token)
File "/private-backup/home/obspy/update-docs/src/obspy/obspy/clients/fdsn/client.py", line 373, in _resolve_eida_token
use_gzip=True, return_string=True)
File "/private-backup/home/obspy/update-docs/src/obspy/obspy/clients/fdsn/client.py", line 1382, in _download
raise_on_error(code, data)
File "/private-backup/home/obspy/update-docs/src/obspy/obspy/clients/fdsn/client.py", line 1735, in raise_on_error
(str(data.__class__.__name__), str(data))))
obspy.clients.fdsn.header.FDSNException: Unknown Error (URLError): <urlopen error [SSL: CERTIFICATE_VERIFY_FAILED] certificate verify failed (_ssl.c:600)>
Traceback (most recent call last):
File "/home/obspy/anaconda3/envs/tmp_build_docs/lib/python3.4/doctest.py", line 2187, in runTest
raise self.failureException(self.format_failure(new.getvalue()))
AssertionError: Failed doctest test for obspy.clients.syngine.__init__
File "/private-backup/home/obspy/update-docs/src/obspy/obspy/clients/syngine/__init__.py", line 1, in __init__
----------------------------------------------------------------------
File "/private-backup/home/obspy/update-docs/src/obspy/obspy/clients/syngine/__init__.py", line 54, in obspy.clients.syngine.__init__
Failed example:
st = client.get_waveforms(model="ak135f_5s", network="IU", station="AN*",
eventid="GCMT:C201002270634A",
starttime="P-10", endtime="P+20")
Exception raised:
Traceback (most recent call last):
File "/home/obspy/anaconda3/envs/tmp_build_docs/lib/python3.4/doctest.py", line 1318, in __run
compileflags, 1), test.globs)
File "<doctest obspy.clients.syngine.__init__[5]>", line 3, in <module>
starttime="P-10", endtime="P+20")
File "/private-backup/home/obspy/update-docs/src/obspy/obspy/clients/syngine/client.py", line 371, in get_waveforms
filename=filename)
File "/private-backup/home/obspy/update-docs/src/obspy/obspy/clients/base.py", line 245, in _download
self._handle_requests_http_error(r)
File "/private-backup/home/obspy/update-docs/src/obspy/obspy/clients/syngine/client.py", line 62, in _handle_requests_http_error
raise ClientHTTPException(msg.strip())
obspy.clients.base.ClientHTTPException: HTTP code 400 when downloading 'http://service.iris.edu/irisws/syngine/1/query?eventid=GCMT%3AC201002270634A&format=miniseed&endtime=P%2B20&station=AN%2A&network=IU&starttime=P-10&model=ak135f_5s':
Error 400: RECEIVER lat:39.678769, lon:32.7934, netcode:IU, stacode:ANTO, STATUS: Instaseis Error [400]: No seismograms found for the given phase relative offsets. This could either be due to the chosen phase not existing for the specific source-receiver geometry or arriving too late/with too large offsets if the database is not long enough.
More Details:
handler exited, code: 3 reason: Bad Request
Request:
http://service.iris.edu/irisws/syngine/1/query?eventid=GCMT%3AC201002270634A&format=miniseed&endtime=P%2B20&station=AN%2A&network=IU&starttime=P-10&model=ak135f_5s
Request Submitted:
2018/04/16 05:01:30 UTC
Service version:
Service: irisws-syngine version: 1.0.4

Skipped Tests (43)

Submodule Test Skip Message
imaging test_script_plot (obspy.imaging.tests.test_mopad_script.MopadTestCase) Currently broken until further review.
geodetics test_gps_2_dist_azimuth_with_geographiclib (obspy.geodetics.tests.test_util_geodetics.UtilGeodeticsTestCase) Module geographiclib is not installed
geodetics test_issue_375 (obspy.geodetics.tests.test_util_geodetics.UtilGeodeticsTestCase) Module geographiclib is not installed
clients.seishub test_get_channel_ids (obspy.clients.seishub.tests.test_client.ClientTestCase) Seishub test server not reachable.
clients.seishub test_get_coordinates (obspy.clients.seishub.tests.test_client.ClientTestCase) Seishub test server not reachable.
clients.seishub test_get_event_list (obspy.clients.seishub.tests.test_client.ClientTestCase) Seishub test server not reachable.
clients.seishub test_get_location_ids (obspy.clients.seishub.tests.test_client.ClientTestCase) Seishub test server not reachable.
clients.seishub test_get_network_ids (obspy.clients.seishub.tests.test_client.ClientTestCase) Seishub test server not reachable.
clients.seishub test_get_paz (obspy.clients.seishub.tests.test_client.ClientTestCase) Seishub test server not reachable.
clients.seishub test_get_preview (obspy.clients.seishub.tests.test_client.ClientTestCase) Seishub test server not reachable.
clients.seishub test_get_preview_by_ids (obspy.clients.seishub.tests.test_client.ClientTestCase) Seishub test server not reachable.
clients.seishub test_get_station_ids (obspy.clients.seishub.tests.test_client.ClientTestCase) Seishub test server not reachable.
clients.seishub test_get_waveform_with_metadata (obspy.clients.seishub.tests.test_client.ClientTestCase) Seishub test server not reachable.
clients.seishub test_get_waveforms (obspy.clients.seishub.tests.test_client.ClientTestCase) Seishub test server not reachable.
clients.seishub test_localcache (obspy.clients.seishub.tests.test_client.ClientTestCase) Seishub test server not reachable.
clients.seishub test_ping (obspy.clients.seishub.tests.test_client.ClientTestCase) Seishub test server not reachable.
core test_flake8 (obspy.core.tests.test_code_formatting.CodeFormattingTestCase) Formatting tests require at least flake8 3.0.
core test_location_plot_global (obspy.core.tests.test_network.NetworkCartopyTestCase) cartopy not installed
core test_location_plot_local (obspy.core.tests.test_network.NetworkCartopyTestCase) cartopy not installed
core test_location_plot_ortho (obspy.core.tests.test_network.NetworkCartopyTestCase) cartopy not installed
core test_location_plot_global (obspy.core.tests.test_inventory.InventoryCartopyTestCase) cartopy not installed
core test_location_plot_local (obspy.core.tests.test_inventory.InventoryCartopyTestCase) cartopy not installed
core test_location_plot_ortho (obspy.core.tests.test_inventory.InventoryCartopyTestCase) cartopy not installed
core test_catalog_plot_global (obspy.core.tests.test_event.CatalogCartopyTestCase) Cartopy not installed or too old
core test_catalog_plot_local (obspy.core.tests.test_event.CatalogCartopyTestCase) Cartopy not installed or too old
core test_catalog_plot_ortho (obspy.core.tests.test_event.CatalogCartopyTestCase) Cartopy not installed or too old
core test_catalog_plot_ortho_longitude_wrap (obspy.core.tests.test_event.CatalogCartopyTestCase) Cartopy not installed or too old
taup test_compute_ray_paths (obspy.taup.tests.test_ray_paths.RayPathCalculationsTestCase) test needs geographiclib >= 1.34
taup test_path_geo (obspy.taup.tests.test_taup_geo.TaupGeoTestCase) Module geographiclib is not installed or too old.
taup test_path_resampling (obspy.taup.tests.test_taup_geo.TaupGeoTestCase) Module geographiclib is not installed or too old.
taup test_p_iasp91_geo_manual (obspy.taup.tests.test_tau.TauPyModelTestCase) Module geographiclib is not installed
taup test_pierce_p_iasp91_geo (obspy.taup.tests.test_tau.TauPyModelTestCase) test needs geographiclib >= 1.34
taup test_single_path_geo_iasp91 (obspy.taup.tests.test_tau.TauPyModelTestCase) test needs geographiclib >= 1.34
clients.arclink test_get_waveform_with_default_dcid_key_file (obspy.clients.arclink.tests.test_decrypt.ClientTestCase) $HOME/dcidpasswords.txt already exists
clients.arclink test_m2crypto (obspy.clients.arclink.tests.test_decrypt.ClientTestCase) M2Crypto is not installed
clients.seedlink test_info (obspy.clients.seedlink.tests.test_slclient.SLClientTestCase) test must be started manually
clients.seedlink test_issue708 (obspy.clients.seedlink.tests.test_slclient.SLClientTestCase) test must be started manually
clients.seedlink test_time_window (obspy.clients.seedlink.tests.test_slclient.SLClientTestCase) test must be started manually
io.shapefile test_write_catalog_shapefile (obspy.io.shapefile.tests.test_core.ShapefileTestCase) pyshp not installed
io.shapefile test_write_catalog_shapefile_via_plugin (obspy.io.shapefile.tests.test_core.ShapefileTestCase) pyshp not installed
io.shapefile test_write_catalog_shapefile_with_extra_field (obspy.io.shapefile.tests.test_core.ShapefileTestCase) pyshp not installed
io.shapefile test_write_inventory_shapefile (obspy.io.shapefile.tests.test_core.ShapefileTestCase) pyshp not installed
io.shapefile test_write_inventory_shapefile_via_plugin (obspy.io.shapefile.tests.test_core.ShapefileTestCase) pyshp not installed

Slowest Tests (20)

Runtime Test
37.881s test_get_not_existing_waveform (obspy.clients.arclink.tests.test_client.ClientTestCase)
37.678s test_get_waveform_instrument_change (obspy.clients.arclink.tests.test_client.ClientTestCase)
32.665s test_save_waveform_no_compression (obspy.clients.arclink.tests.test_client.ClientTestCase)
32.455s test_get_networks (obspy.clients.arclink.tests.test_client.ClientTestCase)
30.644s test_get_waveform_with_dcid_key_file (obspy.clients.arclink.tests.test_decrypt.ClientTestCase)
30.088s test_get_waveform (obspy.clients.arclink.tests.test_client.ClientTestCase)
29.465s __init__ (obspy.clients.arclink)
28.503s test_cryptography (obspy.clients.arclink.tests.test_decrypt.ClientTestCase)
27.713s test_save_waveform_compressed (obspy.clients.arclink.tests.test_client.ClientTestCase)
27.407s test_get_waveform_with_dcid_key (obspy.clients.arclink.tests.test_decrypt.ClientTestCase)
25.958s get_metadata (obspy.clients.arclink.client.Client)
25.914s get_waveforms (obspy.clients.arclink.client.Client)
25.899s test_get_waveform_no_compression (obspy.clients.arclink.tests.test_client.ClientTestCase)
25.888s test_get_waveform_with_metadata (obspy.clients.arclink.tests.test_client.ClientTestCase)
22.333s test_get_stations (obspy.clients.arclink.tests.test_client.ClientTestCase)
20.766s test_plot_farfield_without_quiver_with_maps (obspy.core.tests.test_event.EventTestCase)
11.944s test_response_calculation_from_seed_and_xseed (obspy.io.xseed.tests.test_core.CoreTestCase)
11.385s test_redirection_auth (obspy.clients.fdsn.tests.test_client.ClientTestCase)
11.190s __init__ (obspy.taup)
10.415s test_redirection (obspy.clients.fdsn.tests.test_client.ClientTestCase)

Chuck Norris Fact

Chuck Norris's keyboard has the Any key.