#94151 Report by node travis-ci covering 1968 tests from 54 modules resulted into 11 errors

Report

ObsPy Version
1.1.0.post0+164.gaabc7ff83d...
Continuous Integration
https://travis-ci.org/obspy/obspy/jobs/373839146
GitHub Pull Request
-
Report File
XML Document
Total Runtime
1450.6 sec
Report Date/Time
2018-05-02 05:21:09

System / Python

Architecture
64bit
Machine
x86_64
Node
travis-ci
Processor
i386
Python Compiler
GCC 4.2.1 Compatible Clang 4.0.1 (tags/RELEASE_401/final)
Python Implementation
CPython
Python Version
2.7.14
Release
16.7.0
System
Darwin
Version
Darwin Kernel Version 16.7.0: Thu Jun 15 17:36:27 PDT 2017; root:xnu-3789.70.16~2/RELEASE_X86_64

Dependencies

cartopy
---
decorator
4.3.0
flake8
---
future
0.16.0
geographiclib
1.49
lxml.etree
4.2.1
m2crypto
---
matplotlib
2.0.2
mock
2.0.0
mpl_toolkits.basemap
1.0.7
numpy
1.13.3
pep8-naming
---
pyflakes
---
pyimgur
0.5.2
pyproj
1.9.5.1
requests
2.18.4
scipy
1.0.1
setuptools
39.1.0
shapefile
1.2.12
sqlalchemy
1.2.7

Modules (54)

Module Errors /
Failures
Tracebacks
obspy.clients.arclink 6 1 2 3 4 5 6
obspy.clients.earthworm 1 7
obspy.clients.fdsn 2 8 9
obspy.clients.filesystem - -
obspy.clients.iris 2 10 11
obspy.clients.neic - -
obspy.clients.nrl - -
obspy.clients.seedlink - -
obspy.clients.seishub - -
obspy.clients.syngine - -
obspy.core - -
obspy.db - -
obspy.geodetics - -
obspy.imaging - -
obspy.io.ah - -
obspy.io.arclink - -
obspy.io.ascii - -
obspy.io.cmtsolution - -
obspy.io.cnv - -
obspy.io.css - -
obspy.io.gcf - -
obspy.io.gse2 - -
obspy.io.iaspei - -
obspy.io.json - -
obspy.io.kinemetrics - -
obspy.io.kml - -
obspy.io.mseed - -
obspy.io.ndk - -
obspy.io.nied - -
obspy.io.nlloc - -
obspy.io.nordic - -
obspy.io.pdas - -
obspy.io.pde - -
obspy.io.quakeml - -
obspy.io.reftek - -
obspy.io.sac - -
obspy.io.scardec - -
obspy.io.seg2 - -
obspy.io.segy - -
obspy.io.seisan - -
obspy.io.seiscomp - -
obspy.io.sh - -
obspy.io.shapefile - -
obspy.io.stationtxt - -
obspy.io.stationxml - -
obspy.io.wav - -
obspy.io.win - -
obspy.io.xseed - -
obspy.io.y - -
obspy.io.zmap - -
obspy.realtime - -
obspy.scripts - -
obspy.signal - -
obspy.taup - -
Summary 11 11

Tracebacks (11)

Traceback (most recent call last):
File "/Users/travis/miniconda/envs/test-environment/lib/python2.7/site-packages/obspy/clients/arclink/tests/test_client.py", line 161, in test_get_inventory
endtime=dt + 1)
File "/Users/travis/miniconda/envs/test-environment/lib/python2.7/site-packages/obspy/clients/arclink/client.py", line 1123, in get_inventory
result = self._fetch(rtype, rdata, route=route)
File "/Users/travis/miniconda/envs/test-environment/lib/python2.7/site-packages/obspy/clients/arclink/client.py", line 219, in _fetch
return self._request(request_type, request_data)
File "/Users/travis/miniconda/envs/test-environment/lib/python2.7/site-packages/obspy/clients/arclink/client.py", line 324, in _request
raise ArcLinkException("%s %s" % (err_code, msg))
ArcLinkException: UNSET
Traceback (most recent call last):
File "/Users/travis/miniconda/envs/test-environment/lib/python2.7/site-packages/obspy/clients/arclink/tests/test_client.py", line 48, in test_get_waveform
stream = client.get_waveforms('GE', 'APE', '', 'BHE', start, end)
File "/Users/travis/miniconda/envs/test-environment/lib/python2.7/site-packages/obspy/clients/arclink/client.py", line 444, in get_waveforms
compressed=compressed, route=route)
File "/Users/travis/miniconda/envs/test-environment/lib/python2.7/site-packages/obspy/clients/arclink/client.py", line 565, in save_waveforms
data = self._fetch(rtype, rdata, route=route)
File "/Users/travis/miniconda/envs/test-environment/lib/python2.7/site-packages/obspy/clients/arclink/client.py", line 260, in _fetch
return self._request(request_type, request_data)
File "/Users/travis/miniconda/envs/test-environment/lib/python2.7/site-packages/obspy/clients/arclink/client.py", line 324, in _request
raise ArcLinkException("%s %s" % (err_code, msg))
ArcLinkException: UNSET
Traceback (most recent call last):
File "/Users/travis/miniconda/envs/test-environment/lib/python2.7/site-packages/obspy/clients/arclink/tests/test_client.py", line 757, in test_get_waveform_instrument_change
metadata=True)
File "/Users/travis/miniconda/envs/test-environment/lib/python2.7/site-packages/obspy/clients/arclink/client.py", line 444, in get_waveforms
compressed=compressed, route=route)
File "/Users/travis/miniconda/envs/test-environment/lib/python2.7/site-packages/obspy/clients/arclink/client.py", line 565, in save_waveforms
data = self._fetch(rtype, rdata, route=route)
File "/Users/travis/miniconda/envs/test-environment/lib/python2.7/site-packages/obspy/clients/arclink/client.py", line 225, in _fetch
endtime=request_data[1])
File "/Users/travis/miniconda/envs/test-environment/lib/python2.7/site-packages/obspy/clients/arclink/client.py", line 622, in get_routing
result = self._fetch(rtype, rdata, route=False)
File "/Users/travis/miniconda/envs/test-environment/lib/python2.7/site-packages/obspy/clients/arclink/client.py", line 219, in _fetch
return self._request(request_type, request_data)
File "/Users/travis/miniconda/envs/test-environment/lib/python2.7/site-packages/obspy/clients/arclink/client.py", line 324, in _request
raise ArcLinkException("%s %s" % (err_code, msg))
ArcLinkException: UNSET
Traceback (most recent call last):
File "/Users/travis/miniconda/envs/test-environment/lib/python2.7/site-packages/obspy/clients/arclink/tests/test_client.py", line 699, in test_issue_311
metadata=True)
File "/Users/travis/miniconda/envs/test-environment/lib/python2.7/site-packages/obspy/clients/arclink/client.py", line 458, in get_waveforms
instruments=True, route=route)
File "/Users/travis/miniconda/envs/test-environment/lib/python2.7/site-packages/obspy/clients/arclink/client.py", line 1123, in get_inventory
result = self._fetch(rtype, rdata, route=route)
File "/Users/travis/miniconda/envs/test-environment/lib/python2.7/site-packages/obspy/clients/arclink/client.py", line 225, in _fetch
endtime=request_data[1])
File "/Users/travis/miniconda/envs/test-environment/lib/python2.7/site-packages/obspy/clients/arclink/client.py", line 622, in get_routing
result = self._fetch(rtype, rdata, route=False)
File "/Users/travis/miniconda/envs/test-environment/lib/python2.7/site-packages/obspy/clients/arclink/client.py", line 219, in _fetch
return self._request(request_type, request_data)
File "/Users/travis/miniconda/envs/test-environment/lib/python2.7/site-packages/obspy/clients/arclink/client.py", line 324, in _request
raise ArcLinkException("%s %s" % (err_code, msg))
ArcLinkException: UNSET
Traceback (most recent call last):
File "/Users/travis/miniconda/envs/test-environment/lib/python2.7/site-packages/obspy/clients/arclink/tests/test_client.py", line 564, in test_save_waveform_compressed
end, unpack=False)
File "/Users/travis/miniconda/envs/test-environment/lib/python2.7/site-packages/obspy/clients/arclink/client.py", line 565, in save_waveforms
data = self._fetch(rtype, rdata, route=route)
File "/Users/travis/miniconda/envs/test-environment/lib/python2.7/site-packages/obspy/clients/arclink/client.py", line 260, in _fetch
return self._request(request_type, request_data)
File "/Users/travis/miniconda/envs/test-environment/lib/python2.7/site-packages/obspy/clients/arclink/client.py", line 324, in _request
raise ArcLinkException("%s %s" % (err_code, msg))
ArcLinkException: UNSET
Traceback (most recent call last):
File "/Users/travis/miniconda/envs/test-environment/lib/python2.7/site-packages/obspy/clients/arclink/tests/test_client.py", line 541, in test_save_waveform_no_compression
end, format='FSEED')
File "/Users/travis/miniconda/envs/test-environment/lib/python2.7/site-packages/obspy/clients/arclink/client.py", line 565, in save_waveforms
data = self._fetch(rtype, rdata, route=route)
File "/Users/travis/miniconda/envs/test-environment/lib/python2.7/site-packages/obspy/clients/arclink/client.py", line 225, in _fetch
endtime=request_data[1])
File "/Users/travis/miniconda/envs/test-environment/lib/python2.7/site-packages/obspy/clients/arclink/client.py", line 622, in get_routing
result = self._fetch(rtype, rdata, route=False)
File "/Users/travis/miniconda/envs/test-environment/lib/python2.7/site-packages/obspy/clients/arclink/client.py", line 219, in _fetch
return self._request(request_type, request_data)
File "/Users/travis/miniconda/envs/test-environment/lib/python2.7/site-packages/obspy/clients/arclink/client.py", line 324, in _request
raise ArcLinkException("%s %s" % (err_code, msg))
ArcLinkException: UNSET
Traceback (most recent call last):
File "<decorator-gen-54>", line 2, in test_get_waveform
File "/Users/travis/miniconda/envs/test-environment/lib/python2.7/site-packages/obspy/core/util/decorator.py", line 127, in skip_on_network_error
return func(*args, **kwargs)
File "/Users/travis/miniconda/envs/test-environment/lib/python2.7/site-packages/obspy/clients/earthworm/tests/test_client.py", line 70, in test_get_waveform
self.assertEqual(len(stream), 3)
AssertionError: 2 != 3
Traceback (most recent call last):
File "/Users/travis/miniconda/envs/test-environment/lib/python2.7/site-packages/obspy/clients/fdsn/tests/test_federator_routing_client.py", line 342, in test_get_stations_integration_test
channel="LHZ", level="network")
File "<decorator-gen-68>", line 2, in get_stations
File "/Users/travis/miniconda/envs/test-environment/lib/python2.7/site-packages/obspy/clients/fdsn/routing/routing_client.py", line 79, in _assert_filename_not_in_kwargs
return f(*args, **kwargs)
File "/Users/travis/miniconda/envs/test-environment/lib/python2.7/site-packages/obspy/clients/fdsn/routing/federator_routing_client.py", line 110, in get_stations
return super(FederatorRoutingClient, self).get_stations(**kwargs)
File "<decorator-gen-61>", line 2, in get_stations
File "/Users/travis/miniconda/envs/test-environment/lib/python2.7/site-packages/obspy/clients/fdsn/routing/routing_client.py", line 79, in _assert_filename_not_in_kwargs
return f(*args, **kwargs)
File "/Users/travis/miniconda/envs/test-environment/lib/python2.7/site-packages/obspy/clients/fdsn/routing/routing_client.py", line 344, in get_stations
return self.get_stations_bulk([bulk], **kwargs)
File "<decorator-gen-69>", line 2, in get_stations_bulk
File "/Users/travis/miniconda/envs/test-environment/lib/python2.7/site-packages/obspy/clients/fdsn/routing/routing_client.py", line 79, in _assert_filename_not_in_kwargs
return f(*args, **kwargs)
File "/Users/travis/miniconda/envs/test-environment/lib/python2.7/site-packages/obspy/clients/fdsn/routing/federator_routing_client.py", line 143, in get_stations_bulk
r = self._download(self._url + "/query", data=bulk_str)
File "/Users/travis/miniconda/envs/test-environment/lib/python2.7/site-packages/obspy/clients/base.py", line 245, in _download
self._handle_requests_http_error(r)
File "/Users/travis/miniconda/envs/test-environment/lib/python2.7/site-packages/obspy/clients/fdsn/routing/routing_client.py", line 280, in _handle_requests_http_error
raise_on_error(r.status_code, get_reason_from_response(r))
File "/Users/travis/miniconda/envs/test-environment/lib/python2.7/site-packages/obspy/clients/fdsn/client.py", line 1710, in raise_on_error
raise FDSNException(msg, server_info)
FDSNException: Bad request. If you think your request was valid please contact the developers.
Traceback (most recent call last):
File "/Users/travis/miniconda/envs/test-environment/lib/python2.7/site-packages/obspy/clients/fdsn/tests/test_client.py", line 1265, in test_eida_token_resolution
user, password = client._resolve_eida_token(token=token)
File "/Users/travis/miniconda/envs/test-environment/lib/python2.7/site-packages/obspy/clients/fdsn/client.py", line 373, in _resolve_eida_token
use_gzip=True, return_string=True)
File "/Users/travis/miniconda/envs/test-environment/lib/python2.7/site-packages/obspy/clients/fdsn/client.py", line 1382, in _download
raise_on_error(code, data)
File "/Users/travis/miniconda/envs/test-environment/lib/python2.7/site-packages/obspy/clients/fdsn/client.py", line 1710, in raise_on_error
raise FDSNException(msg, server_info)
FDSNException: Bad request. If you think your request was valid please contact the developers.
Detailed response of server:
Error 400: Bad Request
invalid token
Usage details are available from /fdsnws/dataselect/1/
Request:
/fdsnws/dataselect/1/auth
Request Submitted:
2018-05-02T10:06:34.799882
Service Version:
1.1.1
Traceback (most recent call last):
File "/Users/travis/miniconda/envs/test-environment/lib/python2.7/site-packages/obspy/clients/iris/tests/test_client.py", line 256, in test_timeseries
filter=["correct"])
File "/Users/travis/miniconda/envs/test-environment/lib/python2.7/site-packages/obspy/clients/iris/client.py", line 344, in timeseries
raise Exception(msg)
Exception: No waveform data available (HTTPError: HTTP Error 400: Bad Request)
Traceback (most recent call last):
File "/Users/travis/miniconda/envs/test-environment/lib/python2.7/doctest.py", line 2226, in runTest
raise self.failureException(self.format_failure(new.getvalue()))
AssertionError: Failed doctest test for obspy.clients.iris.client.Client.timeseries
File "/Users/travis/miniconda/envs/test-environment/lib/python2.7/site-packages/obspy/clients/iris/client.py", line 177, in timeseries
----------------------------------------------------------------------
File "/Users/travis/miniconda/envs/test-environment/lib/python2.7/site-packages/obspy/clients/iris/client.py", line 318, in obspy.clients.iris.client.Client.timeseries
Failed example:
st = client.timeseries("IU", "ANMO", "00", "BHZ", dt, dt+10,
filter=["correct", "demean", "lp=2.0"])
Exception raised:
Traceback (most recent call last):
File "/Users/travis/miniconda/envs/test-environment/lib/python2.7/doctest.py", line 1315, in __run
compileflags, 1) in test.globs
File "<doctest obspy.clients.iris.client.Client.timeseries[6]>", line 2, in <module>
filter=["correct", "demean", "lp=2.0"])
File "/Users/travis/miniconda/envs/test-environment/lib/python2.7/site-packages/obspy/clients/iris/client.py", line 344, in timeseries
raise Exception(msg)
Exception: No waveform data available (HTTPError: HTTP Error 400: Bad Request)
----------------------------------------------------------------------
File "/Users/travis/miniconda/envs/test-environment/lib/python2.7/site-packages/obspy/clients/iris/client.py", line 320, in obspy.clients.iris.client.Client.timeseries
Failed example:
print(st[0].data) # doctest: +ELLIPSIS
Expected:
[ -1.57488682e-06 -1.26318002e-06 -7.84807128e-07 ...
Got:
[ 24 20 19 19 19 15 10 4 -4 -11 -19 -26 -35 -48 -60
-72 -83 -95 -109 -121 -133 -147 -162 -179 -195 -208 -221 -238 -256 -272
-285 -301 -314 -324 -333 -341 -350 -358 -365 -370 -376 -378 -378 -380 -381
-381 -378 -376 -374 -370 -364 -359 -356 -352 -345 -337 -331 -328 -323 -316
-310 -305 -301 -295 -290 -289 -283 -275 -271 -269 -267 -263 -258 -257 -253
-248 -243 -240 -239 -237 -233 -229 -224 -218 -211 -208 -205 -202 -200 -195
-191 -185 -181 -180 -179 -177 -177 -177 -176 -176 -179 -183 -185 -187 -189
-192 -198 -204 -210 -216 -220 -227 -235 -241 -247 -253 -262 -270 -277 -284
-294 -304 -313 -323 -332 -340 -345 -350 -355 -358 -361 -364 -369 -372 -371
-372 -374 -373 -368 -364 -362 -357 -349 -344 -338 -331 -320 -311 -302 -291
-280 -268 -255 -243 -231 -218 -203 -187 -173 -160 -147 -132 -119 -108 -97
-86 -73 -62 -54 -48 -42 -37 -33 -29 -27 -27 -25 -26 -27 -29
-31 -30 -31 -36 -40 -44 -52 -59 -68 -77 -83 -89 -95 -101 -108
-116 -123 -130 -141 -150]

Skipped Tests (31)

Submodule Test Skip Message
geodetics test_gps_2_dist_azimuth_bug150 (obspy.geodetics.tests.test_util_geodetics.UtilGeodeticsTestCase) Module geographiclib is installed, not using calc_vincenty_inverse
clients.arclink test_m2crypto (obspy.clients.arclink.tests.test_decrypt.ClientTestCase) M2Crypto is not installed
clients.arclink test_pycrypto (obspy.clients.arclink.tests.test_decrypt.ClientTestCase) PyCrypto is not installed
clients.seishub test_get_channel_ids (obspy.clients.seishub.tests.test_client.ClientTestCase) Seishub test server not reachable.
clients.seishub test_get_coordinates (obspy.clients.seishub.tests.test_client.ClientTestCase) Seishub test server not reachable.
clients.seishub test_get_event_list (obspy.clients.seishub.tests.test_client.ClientTestCase) Seishub test server not reachable.
clients.seishub test_get_location_ids (obspy.clients.seishub.tests.test_client.ClientTestCase) Seishub test server not reachable.
clients.seishub test_get_network_ids (obspy.clients.seishub.tests.test_client.ClientTestCase) Seishub test server not reachable.
clients.seishub test_get_paz (obspy.clients.seishub.tests.test_client.ClientTestCase) Seishub test server not reachable.
clients.seishub test_get_preview (obspy.clients.seishub.tests.test_client.ClientTestCase) Seishub test server not reachable.
clients.seishub test_get_preview_by_ids (obspy.clients.seishub.tests.test_client.ClientTestCase) Seishub test server not reachable.
clients.seishub test_get_station_ids (obspy.clients.seishub.tests.test_client.ClientTestCase) Seishub test server not reachable.
clients.seishub test_get_waveform_with_metadata (obspy.clients.seishub.tests.test_client.ClientTestCase) Seishub test server not reachable.
clients.seishub test_get_waveforms (obspy.clients.seishub.tests.test_client.ClientTestCase) Seishub test server not reachable.
clients.seishub test_localcache (obspy.clients.seishub.tests.test_client.ClientTestCase) Seishub test server not reachable.
clients.seishub test_ping (obspy.clients.seishub.tests.test_client.ClientTestCase) Seishub test server not reachable.
core test_flake8 (obspy.core.tests.test_code_formatting.CodeFormattingTestCase) Formatting tests require at least flake8 3.0.
core test_catalog_plot_global (obspy.core.tests.test_event.CatalogCartopyTestCase) Cartopy not installed or too old
core test_catalog_plot_local (obspy.core.tests.test_event.CatalogCartopyTestCase) Cartopy not installed or too old
core test_catalog_plot_ortho (obspy.core.tests.test_event.CatalogCartopyTestCase) Cartopy not installed or too old
core test_catalog_plot_ortho_longitude_wrap (obspy.core.tests.test_event.CatalogCartopyTestCase) Cartopy not installed or too old
core test_location_plot_global (obspy.core.tests.test_inventory.InventoryCartopyTestCase) cartopy not installed
core test_location_plot_local (obspy.core.tests.test_inventory.InventoryCartopyTestCase) cartopy not installed
core test_location_plot_ortho (obspy.core.tests.test_inventory.InventoryCartopyTestCase) cartopy not installed
core test_location_plot_global (obspy.core.tests.test_network.NetworkCartopyTestCase) cartopy not installed
core test_location_plot_local (obspy.core.tests.test_network.NetworkCartopyTestCase) cartopy not installed
core test_location_plot_ortho (obspy.core.tests.test_network.NetworkCartopyTestCase) cartopy not installed
imaging test_script_plot (obspy.imaging.tests.test_mopad_script.MopadTestCase) Currently broken until further review.
clients.seedlink test_info (obspy.clients.seedlink.tests.test_slclient.SLClientTestCase) test must be started manually
clients.seedlink test_issue708 (obspy.clients.seedlink.tests.test_slclient.SLClientTestCase) test must be started manually
clients.seedlink test_time_window (obspy.clients.seedlink.tests.test_slclient.SLClientTestCase) test must be started manually

Slowest Tests (20)

Runtime Test
47.826s test_issue_311 (obspy.clients.arclink.tests.test_client.ClientTestCase)
47.095s test_get_waveform (obspy.clients.arclink.tests.test_client.ClientTestCase)
47.093s test_response_calculation_from_seed_and_xseed (obspy.io.xseed.tests.test_core.CoreTestCase)
43.728s test_save_waveform_no_compression (obspy.clients.arclink.tests.test_client.ClientTestCase)
42.511s test_get_not_existing_waveform (obspy.clients.arclink.tests.test_client.ClientTestCase)
42.178s test_save_waveform_compressed (obspy.clients.arclink.tests.test_client.ClientTestCase)
41.441s test_plot_farfield_without_quiver_with_maps (obspy.core.tests.test_event.EventTestCase)
39.836s test_get_inventory (obspy.clients.arclink.tests.test_client.ClientTestCase)
39.833s test_get_waveform_instrument_change (obspy.clients.arclink.tests.test_client.ClientTestCase)
36.457s test_get_networks (obspy.clients.arclink.tests.test_client.ClientTestCase)
20.562s test_get_routing (obspy.clients.arclink.tests.test_client.ClientTestCase)
18.835s test_ppsd_restricted_stacks (obspy.signal.tests.test_spectral_estimation.PsdTestCase)
18.306s test_issue_372 (obspy.clients.arclink.tests.test_client.ClientTestCase)
18.205s __init__ (obspy.taup)
17.630s test_get_waveform_with_metadata (obspy.clients.arclink.tests.test_client.ClientTestCase)
15.394s test_plot_multiple_traces (obspy.imaging.tests.test_waveform.WaveformTestCase)
14.963s test_shoot_existing_ray_param (obspy.taup.tests.test_seismic_phase.TauPySeismicPhaseTestCase)
14.785s test_get_waveform_with_dcid_key_file (obspy.clients.arclink.tests.test_decrypt.ClientTestCase)
14.496s test_auto_read_arclink_xml (obspy.io.arclink.tests.test_inventory_xml.ArclinkInventoryTestCase)
14.285s test_get_stations (obspy.clients.arclink.tests.test_client.ClientTestCase)

Chuck Norris Fact

Chuck Norris can install a 64 bit OS on 32 bit machines.