#94883 Report by node docker-deb-debian_9_stretch covering 1742 tests from 49 modules resulted into 90 errors

Report

ObsPy Version
1.0.2.post0+998.g54b8d6bb3a...
Continuous Integration
-
GitHub Pull Request
-
Report File
XML Document
Total Runtime
590.7 sec
Report Date/Time
2018-05-06 09:19:42

System / Python

Architecture
64bit
Machine
x86_64
Node
docker-deb-debian_9_stretch
Processor
None
Python Compiler
GCC 6.3.0 20170118
Python Implementation
CPython
Python Version
3.5.3
Release
4.4.0-119-generic
System
Linux
Version
#143-Ubuntu SMP Mon Apr 2 16:08:24 UTC 2018

Dependencies

cartopy
---
decorator
4.0.11
flake8
3.2.1
future
0.15.2
geographiclib
1.46
lxml.etree
3.7.1
m2crypto
---
matplotlib
2.0.0
mock
2.0.0
mpl_toolkits.basemap
1.0.7
numpy
1.12.1
osgeo.gdal
---
pep8-naming
---
pyflakes
1.3.0
pyimgur
0.5.3
pyproj
1.9.5.1
requests
2.12.4
scipy
0.18.1
setuptools
33.1.1
sqlalchemy
1.0.15

Modules (49)

Module Errors /
Failures
Tracebacks
obspy.clients.arclink - -
obspy.clients.earthworm - -
obspy.clients.fdsn 2 1 2
obspy.clients.filesystem - -
obspy.clients.iris 2 3 4
obspy.clients.neic - -
obspy.clients.seedlink 3 5 6 7
obspy.clients.seishub - -
obspy.clients.syngine - -
obspy.core 19 8 9 10 11 12 13 14 15 16 17 18 19 20 21 22 23 24 25 26
obspy.db - -
obspy.geodetics - -
obspy.imaging 41 27 28 29 30 31 32 33 34 35 36 37 38 39 40 41 42 43 44 45 46 47 48 49 50 51 52 53 54 55 56 57 58 59 60 61 62 63 64 65 66 67
obspy.io.ah - -
obspy.io.ascii - -
obspy.io.cmtsolution - -
obspy.io.cnv - -
obspy.io.css - -
obspy.io.datamark - -
obspy.io.gcf - -
obspy.io.gse2 - -
obspy.io.json - -
obspy.io.kinemetrics - -
obspy.io.kml - -
obspy.io.mseed - -
obspy.io.ndk - -
obspy.io.nied - -
obspy.io.nlloc - -
obspy.io.nordic - -
obspy.io.pdas - -
obspy.io.pde - -
obspy.io.quakeml - -
obspy.io.reftek - -
obspy.io.sac - -
obspy.io.seg2 - -
obspy.io.segy - -
obspy.io.seisan - -
obspy.io.seiscomp - -
obspy.io.sh - -
obspy.io.shapefile - -
obspy.io.stationtxt - -
obspy.io.stationxml - -
obspy.io.wav - -
obspy.io.xseed - -
obspy.io.y - -
obspy.io.zmap - -
obspy.realtime - -
obspy.signal 14 68 69 70 71 72 73 74 75 76 77 78 79 80 81
obspy.taup 9 82 83 84 85 86 87 88 89 90
Summary 90 90

Tracebacks (90)

Traceback (most recent call last):
File "/usr/lib/python3.5/doctest.py", line 2190, in runTest
raise self.failureException(self.format_failure(new.getvalue()))
AssertionError: Failed doctest test for obspy.clients.fdsn.client.Client.get_stations_bulk
File "/usr/lib/python3/dist-packages/obspy/clients/fdsn/client.py", line 905, in get_stations_bulk
----------------------------------------------------------------------
File "/usr/lib/python3/dist-packages/obspy/clients/fdsn/client.py", line 937, in obspy.clients.fdsn.client.Client.get_stations_bulk
Failed example:
print(inv) # doctest: +ELLIPSIS +NORMALIZE_WHITESPACE
Expected:
Inventory created at ...
Created by: IRIS WEB SERVICE: fdsnws-station | version: ...
http://service.iris.edu/fdsnws/station/1/query?
Sending institution: IRIS-DMC (IRIS-DMC)
Contains:
Networks (2):
GR, IU
Stations (2):
GR.GRA1 (GRAFENBERG ARRAY, BAYERN)
IU.ANMO (Albuquerque, New Mexico, USA)
Channels (0):
Got:
Inventory created at 2018-05-06T14:12:34.000000Z
	Created by: IRIS WEB SERVICE: fdsnws-station | version: 1.1.32
		 http://service.iris.edu/fdsnws/station/1/query
	Sending institution: IRIS-DMC (IRIS-DMC)
	Contains:
		Networks (2):
			GR, IU
		Stations (2):
			GR.GRA1 (GRAFENBERG ARRAY, BAYERN)
			IU.ANMO (Albuquerque, New Mexico, USA)
		Channels (0):
<BLANKLINE>
----------------------------------------------------------------------
File "/usr/lib/python3/dist-packages/obspy/clients/fdsn/client.py", line 967, in obspy.clients.fdsn.client.Client.get_stations_bulk
Failed example:
print(inv) # doctest: +ELLIPSIS +NORMALIZE_WHITESPACE
Expected:
Inventory created at ...
Created by: IRIS WEB SERVICE: fdsnws-station | version: ...
http://service.iris.edu/fdsnws/station/1/query?
Sending institution: IRIS-DMC (IRIS-DMC)
Contains:
Networks (2):
GR, IU
Stations (2):
GR.GRA1 (GRAFENBERG ARRAY, BAYERN)
IU.ANMO (Albuquerque, New Mexico, USA)
Channels (5):
GR.GRA1..BHZ, GR.GRA1..BHN, GR.GRA1..BHE, IU.ANMO.00.BHZ,
IU.ANMO.10.BHZ
Got:
Inventory created at 2018-05-06T14:12:35.000000Z
	Created by: IRIS WEB SERVICE: fdsnws-station | version: 1.1.32
		 http://service.iris.edu/fdsnws/station/1/query
	Sending institution: IRIS-DMC (IRIS-DMC)
	Contains:
		Networks (2):
			GR, IU
		Stations (2):
			GR.GRA1 (GRAFENBERG ARRAY, BAYERN)
			IU.ANMO (Albuquerque, New Mexico, USA)
		Channels (5):
			GR.GRA1..BHZ, GR.GRA1..BHN, GR.GRA1..BHE, IU.ANMO.00.BHZ,
			IU.ANMO.10.BHZ
Traceback (most recent call last):
File "/usr/lib/python3/dist-packages/obspy/io/mseed/util.py", line 664, in _get_record_information
values = unpack(fmt(endian), data)
TypeError: a bytes-like object is required, not 'MagicMock'
During handling of the above exception, another exception occurred:
Traceback (most recent call last):
File "/usr/lib/python3/dist-packages/obspy/core/stream.py", line 210, in read
stream = _read(pathname_or_url, format, headonly, **kwargs)
TypeError: a bytes-like object is required, not 'MagicMock'
During handling of the above exception, another exception occurred:
Traceback (most recent call last):
File "/usr/lib/python3/dist-packages/obspy/clients/fdsn/tests/test_client.py", line 1170, in test_get_waveforms_empty_seed_codes
self.client.get_waveforms(**kwargs_)
TypeError: a bytes-like object is required, not 'MagicMock'
During handling of the above exception, another exception occurred:
Traceback (most recent call last):
File "/usr/lib/python3/dist-packages/obspy/clients/fdsn/tests/test_client.py", line 1176, in test_get_waveforms_empty_seed_codes
str(e))
AssertionError: 'unpack requires a string argument of length 28' != "a bytes-like object is required, not 'MagicMock'"
- unpack requires a string argument of length 28
+ a bytes-like object is required, not 'MagicMock'
Traceback (most recent call last):
File "/usr/lib/python3/dist-packages/obspy/clients/iris/client.py", line 337, in timeseries
data = self._fetch("timeseries", param_list=filter, **kwargs)
File "/usr/lib/python3/dist-packages/obspy/clients/iris/client.py", line 130, in _fetch
response = urllib.request.urlopen(req, timeout=self.timeout)
File "/usr/lib/python3.5/urllib/request.py", line 163, in urlopen
return opener.open(url, data, timeout)
File "/usr/lib/python3.5/urllib/request.py", line 472, in open
response = meth(req, response)
File "/usr/lib/python3.5/urllib/request.py", line 582, in http_response
'http', request, response, code, msg, hdrs)
File "/usr/lib/python3.5/urllib/request.py", line 510, in error
return self._call_chain(*args)
File "/usr/lib/python3.5/urllib/request.py", line 444, in _call_chain
result = func(*args)
File "/usr/lib/python3.5/urllib/request.py", line 590, in http_error_default
raise HTTPError(req.full_url, code, msg, hdrs, fp)
urllib.error.HTTPError: HTTP Error 400: Bad Request
During handling of the above exception, another exception occurred:
Traceback (most recent call last):
File "/usr/lib/python3/dist-packages/obspy/clients/iris/tests/test_client.py", line 256, in test_timeseries
filter=["correct"])
File "/usr/lib/python3/dist-packages/obspy/clients/iris/client.py", line 341, in timeseries
raise Exception(msg)
Exception: No waveform data available (HTTPError: HTTP Error 400: Bad Request)
Traceback (most recent call last):
File "/usr/lib/python3.5/doctest.py", line 2190, in runTest
raise self.failureException(self.format_failure(new.getvalue()))
AssertionError: Failed doctest test for obspy.clients.iris.client.Client.timeseries
File "/usr/lib/python3/dist-packages/obspy/clients/iris/client.py", line 174, in timeseries
----------------------------------------------------------------------
File "/usr/lib/python3/dist-packages/obspy/clients/iris/client.py", line 315, in obspy.clients.iris.client.Client.timeseries
Failed example:
st = client.timeseries("IU", "ANMO", "00", "BHZ", dt, dt+10,
filter=["correct", "demean", "lp=2.0"])
Exception raised:
Traceback (most recent call last):
File "/usr/lib/python3/dist-packages/obspy/clients/iris/client.py", line 337, in timeseries
data = self._fetch("timeseries", param_list=filter, **kwargs)
File "/usr/lib/python3/dist-packages/obspy/clients/iris/client.py", line 130, in _fetch
response = urllib.request.urlopen(req, timeout=self.timeout)
File "/usr/lib/python3.5/urllib/request.py", line 163, in urlopen
return opener.open(url, data, timeout)
File "/usr/lib/python3.5/urllib/request.py", line 472, in open
response = meth(req, response)
File "/usr/lib/python3.5/urllib/request.py", line 582, in http_response
'http', request, response, code, msg, hdrs)
File "/usr/lib/python3.5/urllib/request.py", line 510, in error
return self._call_chain(*args)
File "/usr/lib/python3.5/urllib/request.py", line 444, in _call_chain
result = func(*args)
File "/usr/lib/python3.5/urllib/request.py", line 590, in http_error_default
raise HTTPError(req.full_url, code, msg, hdrs, fp)
urllib.error.HTTPError: HTTP Error 400: Bad Request
During handling of the above exception, another exception occurred:
Traceback (most recent call last):
File "/usr/lib/python3.5/doctest.py", line 1321, in __run
compileflags, 1), test.globs)
File "<doctest obspy.clients.iris.client.Client.timeseries[6]>", line 2, in <module>
filter=["correct", "demean", "lp=2.0"])
File "/usr/lib/python3/dist-packages/obspy/clients/iris/client.py", line 341, in timeseries
raise Exception(msg)
Exception: No waveform data available (HTTPError: HTTP Error 400: Bad Request)
----------------------------------------------------------------------
File "/usr/lib/python3/dist-packages/obspy/clients/iris/client.py", line 317, in obspy.clients.iris.client.Client.timeseries
Failed example:
print(st[0].data) # doctest: +ELLIPSIS
Expected:
[ -1.57488682e-06 -1.26318002e-06 -7.84807128e-07 ...
Got:
[ 24 20 19 19 19 15 10 4 -4 -11 -19 -26 -35 -48 -60
-72 -83 -95 -109 -121 -133 -147 -162 -179 -195 -208 -221 -238 -256 -272
-285 -301 -314 -324 -333 -341 -350 -358 -365 -370 -376 -378 -378 -380 -381
-381 -378 -376 -374 -370 -364 -359 -356 -352 -345 -337 -331 -328 -323 -316
-310 -305 -301 -295 -290 -289 -283 -275 -271 -269 -267 -263 -258 -257 -253
-248 -243 -240 -239 -237 -233 -229 -224 -218 -211 -208 -205 -202 -200 -195
-191 -185 -181 -180 -179 -177 -177 -177 -176 -176 -179 -183 -185 -187 -189
-192 -198 -204 -210 -216 -220 -227 -235 -241 -247 -253 -262 -270 -277 -284
-294 -304 -313 -323 -332 -340 -345 -350 -355 -358 -361 -364 -369 -372 -371
-372 -374 -373 -368 -364 -362 -357 -349 -344 -338 -331 -320 -311 -302 -291
-280 -268 -255 -243 -231 -218 -203 -187 -173 -160 -147 -132 -119 -108 -97
-86 -73 -62 -54 -48 -42 -37 -33 -29 -27 -27 -25 -26 -27 -29
-31 -30 -31 -36 -40 -44 -52 -59 -68 -77 -83 -89 -95 -101 -108
-116 -123 -130 -141 -150]
Traceback (most recent call last):
File "/usr/lib/python3/dist-packages/obspy/clients/seedlink/tests/test_slpacket.py", line 36, in test_get_string_payload
payload = packet.get_string_payload()
File "/usr/lib/python3/dist-packages/obspy/clients/seedlink/slpacket.py", line 178, in get_string_payload
msr, msrecord_py = self.get_ms_record()
File "/usr/lib/python3/dist-packages/obspy/clients/seedlink/slpacket.py", line 119, in get_ms_record
len(pyobj), C.pointer(msr), -1, 1, 1)
ctypes.ArgumentError: argument 1: <class 'TypeError'>: argument must be an ndarray
Traceback (most recent call last):
File "/usr/lib/python3/dist-packages/obspy/clients/seedlink/tests/test_basic_client.py", line 24, in test_get_waveform
self.assertGreater(len(st), 0)
AssertionError: 0 not greater than 0
Traceback (most recent call last):
File "/usr/lib/python3.5/doctest.py", line 2190, in runTest
raise self.failureException(self.format_failure(new.getvalue()))
AssertionError: Failed doctest test for obspy.clients.seedlink.basic_client.Client.get_waveforms
File "/usr/lib/python3/dist-packages/obspy/clients/seedlink/basic_client.py", line 62, in get_waveforms
----------------------------------------------------------------------
File "/usr/lib/python3/dist-packages/obspy/clients/seedlink/basic_client.py", line 70, in obspy.clients.seedlink.basic_client.Client.get_waveforms
Failed example:
print(st) # doctest: +ELLIPSIS
Expected:
1 Trace(s) in Stream:
G.FDF.00.BHZ | 20... | 20.0 Hz, ... samples
Got:
0 Trace(s) in Stream:
<BLANKLINE>
----------------------------------------------------------------------
File "/usr/lib/python3/dist-packages/obspy/clients/seedlink/basic_client.py", line 79, in obspy.clients.seedlink.basic_client.Client.get_waveforms
Failed example:
print(st) # doctest: +ELLIPSIS
Expected:
3 Trace(s) in Stream:
G.FDF.00.BHZ | 20... | 20.0 Hz, ... samples
G.FDF.00.BHN | 20... | 20.0 Hz, ... samples
G.FDF.00.BHE | 20... | 20.0 Hz, ... samples
Got:
0 Trace(s) in Stream:
<BLANKLINE>
Traceback (most recent call last):
File "/usr/lib/python3/dist-packages/obspy/core/tests/test_channel.py", line 63, in test_response_plot
cha.plot(0.005, outfile=ic.name)
File "/usr/lib/python3/dist-packages/obspy/core/util/testing.py", line 403, in __exit__
msg = self.compare()
File "/usr/lib/python3/dist-packages/obspy/core/util/testing.py", line 501, in compare
return compare_images(self.baseline_image, self.name, tol=self.tol)
File "/usr/lib/python3/dist-packages/obspy/core/util/testing.py", line 220, in compare_images
str(expected_image.shape)))
obspy.core.util.testing.ImageComparisonException: The shape of the received image (345, 460, 4) is not equal to the expected shape (432, 576, 4).
Traceback (most recent call last):
File "/usr/lib/python3/dist-packages/obspy/core/tests/test_inventory.py", line 488, in test_combined_station_event_plot
cat.plot(outfile=ic.name, fig=fig)
File "/usr/lib/python3/dist-packages/obspy/core/util/testing.py", line 403, in __exit__
msg = self.compare()
File "/usr/lib/python3/dist-packages/obspy/core/util/testing.py", line 501, in compare
return compare_images(self.baseline_image, self.name, tol=self.tol)
File "/usr/lib/python3/dist-packages/obspy/core/util/testing.py", line 220, in compare_images
str(expected_image.shape)))
obspy.core.util.testing.ImageComparisonException: The shape of the received image (345, 460, 4) is not equal to the expected shape (432, 576, 4).
Traceback (most recent call last):
File "/usr/lib/python3/dist-packages/obspy/core/tests/test_event.py", line 537, in test_catalog_plot_ortho_longitude_wrap
water_fill_color='b')
File "/usr/lib/python3/dist-packages/obspy/core/util/testing.py", line 403, in __exit__
msg = self.compare()
File "/usr/lib/python3/dist-packages/obspy/core/util/testing.py", line 501, in compare
return compare_images(self.baseline_image, self.name, tol=self.tol)
File "/usr/lib/python3/dist-packages/obspy/core/util/testing.py", line 220, in compare_images
str(expected_image.shape)))
obspy.core.util.testing.ImageComparisonException: The shape of the received image (192, 256, 4) is not equal to the expected shape (240, 320, 4).
Traceback (most recent call last):
File "/usr/lib/python3/dist-packages/obspy/core/tests/test_trace.py", line 2235, in test_remove_response_plot
water_level=60, end_stage=None, plot=ic.name)
File "/usr/lib/python3/dist-packages/obspy/core/util/testing.py", line 470, in __exit__
raise ImageComparisonException(msg)
obspy.core.util.testing.ImageComparisonException: Image comparison failed.
	File: trace_remove_response.png
	RMS: 54.27435237489514
	Tolerance: 4.5
	Expected: /usr/lib/python3/dist-packages/obspy/core/tests/images/trace_remove_response.png
	Actual: /usr/lib/python3/dist-packages/obspy/core/tests/images/testrun/trace_remove_response.png
	Diff: /usr/lib/python3/dist-packages/obspy/core/tests/images/testrun/trace_remove_response-failed-diff.png
	Expected: https://i.imgur.com/pV8iA9G.png
	Actual: https://i.imgur.com/aaGkCsN.png
	Diff: https://i.imgur.com/gYHi0XB.png
Traceback (most recent call last):
File "/usr/lib/python3/dist-packages/obspy/core/tests/test_station.py", line 58, in test_response_plot
sta.plot(0.05, channel="*[NE]", outfile=ic.name)
File "/usr/lib/python3/dist-packages/obspy/core/util/testing.py", line 403, in __exit__
msg = self.compare()
File "/usr/lib/python3/dist-packages/obspy/core/util/testing.py", line 501, in compare
return compare_images(self.baseline_image, self.name, tol=self.tol)
File "/usr/lib/python3/dist-packages/obspy/core/util/testing.py", line 220, in compare_images
str(expected_image.shape)))
obspy.core.util.testing.ImageComparisonException: The shape of the received image (345, 460, 4) is not equal to the expected shape (432, 576, 4).
Traceback (most recent call last):
File "/usr/lib/python3/dist-packages/obspy/core/tests/test_network.py", line 313, in test_location_plot_local
size=13**2, outfile=ic.name)
File "/usr/lib/python3/dist-packages/obspy/core/util/testing.py", line 403, in __exit__
msg = self.compare()
File "/usr/lib/python3/dist-packages/obspy/core/util/testing.py", line 501, in compare
return compare_images(self.baseline_image, self.name, tol=self.tol)
File "/usr/lib/python3/dist-packages/obspy/core/util/testing.py", line 220, in compare_images
str(expected_image.shape)))
obspy.core.util.testing.ImageComparisonException: The shape of the received image (345, 460, 4) is not equal to the expected shape (432, 576, 4).
Traceback (most recent call last):
File "/usr/lib/python3/dist-packages/obspy/core/tests/test_code_formatting.py", line 165, in test_no_pyplot_import_in_any_file
self.assertEqual(len(failures), 0, "\n" + "\n\n".join(failures))
AssertionError: 1 != 0 :
File '/usr/lib/python3/dist-packages/obspy/signal/array_analysis/seismic_array.py' (line 26)
matches a forbidden matplotlib import statement outside of class/def statements
(breaking matplotlib backend switching on some systems):
'import matplotlib.pyplot as plt'
Traceback (most recent call last):
File "/usr/lib/python3/dist-packages/obspy/core/tests/test_inventory.py", line 165, in test_response_plot
station="[WR]*", time=t, outfile=ic.name)
File "/usr/lib/python3/dist-packages/obspy/core/util/testing.py", line 403, in __exit__
msg = self.compare()
File "/usr/lib/python3/dist-packages/obspy/core/util/testing.py", line 501, in compare
return compare_images(self.baseline_image, self.name, tol=self.tol)
File "/usr/lib/python3/dist-packages/obspy/core/util/testing.py", line 220, in compare_images
str(expected_image.shape)))
obspy.core.util.testing.ImageComparisonException: The shape of the received image (345, 460, 4) is not equal to the expected shape (432, 576, 4).
Traceback (most recent call last):
File "/usr/lib/python3/dist-packages/obspy/core/tests/test_network.py", line 149, in test_response_plot
time=t, outfile=ic.name)
File "/usr/lib/python3/dist-packages/obspy/core/util/testing.py", line 403, in __exit__
msg = self.compare()
File "/usr/lib/python3/dist-packages/obspy/core/util/testing.py", line 501, in compare
return compare_images(self.baseline_image, self.name, tol=self.tol)
File "/usr/lib/python3/dist-packages/obspy/core/util/testing.py", line 220, in compare_images
str(expected_image.shape)))
obspy.core.util.testing.ImageComparisonException: The shape of the received image (345, 460, 4) is not equal to the expected shape (432, 576, 4).
Traceback (most recent call last):
File "/usr/lib/python3/dist-packages/obspy/core/tests/test_event.py", line 523, in test_catalog_plot_ortho
color='date')
File "/usr/lib/python3/dist-packages/obspy/core/util/testing.py", line 403, in __exit__
msg = self.compare()
File "/usr/lib/python3/dist-packages/obspy/core/util/testing.py", line 501, in compare
return compare_images(self.baseline_image, self.name, tol=self.tol)
File "/usr/lib/python3/dist-packages/obspy/core/util/testing.py", line 220, in compare_images
str(expected_image.shape)))
obspy.core.util.testing.ImageComparisonException: The shape of the received image (345, 460, 4) is not equal to the expected shape (432, 576, 4).
Traceback (most recent call last):
File "/usr/lib/python3/dist-packages/obspy/core/tests/test_response.py", line 148, in test_response_plot
outfile=ic.name)
File "/usr/lib/python3/dist-packages/obspy/core/util/testing.py", line 403, in __exit__
msg = self.compare()
File "/usr/lib/python3/dist-packages/obspy/core/util/testing.py", line 501, in compare
return compare_images(self.baseline_image, self.name, tol=self.tol)
File "/usr/lib/python3/dist-packages/obspy/core/util/testing.py", line 220, in compare_images
str(expected_image.shape)))
obspy.core.util.testing.ImageComparisonException: The shape of the received image (345, 460, 4) is not equal to the expected shape (432, 576, 4).
Traceback (most recent call last):
File "/usr/lib/python3/dist-packages/obspy/core/tests/test_inventory.py", line 449, in test_location_plot_ortho
colormap='Set3', color_per_network=True, outfile=ic.name)
File "/usr/lib/python3/dist-packages/obspy/core/util/testing.py", line 403, in __exit__
msg = self.compare()
File "/usr/lib/python3/dist-packages/obspy/core/util/testing.py", line 501, in compare
return compare_images(self.baseline_image, self.name, tol=self.tol)
File "/usr/lib/python3/dist-packages/obspy/core/util/testing.py", line 220, in compare_images
str(expected_image.shape)))
obspy.core.util.testing.ImageComparisonException: The shape of the received image (345, 460, 4) is not equal to the expected shape (432, 576, 4).
Traceback (most recent call last):
File "/usr/lib/python3/dist-packages/obspy/core/tests/test_network.py", line 281, in test_location_plot_global
net.plot(method='basemap', outfile=ic.name)
File "/usr/lib/python3/dist-packages/obspy/core/util/testing.py", line 403, in __exit__
msg = self.compare()
File "/usr/lib/python3/dist-packages/obspy/core/util/testing.py", line 501, in compare
return compare_images(self.baseline_image, self.name, tol=self.tol)
File "/usr/lib/python3/dist-packages/obspy/core/util/testing.py", line 220, in compare_images
str(expected_image.shape)))
obspy.core.util.testing.ImageComparisonException: The shape of the received image (345, 460, 4) is not equal to the expected shape (432, 576, 4).
Traceback (most recent call last):
File "/usr/lib/python3/dist-packages/obspy/core/tests/test_event.py", line 155, in test_plot_farfield_without_quiver_with_maps
['p_sphere', 's_sphere']], outfile=ic.name)
File "/usr/lib/python3/dist-packages/obspy/core/util/testing.py", line 470, in __exit__
raise ImageComparisonException(msg)
obspy.core.util.testing.ImageComparisonException: Image comparison failed.
	File: event.png
	RMS: 52.09730895161477
	Tolerance: 3.0
	Expected: /usr/lib/python3/dist-packages/obspy/core/tests/images/event.png
	Actual: /usr/lib/python3/dist-packages/obspy/core/tests/images/testrun/event.png
	Diff: /usr/lib/python3/dist-packages/obspy/core/tests/images/testrun/event-failed-diff.png
	Expected: https://i.imgur.com/woUN0Yh.png
	Actual: https://i.imgur.com/UjjbNCF.png
	Diff: https://i.imgur.com/rTbLWhD.png
Traceback (most recent call last):
File "/usr/lib/python3/dist-packages/obspy/core/tests/test_inventory.py", line 436, in test_location_plot_global
inv.plot(outfile=ic.name)
File "/usr/lib/python3/dist-packages/obspy/core/util/testing.py", line 403, in __exit__
msg = self.compare()
File "/usr/lib/python3/dist-packages/obspy/core/util/testing.py", line 501, in compare
return compare_images(self.baseline_image, self.name, tol=self.tol)
File "/usr/lib/python3/dist-packages/obspy/core/util/testing.py", line 220, in compare_images
str(expected_image.shape)))
obspy.core.util.testing.ImageComparisonException: The shape of the received image (345, 460, 4) is not equal to the expected shape (432, 576, 4).
Traceback (most recent call last):
File "/usr/lib/python3/dist-packages/obspy/core/tests/test_event.py", line 555, in test_catalog_plot_local
color='date', colormap='gist_heat')
File "/usr/lib/python3/dist-packages/obspy/core/util/testing.py", line 403, in __exit__
msg = self.compare()
File "/usr/lib/python3/dist-packages/obspy/core/util/testing.py", line 501, in compare
return compare_images(self.baseline_image, self.name, tol=self.tol)
File "/usr/lib/python3/dist-packages/obspy/core/util/testing.py", line 220, in compare_images
str(expected_image.shape)))
obspy.core.util.testing.ImageComparisonException: The shape of the received image (345, 460, 4) is not equal to the expected shape (432, 576, 4).
Traceback (most recent call last):
File "/usr/lib/python3/dist-packages/obspy/core/tests/test_inventory.py", line 469, in test_location_plot_local
outfile=ic.name)
File "/usr/lib/python3/dist-packages/obspy/core/util/testing.py", line 403, in __exit__
msg = self.compare()
File "/usr/lib/python3/dist-packages/obspy/core/util/testing.py", line 501, in compare
return compare_images(self.baseline_image, self.name, tol=self.tol)
File "/usr/lib/python3/dist-packages/obspy/core/util/testing.py", line 220, in compare_images
str(expected_image.shape)))
obspy.core.util.testing.ImageComparisonException: The shape of the received image (345, 460, 4) is not equal to the expected shape (432, 576, 4).
Traceback (most recent call last):
File "/usr/lib/python3/dist-packages/obspy/core/tests/test_event.py", line 511, in test_catalog_plot_global
cat.plot(method='basemap', outfile=ic.name)
File "/usr/lib/python3/dist-packages/obspy/core/util/testing.py", line 403, in __exit__
msg = self.compare()
File "/usr/lib/python3/dist-packages/obspy/core/util/testing.py", line 501, in compare
return compare_images(self.baseline_image, self.name, tol=self.tol)
File "/usr/lib/python3/dist-packages/obspy/core/util/testing.py", line 220, in compare_images
str(expected_image.shape)))
obspy.core.util.testing.ImageComparisonException: The shape of the received image (345, 460, 4) is not equal to the expected shape (432, 576, 4).
Traceback (most recent call last):
File "/usr/lib/python3/dist-packages/obspy/core/tests/test_network.py", line 294, in test_location_plot_ortho
color='yellow', label=False, outfile=ic.name)
File "/usr/lib/python3/dist-packages/obspy/core/util/testing.py", line 403, in __exit__
msg = self.compare()
File "/usr/lib/python3/dist-packages/obspy/core/util/testing.py", line 501, in compare
return compare_images(self.baseline_image, self.name, tol=self.tol)
File "/usr/lib/python3/dist-packages/obspy/core/util/testing.py", line 220, in compare_images
str(expected_image.shape)))
obspy.core.util.testing.ImageComparisonException: The shape of the received image (345, 460, 4) is not equal to the expected shape (432, 576, 4).
Traceback (most recent call last):
File "/usr/lib/python3/dist-packages/obspy/imaging/tests/test_scan.py", line 70, in test_scan_function_and_scanner_class
scan(paths=os.curdir, plot=ic.name)
File "/usr/lib/python3/dist-packages/obspy/core/util/testing.py", line 403, in __exit__
msg = self.compare()
File "/usr/lib/python3/dist-packages/obspy/core/util/testing.py", line 501, in compare
return compare_images(self.baseline_image, self.name, tol=self.tol)
File "/usr/lib/python3/dist-packages/obspy/core/util/testing.py", line 220, in compare_images
str(expected_image.shape)))
obspy.core.util.testing.ImageComparisonException: The shape of the received image (468, 1872, 4) is not equal to the expected shape (650, 2600, 4).
Traceback (most recent call last):
File "/usr/lib/python3/dist-packages/obspy/imaging/tests/test_scan.py", line 171, in test_multiple_sampling_rates
expected_stdout_lines, out.stdout.decode().splitlines())
File "/usr/lib/python3/dist-packages/obspy/core/util/testing.py", line 403, in __exit__
msg = self.compare()
File "/usr/lib/python3/dist-packages/obspy/core/util/testing.py", line 501, in compare
return compare_images(self.baseline_image, self.name, tol=self.tol)
File "/usr/lib/python3/dist-packages/obspy/core/util/testing.py", line 220, in compare_images
str(expected_image.shape)))
obspy.core.util.testing.ImageComparisonException: The shape of the received image (288, 432, 4) is not equal to the expected shape (400, 600, 4).
Traceback (most recent call last):
File "/usr/lib/python3/dist-packages/obspy/imaging/tests/test_waveform.py", line 300, in test_plot_azim_section
ev_coord=(0.0, 0.0))
File "/usr/lib/python3/dist-packages/obspy/core/util/testing.py", line 470, in __exit__
raise ImageComparisonException(msg)
obspy.core.util.testing.ImageComparisonException: Image comparison failed.
	File: waveform_azim_section.png
	RMS: 24.909660776493926
	Tolerance: 3.0
	Expected: /usr/lib/python3/dist-packages/obspy/imaging/tests/images/waveform_azim_section.png
	Actual: /usr/lib/python3/dist-packages/obspy/imaging/tests/images/testrun/waveform_azim_section.png
	Diff: /usr/lib/python3/dist-packages/obspy/imaging/tests/images/testrun/waveform_azim_section-failed-diff.png
	Expected: https://i.imgur.com/5NI5P2y.png
	Actual: https://i.imgur.com/yXLotMe.png
	Diff: https://i.imgur.com/3frGerB.png
Traceback (most recent call last):
File "/usr/lib/python3/dist-packages/obspy/imaging/tests/test_waveform.py", line 186, in test_plot_complex_gap_many_samples
st.plot(outfile=ic.name)
File "/usr/lib/python3/dist-packages/obspy/core/util/testing.py", line 470, in __exit__
raise ImageComparisonException(msg)
obspy.core.util.testing.ImageComparisonException: Image comparison failed.
	File: waveform_complex_gap_many_samples.png
	RMS: 38.64480922452587
	Tolerance: 3.0
	Expected: /usr/lib/python3/dist-packages/obspy/imaging/tests/images/waveform_complex_gap_many_samples.png
	Actual: /usr/lib/python3/dist-packages/obspy/imaging/tests/images/testrun/waveform_complex_gap_many_samples.png
	Diff: /usr/lib/python3/dist-packages/obspy/imaging/tests/images/testrun/waveform_complex_gap_many_samples-failed-diff.png
	Expected: https://i.imgur.com/TDS2Akb.png
	Actual: https://i.imgur.com/uYpyBn0.png
	Diff: https://i.imgur.com/aQIHLv3.png
Traceback (most recent call last):
File "/usr/lib/python3/dist-packages/obspy/imaging/tests/test_waveform.py", line 328, in test_plot_ref_time_section
st.plot(outfile=ic.name, type='section', reftime=reftime)
File "/usr/lib/python3/dist-packages/obspy/core/util/testing.py", line 470, in __exit__
raise ImageComparisonException(msg)
obspy.core.util.testing.ImageComparisonException: Image comparison failed.
	File: waveform_reftime_section.png
	RMS: 24.78861781813043
	Tolerance: 3.0
	Expected: /usr/lib/python3/dist-packages/obspy/imaging/tests/images/waveform_reftime_section.png
	Actual: /usr/lib/python3/dist-packages/obspy/imaging/tests/images/testrun/waveform_reftime_section.png
	Diff: /usr/lib/python3/dist-packages/obspy/imaging/tests/images/testrun/waveform_reftime_section-failed-diff.png
Upload to imgur failed (caught HTTPError: 400 Client Error: Bad Request for url: https://api.imgur.com/3/image).
Traceback (most recent call last):
File "/usr/lib/python3/dist-packages/obspy/imaging/tests/test_waveform.py", line 135, in test_plot_one_hour_few_samples
st.plot(outfile=ic.name)
File "/usr/lib/python3/dist-packages/obspy/core/util/testing.py", line 470, in __exit__
raise ImageComparisonException(msg)
obspy.core.util.testing.ImageComparisonException: Image comparison failed.
	File: waveform_one_hour_few_samples.png
	RMS: 48.38503404979684
	Tolerance: 3.0
	Expected: /usr/lib/python3/dist-packages/obspy/imaging/tests/images/waveform_one_hour_few_samples.png
	Actual: /usr/lib/python3/dist-packages/obspy/imaging/tests/images/testrun/waveform_one_hour_few_samples.png
	Diff: /usr/lib/python3/dist-packages/obspy/imaging/tests/images/testrun/waveform_one_hour_few_samples-failed-diff.png
Upload to imgur failed (caught HTTPError: 400 Client Error: Bad Request for url: https://api.imgur.com/3/image).
Traceback (most recent call last):
File "/usr/lib/python3/dist-packages/obspy/imaging/tests/test_beachball.py", line 326, in test_mopad_fallback
beachball(mt, outfile=ic.name)
File "/usr/lib/python3/dist-packages/obspy/core/util/testing.py", line 470, in __exit__
raise ImageComparisonException(msg)
obspy.core.util.testing.ImageComparisonException: Image comparison failed.
	File: mopad_fallback.png
	RMS: 71.48701700308945
	Tolerance: 3.0
	Expected: /usr/lib/python3/dist-packages/obspy/imaging/tests/images/mopad_fallback.png
	Actual: /usr/lib/python3/dist-packages/obspy/imaging/tests/images/testrun/mopad_fallback.png
	Diff: /usr/lib/python3/dist-packages/obspy/imaging/tests/images/testrun/mopad_fallback-failed-diff.png
Upload to imgur failed (caught HTTPError: 400 Client Error: Bad Request for url: https://api.imgur.com/3/image).
Traceback (most recent call last):
File "/usr/lib/python3/dist-packages/obspy/imaging/tests/test_waveform.py", line 343, in test_plot_colored_section
st.plot(outfile=ic.name, type='section', color='channel')
File "/usr/lib/python3/dist-packages/obspy/core/util/testing.py", line 470, in __exit__
raise ImageComparisonException(msg)
obspy.core.util.testing.ImageComparisonException: Image comparison failed.
	File: waveform_color_section.png
	RMS: 21.796032666519842
	Tolerance: 3.0
	Expected: /usr/lib/python3/dist-packages/obspy/imaging/tests/images/waveform_color_section.png
	Actual: /usr/lib/python3/dist-packages/obspy/imaging/tests/images/testrun/waveform_color_section.png
	Diff: /usr/lib/python3/dist-packages/obspy/imaging/tests/images/testrun/waveform_color_section-failed-diff.png
	Expected: https://i.imgur.com/RFIWpWq.png
	Actual: https://i.imgur.com/mVYzfd3.png
	Diff: https://i.imgur.com/XXJiipg.png
Traceback (most recent call last):
File "/usr/lib/python3/dist-packages/obspy/imaging/tests/test_waveform.py", line 413, in test_plot_wiggles_vertical_section
fillcolors=("blue", "red"))
File "/usr/lib/python3/dist-packages/obspy/core/util/testing.py", line 470, in __exit__
raise ImageComparisonException(msg)
obspy.core.util.testing.ImageComparisonException: Image comparison failed.
	File: waveform_wiggles_vertical_section.png
	RMS: 95.49285599806232
	Tolerance: 3.0
	Expected: /usr/lib/python3/dist-packages/obspy/imaging/tests/images/waveform_wiggles_vertical_section.png
	Actual: /usr/lib/python3/dist-packages/obspy/imaging/tests/images/testrun/waveform_wiggles_vertical_section.png
	Diff: /usr/lib/python3/dist-packages/obspy/imaging/tests/images/testrun/waveform_wiggles_vertical_section-failed-diff.png
Upload to imgur failed (caught HTTPError: 400 Client Error: Bad Request for url: https://api.imgur.com/3/image).
Traceback (most recent call last):
File "/usr/lib/python3/dist-packages/obspy/imaging/tests/test_waveform.py", line 486, in test_plot_day_plot_catalog
events=cat)
File "/usr/lib/python3/dist-packages/obspy/core/util/testing.py", line 470, in __exit__
raise ImageComparisonException(msg)
obspy.core.util.testing.ImageComparisonException: Image comparison failed.
	File: waveform_dayplot_catalog.png
	RMS: 25.113287319664067
	Tolerance: 3.0
	Expected: /usr/lib/python3/dist-packages/obspy/imaging/tests/images/waveform_dayplot_catalog.png
	Actual: /usr/lib/python3/dist-packages/obspy/imaging/tests/images/testrun/waveform_dayplot_catalog.png
	Diff: /usr/lib/python3/dist-packages/obspy/imaging/tests/images/testrun/waveform_dayplot_catalog-failed-diff.png
	Expected: https://i.imgur.com/PMwe0SY.png
	Actual: https://i.imgur.com/B2sXwie.png
	Diff: https://i.imgur.com/ib9Mtjc.png
Traceback (most recent call last):
File "/usr/lib/python3/dist-packages/obspy/imaging/tests/test_waveform.py", line 207, in test_plot_complex_gap_few_samples
st.plot(outfile=ic.name)
File "/usr/lib/python3/dist-packages/obspy/core/util/testing.py", line 470, in __exit__
raise ImageComparisonException(msg)
obspy.core.util.testing.ImageComparisonException: Image comparison failed.
	File: waveform_complex_gap_few_samples.png
	RMS: 39.20731564389483
	Tolerance: 3.0
	Expected: /usr/lib/python3/dist-packages/obspy/imaging/tests/images/waveform_complex_gap_few_samples.png
	Actual: /usr/lib/python3/dist-packages/obspy/imaging/tests/images/testrun/waveform_complex_gap_few_samples.png
	Diff: /usr/lib/python3/dist-packages/obspy/imaging/tests/images/testrun/waveform_complex_gap_few_samples-failed-diff.png
	Expected: https://i.imgur.com/LD6AUGK.png
	Actual: https://i.imgur.com/HH03CCJ.png
	Diff: https://i.imgur.com/bdfAiKJ.png
Traceback (most recent call last):
File "/usr/lib/python3/dist-packages/obspy/imaging/tests/test_beachball.py", line 305, in test_collection_aspect_x
filename_width_height='bb_aspect_x_height.png')
File "/usr/lib/python3/dist-packages/obspy/imaging/tests/test_beachball.py", line 280, in collection_aspect
fig.savefig(ic.name)
File "/usr/lib/python3/dist-packages/obspy/core/util/testing.py", line 403, in __exit__
msg = self.compare()
File "/usr/lib/python3/dist-packages/obspy/core/util/testing.py", line 501, in compare
return compare_images(self.baseline_image, self.name, tol=self.tol)
File "/usr/lib/python3/dist-packages/obspy/core/util/testing.py", line 220, in compare_images
str(expected_image.shape)))
obspy.core.util.testing.ImageComparisonException: The shape of the received image (480, 640, 4) is not equal to the expected shape (600, 800, 4).
Traceback (most recent call last):
File "/usr/lib/python3/dist-packages/obspy/imaging/tests/test_waveform.py", line 165, in test_plot_simple_gap_few_samples
st.plot(outfile=ic.name)
File "/usr/lib/python3/dist-packages/obspy/core/util/testing.py", line 470, in __exit__
raise ImageComparisonException(msg)
obspy.core.util.testing.ImageComparisonException: Image comparison failed.
	File: waveform_simple_gap_few_samples.png
	RMS: 37.58925591176287
	Tolerance: 3.0
	Expected: /usr/lib/python3/dist-packages/obspy/imaging/tests/images/waveform_simple_gap_few_samples.png
	Actual: /usr/lib/python3/dist-packages/obspy/imaging/tests/images/testrun/waveform_simple_gap_few_samples.png
	Diff: /usr/lib/python3/dist-packages/obspy/imaging/tests/images/testrun/waveform_simple_gap_few_samples-failed-diff.png
Upload to imgur failed (caught HTTPError: 400 Client Error: Bad Request for url: https://api.imgur.com/3/image).
Traceback (most recent call last):
File "/usr/lib/python3/dist-packages/obspy/imaging/tests/test_waveform.py", line 396, in test_plot_wiggles_horizontal_section
fillcolors=("blue", "red"))
File "/usr/lib/python3/dist-packages/obspy/core/util/testing.py", line 470, in __exit__
raise ImageComparisonException(msg)
obspy.core.util.testing.ImageComparisonException: Image comparison failed.
	File: waveform_wiggles_horizontal_section.png
	RMS: 95.6766777572605
	Tolerance: 3.0
	Expected: /usr/lib/python3/dist-packages/obspy/imaging/tests/images/waveform_wiggles_horizontal_section.png
	Actual: /usr/lib/python3/dist-packages/obspy/imaging/tests/images/testrun/waveform_wiggles_horizontal_section.png
	Diff: /usr/lib/python3/dist-packages/obspy/imaging/tests/images/testrun/waveform_wiggles_horizontal_section-failed-diff.png
Upload to imgur failed (caught HTTPError: 400 Client Error: Bad Request for url: https://api.imgur.com/3/image).
Traceback (most recent call last):
File "/usr/lib/python3/dist-packages/obspy/imaging/tests/test_waveform.py", line 450, in test_plot_day_plot
timezone='EST', time_offset=-5)
File "/usr/lib/python3/dist-packages/obspy/core/util/testing.py", line 470, in __exit__
raise ImageComparisonException(msg)
obspy.core.util.testing.ImageComparisonException: Image comparison failed.
	File: waveform_dayplot.png
	RMS: 18.26977741152493
	Tolerance: 3.0
	Expected: /usr/lib/python3/dist-packages/obspy/imaging/tests/images/waveform_dayplot.png
	Actual: /usr/lib/python3/dist-packages/obspy/imaging/tests/images/testrun/waveform_dayplot.png
	Diff: /usr/lib/python3/dist-packages/obspy/imaging/tests/images/testrun/waveform_dayplot-failed-diff.png
	Expected: https://i.imgur.com/tFU194B.png
	Actual: https://i.imgur.com/L8M3zge.png
	Diff: https://i.imgur.com/Lb8fOdX.png
Traceback (most recent call last):
File "/usr/lib/python3/dist-packages/obspy/imaging/tests/test_waveform.py", line 472, in test_plot_day_plot_explicit_event
{'time': event5, 'text': 'Event 5'}])
File "/usr/lib/python3/dist-packages/obspy/core/util/testing.py", line 470, in __exit__
raise ImageComparisonException(msg)
obspy.core.util.testing.ImageComparisonException: Image comparison failed.
	File: waveform_dayplot_event.png
	RMS: 22.008635426425997
	Tolerance: 3.0
	Expected: /usr/lib/python3/dist-packages/obspy/imaging/tests/images/waveform_dayplot_event.png
	Actual: /usr/lib/python3/dist-packages/obspy/imaging/tests/images/testrun/waveform_dayplot_event.png
	Diff: /usr/lib/python3/dist-packages/obspy/imaging/tests/images/testrun/waveform_dayplot_event-failed-diff.png
	Expected: https://i.imgur.com/h31ODiy.png
	Actual: https://i.imgur.com/aBJklkg.png
	Diff: https://i.imgur.com/332EQyU.png
Traceback (most recent call last):
File "/usr/lib/python3/dist-packages/obspy/imaging/tests/test_waveform.py", line 379, in test_plot_wiggles_positive_section
fillcolors=("black", None))
File "/usr/lib/python3/dist-packages/obspy/core/util/testing.py", line 470, in __exit__
raise ImageComparisonException(msg)
obspy.core.util.testing.ImageComparisonException: Image comparison failed.
	File: waveform_wiggles_positive_section.png
	RMS: 87.86916819909017
	Tolerance: 3.0
	Expected: /usr/lib/python3/dist-packages/obspy/imaging/tests/images/waveform_wiggles_positive_section.png
	Actual: /usr/lib/python3/dist-packages/obspy/imaging/tests/images/testrun/waveform_wiggles_positive_section.png
	Diff: /usr/lib/python3/dist-packages/obspy/imaging/tests/images/testrun/waveform_wiggles_positive_section-failed-diff.png
Upload to imgur failed (caught HTTPError: 400 Client Error: Bad Request for url: https://api.imgur.com/3/image).
Traceback (most recent call last):
File "/usr/lib/python3/dist-packages/obspy/imaging/tests/test_waveform.py", line 122, in test_plot_one_hour_many_samples
st.plot(outfile=ic.name)
File "/usr/lib/python3/dist-packages/obspy/core/util/testing.py", line 470, in __exit__
raise ImageComparisonException(msg)
obspy.core.util.testing.ImageComparisonException: Image comparison failed.
	File: waveform_one_hour_many_samples.png
	RMS: 47.95372436005362
	Tolerance: 3.0
	Expected: /usr/lib/python3/dist-packages/obspy/imaging/tests/images/waveform_one_hour_many_samples.png
	Actual: /usr/lib/python3/dist-packages/obspy/imaging/tests/images/testrun/waveform_one_hour_many_samples.png
	Diff: /usr/lib/python3/dist-packages/obspy/imaging/tests/images/testrun/waveform_one_hour_many_samples-failed-diff.png
Upload to imgur failed (caught HTTPError: 400 Client Error: Bad Request for url: https://api.imgur.com/3/image).
Traceback (most recent call last):
File "/usr/lib/python3/dist-packages/obspy/imaging/tests/test_waveform.py", line 255, in test_plot_with_labels
st.plot(outfile=ic.name)
File "/usr/lib/python3/dist-packages/obspy/core/util/testing.py", line 470, in __exit__
raise ImageComparisonException(msg)
obspy.core.util.testing.ImageComparisonException: Image comparison failed.
	File: waveform_labels.png
	RMS: 36.688205552556894
	Tolerance: 3.0
	Expected: /usr/lib/python3/dist-packages/obspy/imaging/tests/images/waveform_labels.png
	Actual: /usr/lib/python3/dist-packages/obspy/imaging/tests/images/testrun/waveform_labels.png
	Diff: /usr/lib/python3/dist-packages/obspy/imaging/tests/images/testrun/waveform_labels-failed-diff.png
Upload to imgur failed (caught HTTPError: 400 Client Error: Bad Request for url: https://api.imgur.com/3/image).
Traceback (most recent call last):
File "/usr/lib/python3/dist-packages/obspy/imaging/tests/test_plot.py", line 44, in test_plot
obspy_plot(['--outfile', ic.name] + all_files)
File "/usr/lib/python3/dist-packages/obspy/core/util/testing.py", line 470, in __exit__
raise ImageComparisonException(msg)
obspy.core.util.testing.ImageComparisonException: Image comparison failed.
	File: plot.png
	RMS: 29.50723436718528
	Tolerance: 3.0
	Expected: /usr/lib/python3/dist-packages/obspy/imaging/tests/images/plot.png
	Actual: /usr/lib/python3/dist-packages/obspy/imaging/tests/images/testrun/plot.png
	Diff: /usr/lib/python3/dist-packages/obspy/imaging/tests/images/testrun/plot-failed-diff.png
	Expected: https://i.imgur.com/dlHgRgr.png
	Actual: https://i.imgur.com/IuXEYqV.png
	Diff: https://i.imgur.com/Xwqf7sO.png
Traceback (most recent call last):
File "/usr/lib/python3/dist-packages/obspy/imaging/tests/test_waveform.py", line 284, in test_plot_default_section
st.plot(outfile=ic.name, type='section')
File "/usr/lib/python3/dist-packages/obspy/core/util/testing.py", line 470, in __exit__
raise ImageComparisonException(msg)
obspy.core.util.testing.ImageComparisonException: Image comparison failed.
	File: waveform_default_section.png
	RMS: 25.024618278806972
	Tolerance: 3.0
	Expected: /usr/lib/python3/dist-packages/obspy/imaging/tests/images/waveform_default_section.png
	Actual: /usr/lib/python3/dist-packages/obspy/imaging/tests/images/testrun/waveform_default_section.png
	Diff: /usr/lib/python3/dist-packages/obspy/imaging/tests/images/testrun/waveform_default_section-failed-diff.png
	Expected: https://i.imgur.com/onahe1d.png
	Actual: https://i.imgur.com/CYkuQFV.png
	Diff: https://i.imgur.com/G0MyDTf.png
Traceback (most recent call last):
File "/usr/lib/python3/dist-packages/obspy/imaging/tests/test_waveform.py", line 438, in test_plot_ref_time_relative
st.plot(outfile=ic.name, type='relative', reftime=ref)
File "/usr/lib/python3/dist-packages/obspy/core/util/testing.py", line 470, in __exit__
raise ImageComparisonException(msg)
obspy.core.util.testing.ImageComparisonException: Image comparison failed.
	File: waveform_reftime_relative.png
	RMS: 46.91751570575748
	Tolerance: 3.0
	Expected: /usr/lib/python3/dist-packages/obspy/imaging/tests/images/waveform_reftime_relative.png
	Actual: /usr/lib/python3/dist-packages/obspy/imaging/tests/images/testrun/waveform_reftime_relative.png
	Diff: /usr/lib/python3/dist-packages/obspy/imaging/tests/images/testrun/waveform_reftime_relative-failed-diff.png
Upload to imgur failed (caught HTTPError: 400 Client Error: Bad Request for url: https://api.imgur.com/3/image).
Traceback (most recent call last):
File "/usr/lib/python3/dist-packages/obspy/imaging/tests/test_waveform.py", line 216, in test_plot_multiple_traces
st.plot(outfile=ic.name, automerge=False)
File "/usr/lib/python3/dist-packages/obspy/core/util/testing.py", line 470, in __exit__
raise ImageComparisonException(msg)
obspy.core.util.testing.ImageComparisonException: Image comparison failed.
	File: waveform_1_trace.png
	RMS: 31.74337852214222
	Tolerance: 3.0
	Expected: /usr/lib/python3/dist-packages/obspy/imaging/tests/images/waveform_1_trace.png
	Actual: /usr/lib/python3/dist-packages/obspy/imaging/tests/images/testrun/waveform_1_trace.png
	Diff: /usr/lib/python3/dist-packages/obspy/imaging/tests/images/testrun/waveform_1_trace-failed-diff.png
	Expected: https://i.imgur.com/EI7Zwno.png
	Actual: https://i.imgur.com/Yp7oTL0.png
	Diff: https://i.imgur.com/UqEaGFH.png
Traceback (most recent call last):
File "/usr/lib/python3/dist-packages/obspy/imaging/tests/test_waveform.py", line 313, in test_plot_horizontal_section
st.plot(outfile=ic.name, type='section', orientation='horizontal')
File "/usr/lib/python3/dist-packages/obspy/core/util/testing.py", line 470, in __exit__
raise ImageComparisonException(msg)
obspy.core.util.testing.ImageComparisonException: Image comparison failed.
	File: waveform_horiz_section.png
	RMS: 27.273268964317424
	Tolerance: 3.0
	Expected: /usr/lib/python3/dist-packages/obspy/imaging/tests/images/waveform_horiz_section.png
	Actual: /usr/lib/python3/dist-packages/obspy/imaging/tests/images/testrun/waveform_horiz_section.png
	Diff: /usr/lib/python3/dist-packages/obspy/imaging/tests/images/testrun/waveform_horiz_section-failed-diff.png
	Expected: https://i.imgur.com/mbXFzJZ.png
	Actual: https://i.imgur.com/HLRPI34.png
	Diff: https://i.imgur.com/4BZB9jg.png
Traceback (most recent call last):
File "/usr/lib/python3/dist-packages/obspy/imaging/tests/test_ppsd.py", line 63, in test_ppsd_plot_frequency
fig.savefig(ic.name, dpi=50)
File "/usr/lib/python3/dist-packages/obspy/core/util/testing.py", line 403, in __exit__
msg = self.compare()
File "/usr/lib/python3/dist-packages/obspy/core/util/testing.py", line 501, in compare
return compare_images(self.baseline_image, self.name, tol=self.tol)
File "/usr/lib/python3/dist-packages/obspy/core/util/testing.py", line 220, in compare_images
str(expected_image.shape)))
obspy.core.util.testing.ImageComparisonException: The shape of the received image (240, 320, 4) is not equal to the expected shape (300, 400, 4).
Traceback (most recent call last):
File "/usr/lib/python3/dist-packages/obspy/imaging/tests/test_waveform.py", line 361, in test_plot_wiggles_negative_section
fillcolors=(None, "black"))
File "/usr/lib/python3/dist-packages/obspy/core/util/testing.py", line 470, in __exit__
raise ImageComparisonException(msg)
obspy.core.util.testing.ImageComparisonException: Image comparison failed.
	File: waveform_wiggles_negative_section.png
	RMS: 79.84757479097283
	Tolerance: 3.0
	Expected: /usr/lib/python3/dist-packages/obspy/imaging/tests/images/waveform_wiggles_negative_section.png
	Actual: /usr/lib/python3/dist-packages/obspy/imaging/tests/images/testrun/waveform_wiggles_negative_section.png
	Diff: /usr/lib/python3/dist-packages/obspy/imaging/tests/images/testrun/waveform_wiggles_negative_section-failed-diff.png
Upload to imgur failed (caught HTTPError: 400 Client Error: Bad Request for url: https://api.imgur.com/3/image).
Traceback (most recent call last):
File "/usr/lib/python3/dist-packages/obspy/imaging/tests/test_scan.py", line 54, in test_scan_main_method
obspy_scan([os.curdir] + ['--output', ic.name, '--quiet'])
File "/usr/lib/python3/dist-packages/obspy/core/util/testing.py", line 403, in __exit__
msg = self.compare()
File "/usr/lib/python3/dist-packages/obspy/core/util/testing.py", line 501, in compare
return compare_images(self.baseline_image, self.name, tol=self.tol)
File "/usr/lib/python3/dist-packages/obspy/core/util/testing.py", line 220, in compare_images
str(expected_image.shape)))
obspy.core.util.testing.ImageComparisonException: The shape of the received image (468, 1872, 4) is not equal to the expected shape (650, 2600, 4).
Traceback (most recent call last):
File "/usr/lib/python3/dist-packages/obspy/imaging/tests/test_plot.py", line 60, in test_plot_no_merge
all_files)
File "/usr/lib/python3/dist-packages/obspy/core/util/testing.py", line 470, in __exit__
raise ImageComparisonException(msg)
obspy.core.util.testing.ImageComparisonException: Image comparison failed.
	File: plot_nomerge.png
	RMS: 29.434122601724233
	Tolerance: 3.0
	Expected: /usr/lib/python3/dist-packages/obspy/imaging/tests/images/plot_nomerge.png
	Actual: /usr/lib/python3/dist-packages/obspy/imaging/tests/images/testrun/plot_nomerge.png
	Diff: /usr/lib/python3/dist-packages/obspy/imaging/tests/images/testrun/plot_nomerge-failed-diff.png
	Expected: https://i.imgur.com/H57URVX.png
	Actual: https://i.imgur.com/XiHHNaq.png
	Diff: https://i.imgur.com/aY86CKg.png
Traceback (most recent call last):
File "/usr/lib/python3/dist-packages/obspy/imaging/tests/test_mopad.py", line 79, in test_collection
fig.savefig(ic.name)
File "/usr/lib/python3/dist-packages/obspy/core/util/testing.py", line 403, in __exit__
msg = self.compare()
File "/usr/lib/python3/dist-packages/obspy/core/util/testing.py", line 501, in compare
return compare_images(self.baseline_image, self.name, tol=self.tol)
File "/usr/lib/python3/dist-packages/obspy/core/util/testing.py", line 220, in compare_images
str(expected_image.shape)))
obspy.core.util.testing.ImageComparisonException: The shape of the received image (1800, 1800, 4) is not equal to the expected shape (600, 600, 4).
Traceback (most recent call last):
File "/usr/lib/python3/dist-packages/obspy/imaging/tests/test_ppsd.py", line 44, in test_ppsd_plot
fig.savefig(ic.name)
File "/usr/lib/python3/dist-packages/obspy/core/util/testing.py", line 403, in __exit__
msg = self.compare()
File "/usr/lib/python3/dist-packages/obspy/core/util/testing.py", line 501, in compare
return compare_images(self.baseline_image, self.name, tol=self.tol)
File "/usr/lib/python3/dist-packages/obspy/core/util/testing.py", line 220, in compare_images
str(expected_image.shape)))
obspy.core.util.testing.ImageComparisonException: The shape of the received image (480, 640, 4) is not equal to the expected shape (600, 800, 4).
Traceback (most recent call last):
File "/usr/lib/python3/dist-packages/obspy/imaging/tests/test_beachball.py", line 83, in test_beachball
beachball(data_, outfile=ic.name)
File "/usr/lib/python3/dist-packages/obspy/core/util/testing.py", line 470, in __exit__
raise ImageComparisonException(msg)
obspy.core.util.testing.ImageComparisonException: Image comparison failed.
	File: bb_sumatra_mt.png
	RMS: 79.80270672101291
	Tolerance: 3.0
	Expected: /usr/lib/python3/dist-packages/obspy/imaging/tests/images/bb_sumatra_mt.png
	Actual: /usr/lib/python3/dist-packages/obspy/imaging/tests/images/testrun/bb_sumatra_mt.png
	Diff: /usr/lib/python3/dist-packages/obspy/imaging/tests/images/testrun/bb_sumatra_mt-failed-diff.png
Upload to imgur failed (caught HTTPError: 400 Client Error: Bad Request for url: https://api.imgur.com/3/image).
Traceback (most recent call last):
File "/usr/lib/python3/dist-packages/obspy/imaging/tests/test_waveform.py", line 424, in test_plot_default_relative
st.plot(outfile=ic.name, type='relative')
File "/usr/lib/python3/dist-packages/obspy/core/util/testing.py", line 470, in __exit__
raise ImageComparisonException(msg)
obspy.core.util.testing.ImageComparisonException: Image comparison failed.
	File: waveform_default_relative.png
	RMS: 46.619425993892285
	Tolerance: 3.0
	Expected: /usr/lib/python3/dist-packages/obspy/imaging/tests/images/waveform_default_relative.png
	Actual: /usr/lib/python3/dist-packages/obspy/imaging/tests/images/testrun/waveform_default_relative.png
	Diff: /usr/lib/python3/dist-packages/obspy/imaging/tests/images/testrun/waveform_default_relative-failed-diff.png
	Expected: https://i.imgur.com/CBKUZqK.png
	Actual: https://i.imgur.com/xpw1K0x.png
	Diff: https://i.imgur.com/jWb0Jsy.png
Traceback (most recent call last):
File "/usr/lib/python3/dist-packages/obspy/imaging/tests/test_spectrogram.py", line 48, in test_spectrogram
samp_rate=st[0].stats.sampling_rate, show=False)
File "/usr/lib/python3/dist-packages/obspy/core/util/testing.py", line 403, in __exit__
msg = self.compare()
File "/usr/lib/python3/dist-packages/obspy/core/util/testing.py", line 501, in compare
return compare_images(self.baseline_image, self.name, tol=self.tol)
File "/usr/lib/python3/dist-packages/obspy/core/util/testing.py", line 220, in compare_images
str(expected_image.shape)))
obspy.core.util.testing.ImageComparisonException: The shape of the received image (480, 640, 4) is not equal to the expected shape (600, 800, 4).
Traceback (most recent call last):
File "/usr/lib/python3/dist-packages/obspy/imaging/tests/test_waveform.py", line 150, in test_plot_simple_gap_many_samples
st.plot(outfile=ic.name)
File "/usr/lib/python3/dist-packages/obspy/core/util/testing.py", line 470, in __exit__
raise ImageComparisonException(msg)
obspy.core.util.testing.ImageComparisonException: Image comparison failed.
	File: waveform_simple_gap_many_samples.png
	RMS: 37.07760725829001
	Tolerance: 3.0
	Expected: /usr/lib/python3/dist-packages/obspy/imaging/tests/images/waveform_simple_gap_many_samples.png
	Actual: /usr/lib/python3/dist-packages/obspy/imaging/tests/images/testrun/waveform_simple_gap_many_samples.png
	Diff: /usr/lib/python3/dist-packages/obspy/imaging/tests/images/testrun/waveform_simple_gap_many_samples-failed-diff.png
Upload to imgur failed (caught HTTPError: 400 Client Error: Bad Request for url: https://api.imgur.com/3/image).
Traceback (most recent call last):
File "/usr/lib/python3/dist-packages/obspy/imaging/tests/test_waveform.py", line 265, in test_plot_binning_error
tr.plot(outfile=ic.name)
File "/usr/lib/python3/dist-packages/obspy/core/util/testing.py", line 470, in __exit__
raise ImageComparisonException(msg)
obspy.core.util.testing.ImageComparisonException: Image comparison failed.
	File: waveform_binning_error.png
	RMS: 44.11330320889606
	Tolerance: 3.0
	Expected: /usr/lib/python3/dist-packages/obspy/imaging/tests/images/waveform_binning_error.png
	Actual: /usr/lib/python3/dist-packages/obspy/imaging/tests/images/testrun/waveform_binning_error.png
	Diff: /usr/lib/python3/dist-packages/obspy/imaging/tests/images/testrun/waveform_binning_error-failed-diff.png
	Expected: https://i.imgur.com/1Bbks83.png
	Actual: https://i.imgur.com/Cmof5qX.png
	Diff: https://i.imgur.com/QSag9pa.png
Traceback (most recent call last):
File "/usr/lib/python3/dist-packages/obspy/imaging/tests/test_scan.py", line 137, in test_scan_times
['--quiet'])
File "/usr/lib/python3/dist-packages/obspy/core/util/testing.py", line 403, in __exit__
msg = self.compare()
File "/usr/lib/python3/dist-packages/obspy/core/util/testing.py", line 501, in compare
return compare_images(self.baseline_image, self.name, tol=self.tol)
File "/usr/lib/python3/dist-packages/obspy/core/util/testing.py", line 220, in compare_images
str(expected_image.shape)))
obspy.core.util.testing.ImageComparisonException: The shape of the received image (468, 876, 4) is not equal to the expected shape (650, 1216, 4).
Traceback (most recent call last):
File "/usr/lib/python3/dist-packages/obspy/imaging/tests/test_beachball.py", line 254, in test_collection
fig.savefig(ic.name)
File "/usr/lib/python3/dist-packages/obspy/core/util/testing.py", line 403, in __exit__
msg = self.compare()
File "/usr/lib/python3/dist-packages/obspy/core/util/testing.py", line 501, in compare
return compare_images(self.baseline_image, self.name, tol=self.tol)
File "/usr/lib/python3/dist-packages/obspy/core/util/testing.py", line 220, in compare_images
str(expected_image.shape)))
obspy.core.util.testing.ImageComparisonException: The shape of the received image (1800, 1800, 4) is not equal to the expected shape (600, 600, 4).
Traceback (most recent call last):
File "/usr/lib/python3/dist-packages/obspy/imaging/tests/test_ppsd.py", line 85, in test_ppsd_plot_cumulative
fig.savefig(ic.name)
File "/usr/lib/python3/dist-packages/obspy/core/util/testing.py", line 403, in __exit__
msg = self.compare()
File "/usr/lib/python3/dist-packages/obspy/core/util/testing.py", line 501, in compare
return compare_images(self.baseline_image, self.name, tol=self.tol)
File "/usr/lib/python3/dist-packages/obspy/core/util/testing.py", line 220, in compare_images
str(expected_image.shape)))
obspy.core.util.testing.ImageComparisonException: The shape of the received image (480, 640, 4) is not equal to the expected shape (600, 800, 4).
Traceback (most recent call last):
File "/usr/lib/python3/dist-packages/obspy/imaging/tests/test_beachball.py", line 314, in test_collection_aspect_y
filename_width_height='bb_aspect_y_height.png')
File "/usr/lib/python3/dist-packages/obspy/imaging/tests/test_beachball.py", line 280, in collection_aspect
fig.savefig(ic.name)
File "/usr/lib/python3/dist-packages/obspy/core/util/testing.py", line 403, in __exit__
msg = self.compare()
File "/usr/lib/python3/dist-packages/obspy/core/util/testing.py", line 501, in compare
return compare_images(self.baseline_image, self.name, tol=self.tol)
File "/usr/lib/python3/dist-packages/obspy/core/util/testing.py", line 220, in compare_images
str(expected_image.shape)))
obspy.core.util.testing.ImageComparisonException: The shape of the received image (480, 640, 4) is not equal to the expected shape (600, 800, 4).
Traceback (most recent call last):
File "/usr/lib/python3/dist-packages/obspy/imaging/tests/test_scan.py", line 95, in test_scanner_manually_add_streams
scanner.plot(ic.name)
File "/usr/lib/python3/dist-packages/obspy/core/util/testing.py", line 403, in __exit__
msg = self.compare()
File "/usr/lib/python3/dist-packages/obspy/core/util/testing.py", line 501, in compare
return compare_images(self.baseline_image, self.name, tol=self.tol)
File "/usr/lib/python3/dist-packages/obspy/core/util/testing.py", line 220, in compare_images
str(expected_image.shape)))
obspy.core.util.testing.ImageComparisonException: The shape of the received image (468, 1872, 4) is not equal to the expected shape (650, 2600, 4).
Traceback (most recent call last):
File "/usr/lib/python3/dist-packages/obspy/imaging/tests/test_scan.py", line 118, in test_scan_save_load_npz
'--quiet'])
File "/usr/lib/python3/dist-packages/obspy/core/util/testing.py", line 403, in __exit__
msg = self.compare()
File "/usr/lib/python3/dist-packages/obspy/core/util/testing.py", line 501, in compare
return compare_images(self.baseline_image, self.name, tol=self.tol)
File "/usr/lib/python3/dist-packages/obspy/core/util/testing.py", line 220, in compare_images
str(expected_image.shape)))
obspy.core.util.testing.ImageComparisonException: The shape of the received image (468, 1872, 4) is not equal to the expected shape (650, 2600, 4).
Traceback (most recent call last):
File "/usr/lib/python3/dist-packages/obspy/signal/tests/test_seismic_array.py", line 184, in test_covariance_array_processing
dt[i]:-(np.max(dt) + 1) + dt[i]].copy())
TypeError: slice indices must be integers or None or have an __index__ method
Traceback (most recent call last):
File "/usr/lib/python3/dist-packages/obspy/signal/tests/test_seismic_array.py", line 329, in test_array_plotting
plt.savefig(ic.name)
File "/usr/lib/python3/dist-packages/obspy/core/util/testing.py", line 403, in __exit__
msg = self.compare()
File "/usr/lib/python3/dist-packages/obspy/core/util/testing.py", line 501, in compare
return compare_images(self.baseline_image, self.name, tol=self.tol)
File "/usr/lib/python3/dist-packages/obspy/core/util/testing.py", line 220, in compare_images
str(expected_image.shape)))
obspy.core.util.testing.ImageComparisonException: The shape of the received image (480, 640, 4) is not equal to the expected shape (600, 800, 4).
Traceback (most recent call last):
File "/usr/lib/python3/dist-packages/obspy/signal/tests/test_detrend.py", line 87, in test_spline_detrend_plotting
spline(tr.data, order=1, dspline=1500, plot=ic.name)
File "/usr/lib/python3/dist-packages/obspy/core/util/testing.py", line 470, in __exit__
raise ImageComparisonException(msg)
obspy.core.util.testing.ImageComparisonException: Image comparison failed.
	File: degree_1_spline_detrend.png
	RMS: 61.52134458868727
	Tolerance: 3.0
	Expected: /usr/lib/python3/dist-packages/obspy/signal/tests/images/degree_1_spline_detrend.png
	Actual: /usr/lib/python3/dist-packages/obspy/signal/tests/images/testrun/degree_1_spline_detrend.png
	Diff: /usr/lib/python3/dist-packages/obspy/signal/tests/images/testrun/degree_1_spline_detrend-failed-diff.png
Upload to imgur failed (caught HTTPError: 400 Client Error: Bad Request for url: https://api.imgur.com/3/image).
Traceback (most recent call last):
File "/usr/lib/python3/dist-packages/obspy/signal/tests/test_seismic_array.py", line 319, in test_plot_radial_transfer_function
plt.savefig(ic.name)
File "/usr/lib/python3/dist-packages/obspy/core/util/testing.py", line 403, in __exit__
msg = self.compare()
File "/usr/lib/python3/dist-packages/obspy/core/util/testing.py", line 501, in compare
return compare_images(self.baseline_image, self.name, tol=self.tol)
File "/usr/lib/python3/dist-packages/obspy/core/util/testing.py", line 220, in compare_images
str(expected_image.shape)))
obspy.core.util.testing.ImageComparisonException: The shape of the received image (480, 640, 4) is not equal to the expected shape (600, 800, 4).
Traceback (most recent call last):
File "/usr/lib/python3/dist-packages/obspy/signal/tests/test_cross_correlation.py", line 74, in test_xcorr_pick_correction_images
t1, tr1, t2, tr2, 0.05, 0.2, 0.1, plot=True, filename=ic.name)
File "/usr/lib/python3/dist-packages/obspy/core/util/testing.py", line 403, in __exit__
msg = self.compare()
File "/usr/lib/python3/dist-packages/obspy/core/util/testing.py", line 501, in compare
return compare_images(self.baseline_image, self.name, tol=self.tol)
File "/usr/lib/python3/dist-packages/obspy/core/util/testing.py", line 220, in compare_images
str(expected_image.shape)))
obspy.core.util.testing.ImageComparisonException: The shape of the received image (480, 640, 4) is not equal to the expected shape (600, 800, 4).
Traceback (most recent call last):
File "/usr/lib/python3/dist-packages/obspy/signal/tests/test_spectral_estimation.py", line 439, in test_ppsd_restricted_stacks
fig.savefig(ic.name)
File "/usr/lib/python3/dist-packages/obspy/core/util/testing.py", line 403, in __exit__
msg = self.compare()
File "/usr/lib/python3/dist-packages/obspy/core/util/testing.py", line 501, in compare
return compare_images(self.baseline_image, self.name, tol=self.tol)
File "/usr/lib/python3/dist-packages/obspy/core/util/testing.py", line 220, in compare_images
str(expected_image.shape)))
obspy.core.util.testing.ImageComparisonException: The shape of the received image (480, 640, 4) is not equal to the expected shape (600, 800, 4).
Traceback (most recent call last):
File "/usr/lib/python3/dist-packages/obspy/signal/tests/test_tf_misfit.py", line 308, in test_plot_tf_gofs
plt.savefig(ic.name)
File "/usr/lib/python3/dist-packages/obspy/core/util/testing.py", line 403, in __exit__
msg = self.compare()
File "/usr/lib/python3/dist-packages/obspy/core/util/testing.py", line 501, in compare
return compare_images(self.baseline_image, self.name, tol=self.tol)
File "/usr/lib/python3/dist-packages/obspy/core/util/testing.py", line 220, in compare_images
str(expected_image.shape)))
obspy.core.util.testing.ImageComparisonException: The shape of the received image (480, 640, 4) is not equal to the expected shape (600, 800, 4).
Traceback (most recent call last):
File "/usr/lib/python3/dist-packages/obspy/signal/tests/test_detrend.py", line 73, in test_polynomial_detrend_plotting
polynomial(tr.data, order=3, plot=ic.name)
File "/usr/lib/python3/dist-packages/obspy/core/util/testing.py", line 470, in __exit__
raise ImageComparisonException(msg)
obspy.core.util.testing.ImageComparisonException: Image comparison failed.
	File: polynomial_detrend.png
	RMS: 60.70076375137301
	Tolerance: 3.0
	Expected: /usr/lib/python3/dist-packages/obspy/signal/tests/images/polynomial_detrend.png
	Actual: /usr/lib/python3/dist-packages/obspy/signal/tests/images/testrun/polynomial_detrend.png
	Diff: /usr/lib/python3/dist-packages/obspy/signal/tests/images/testrun/polynomial_detrend-failed-diff.png
Upload to imgur failed (caught HTTPError: 400 Client Error: Bad Request for url: https://api.imgur.com/3/image).
Traceback (most recent call last):
File "/usr/lib/python3.5/doctest.py", line 2190, in runTest
raise self.failureException(self.format_failure(new.getvalue()))
AssertionError: Failed doctest test for obspy.signal.array_analysis.seismic_array.SeismicArray
File "/usr/lib/python3/dist-packages/obspy/signal/array_analysis/seismic_array.py", line 73, in SeismicArray
----------------------------------------------------------------------
File "/usr/lib/python3/dist-packages/obspy/signal/array_analysis/seismic_array.py", line 100, in obspy.signal.array_analysis.seismic_array.SeismicArray
Failed example:
print(array)
Expected:
Seismic Array 'AGFA' with 5 Stations, aperture: 0.06 km.
Got:
Seismic Array 'AGFA' with 5 Stations, Aperture: 0.06 km.
Traceback (most recent call last):
File "/usr/lib/python3/dist-packages/obspy/signal/tests/test_tf_misfit.py", line 292, in test_plot_tfr
plt.savefig(ic.name)
File "/usr/lib/python3/dist-packages/obspy/core/util/testing.py", line 403, in __exit__
msg = self.compare()
File "/usr/lib/python3/dist-packages/obspy/core/util/testing.py", line 501, in compare
return compare_images(self.baseline_image, self.name, tol=self.tol)
File "/usr/lib/python3/dist-packages/obspy/core/util/testing.py", line 220, in compare_images
str(expected_image.shape)))
obspy.core.util.testing.ImageComparisonException: The shape of the received image (480, 640, 4) is not equal to the expected shape (600, 800, 4).
Traceback (most recent call last):
File "/usr/lib/python3/dist-packages/obspy/signal/tests/test_interpolation.py", line 136, in test_plot_lanczos_window
plot_lanczos_windows(a=20, filename=ic.name)
File "/usr/lib/python3/dist-packages/obspy/core/util/testing.py", line 470, in __exit__
raise ImageComparisonException(msg)
obspy.core.util.testing.ImageComparisonException: Image comparison failed.
	File: plot_lanczos_window.png
	RMS: 47.81144911699149
	Tolerance: 3.0
	Expected: /usr/lib/python3/dist-packages/obspy/signal/tests/images/plot_lanczos_window.png
	Actual: /usr/lib/python3/dist-packages/obspy/signal/tests/images/testrun/plot_lanczos_window.png
	Diff: /usr/lib/python3/dist-packages/obspy/signal/tests/images/testrun/plot_lanczos_window-failed-diff.png
Upload to imgur failed (caught HTTPError: 400 Client Error: Bad Request for url: https://api.imgur.com/3/image).
Traceback (most recent call last):
File "/usr/lib/python3/dist-packages/obspy/signal/tests/test_seismic_array.py", line 305, in test_three_component_beamforming
freq_range=[0.1, .3], whiten=True, coherency=False)
File "/usr/lib/python3/dist-packages/obspy/signal/array_analysis/seismic_array.py", line 1790, in three_component_beamforming
uindex=uindex)
File "/usr/lib/python3/dist-packages/obspy/signal/array_analysis/seismic_array.py", line 1502, in _three_c_do_bf
fcoeffz, fcoeffn, fcoeffe, deltaf, whiten)
File "/usr/lib/python3/dist-packages/obspy/signal/array_analysis/seismic_array.py", line 1354, in _three_c_dowhiten
ampw[ww / 2:n_freqs - ww / 2] += (csamp[ww:, k] -
TypeError: slice indices must be integers or None or have an __index__ method
Traceback (most recent call last):
File "/usr/lib/python3/dist-packages/obspy/signal/tests/test_tf_misfit.py", line 300, in test_plot_tf_misfits
plt.savefig(ic.name)
File "/usr/lib/python3/dist-packages/obspy/core/util/testing.py", line 403, in __exit__
msg = self.compare()
File "/usr/lib/python3/dist-packages/obspy/core/util/testing.py", line 501, in compare
return compare_images(self.baseline_image, self.name, tol=self.tol)
File "/usr/lib/python3/dist-packages/obspy/core/util/testing.py", line 220, in compare_images
str(expected_image.shape)))
obspy.core.util.testing.ImageComparisonException: The shape of the received image (480, 640, 4) is not equal to the expected shape (600, 800, 4).
Traceback (most recent call last):
File "/usr/lib/python3.5/doctest.py", line 2190, in runTest
raise self.failureException(self.format_failure(new.getvalue()))
AssertionError: Failed doctest test for obspy.signal.array_analysis.seismic_array.SeismicArray.plot
File "/usr/lib/python3/dist-packages/obspy/signal/array_analysis/seismic_array.py", line 185, in plot
----------------------------------------------------------------------
File "/usr/lib/python3/dist-packages/obspy/signal/array_analysis/seismic_array.py", line 196, in obspy.signal.array_analysis.seismic_array.SeismicArray.plot
Failed example:
array.plot()
Expected nothing
Got:
<matplotlib.figure.Figure object at 0x7f5a26bf4438>
Traceback (most recent call last):
File "/usr/lib/python3/dist-packages/obspy/taup/tests/test_plotting.py", line 104, in test_cartesian_many_phases_no_other_way
plt.savefig(ic.name)
File "/usr/lib/python3/dist-packages/obspy/core/util/testing.py", line 470, in __exit__
raise ImageComparisonException(msg)
obspy.core.util.testing.ImageComparisonException: Image comparison failed.
	File: cartesian_many_phases_single_way.png
	RMS: 44.07072497701848
	Tolerance: 3.0
	Expected: /usr/lib/python3/dist-packages/obspy/taup/tests/images/cartesian_many_phases_single_way.png
	Actual: /usr/lib/python3/dist-packages/obspy/taup/tests/images/testrun/cartesian_many_phases_single_way.png
	Diff: /usr/lib/python3/dist-packages/obspy/taup/tests/images/testrun/cartesian_many_phases_single_way-failed-diff.png
Upload to imgur failed (caught HTTPError: 400 Client Error: Bad Request for url: https://api.imgur.com/3/image).
Traceback (most recent call last):
File "/usr/lib/python3/dist-packages/obspy/taup/tests/test_plotting.py", line 93, in test_cartesian_many_phases_buried_station
plt.savefig(ic.name)
File "/usr/lib/python3/dist-packages/obspy/core/util/testing.py", line 470, in __exit__
raise ImageComparisonException(msg)
obspy.core.util.testing.ImageComparisonException: Image comparison failed.
	File: cartesian_many_phases_buried_station.png
	RMS: 45.60209936687857
	Tolerance: 3.0
	Expected: /usr/lib/python3/dist-packages/obspy/taup/tests/images/cartesian_many_phases_buried_station.png
	Actual: /usr/lib/python3/dist-packages/obspy/taup/tests/images/testrun/cartesian_many_phases_buried_station.png
	Diff: /usr/lib/python3/dist-packages/obspy/taup/tests/images/testrun/cartesian_many_phases_buried_station-failed-diff.png
Upload to imgur failed (caught HTTPError: 400 Client Error: Bad Request for url: https://api.imgur.com/3/image).
Traceback (most recent call last):
File "/usr/lib/python3/dist-packages/obspy/taup/tests/test_plotting.py", line 65, in test_spherical_more_then_360_degrees
plt.savefig(ic.name)
File "/usr/lib/python3/dist-packages/obspy/core/util/testing.py", line 470, in __exit__
raise ImageComparisonException(msg)
obspy.core.util.testing.ImageComparisonException: Image comparison failed.
	File: spherical_more_then_360.png
	RMS: 20.842795973669176
	Tolerance: 3.0
	Expected: /usr/lib/python3/dist-packages/obspy/taup/tests/images/spherical_more_then_360.png
	Actual: /usr/lib/python3/dist-packages/obspy/taup/tests/images/testrun/spherical_more_then_360.png
	Diff: /usr/lib/python3/dist-packages/obspy/taup/tests/images/testrun/spherical_more_then_360-failed-diff.png
Upload to imgur failed (caught HTTPError: 400 Client Error: Bad Request for url: https://api.imgur.com/3/image).
Traceback (most recent call last):
File "/usr/lib/python3/dist-packages/obspy/taup/tests/test_plotting.py", line 114, in test_cartesian_multiple_station_markers
plt.savefig(ic.name)
File "/usr/lib/python3/dist-packages/obspy/core/util/testing.py", line 470, in __exit__
raise ImageComparisonException(msg)
obspy.core.util.testing.ImageComparisonException: Image comparison failed.
	File: cartesian_multiple_stations.png
	RMS: 41.626152036109865
	Tolerance: 3.0
	Expected: /usr/lib/python3/dist-packages/obspy/taup/tests/images/cartesian_multiple_stations.png
	Actual: /usr/lib/python3/dist-packages/obspy/taup/tests/images/testrun/cartesian_multiple_stations.png
	Diff: /usr/lib/python3/dist-packages/obspy/taup/tests/images/testrun/cartesian_multiple_stations-failed-diff.png
Upload to imgur failed (caught HTTPError: 400 Client Error: Bad Request for url: https://api.imgur.com/3/image).
Traceback (most recent call last):
File "/usr/lib/python3/dist-packages/obspy/taup/tests/test_plotting.py", line 81, in test_cartesian_many_phases
plt.savefig(ic.name)
File "/usr/lib/python3/dist-packages/obspy/core/util/testing.py", line 470, in __exit__
raise ImageComparisonException(msg)
obspy.core.util.testing.ImageComparisonException: Image comparison failed.
	File: cartesian_many_phases.png
	RMS: 44.691777021431285
	Tolerance: 3.0
	Expected: /usr/lib/python3/dist-packages/obspy/taup/tests/images/cartesian_many_phases.png
	Actual: /usr/lib/python3/dist-packages/obspy/taup/tests/images/testrun/cartesian_many_phases.png
	Diff: /usr/lib/python3/dist-packages/obspy/taup/tests/images/testrun/cartesian_many_phases-failed-diff.png
Upload to imgur failed (caught HTTPError: 400 Client Error: Bad Request for url: https://api.imgur.com/3/image).
Traceback (most recent call last):
File "/usr/lib/python3/dist-packages/obspy/taup/tests/test_plotting.py", line 55, in test_spherical_many_phases_no_other_way
plt.savefig(ic.name)
File "/usr/lib/python3/dist-packages/obspy/core/util/testing.py", line 470, in __exit__
raise ImageComparisonException(msg)
obspy.core.util.testing.ImageComparisonException: Image comparison failed.
	File: spherical_many_phases_single_way.png
	RMS: 28.952834472638425
	Tolerance: 3.0
	Expected: /usr/lib/python3/dist-packages/obspy/taup/tests/images/spherical_many_phases_single_way.png
	Actual: /usr/lib/python3/dist-packages/obspy/taup/tests/images/testrun/spherical_many_phases_single_way.png
	Diff: /usr/lib/python3/dist-packages/obspy/taup/tests/images/testrun/spherical_many_phases_single_way-failed-diff.png
Upload to imgur failed (caught HTTPError: 400 Client Error: Bad Request for url: https://api.imgur.com/3/image).
Traceback (most recent call last):
File "/usr/lib/python3/dist-packages/obspy/taup/tests/test_plotting.py", line 44, in test_spherical_many_phases_buried_station
plt.savefig(ic.name)
File "/usr/lib/python3/dist-packages/obspy/core/util/testing.py", line 470, in __exit__
raise ImageComparisonException(msg)
obspy.core.util.testing.ImageComparisonException: Image comparison failed.
	File: spherical_many_phases_buried_station.png
	RMS: 34.897909163730716
	Tolerance: 3.0
	Expected: /usr/lib/python3/dist-packages/obspy/taup/tests/images/spherical_many_phases_buried_station.png
	Actual: /usr/lib/python3/dist-packages/obspy/taup/tests/images/testrun/spherical_many_phases_buried_station.png
	Diff: /usr/lib/python3/dist-packages/obspy/taup/tests/images/testrun/spherical_many_phases_buried_station-failed-diff.png
Upload to imgur failed (caught HTTPError: 400 Client Error: Bad Request for url: https://api.imgur.com/3/image).
Traceback (most recent call last):
File "/usr/lib/python3/dist-packages/obspy/taup/tests/test_plotting.py", line 32, in test_spherical_many_phases
plt.savefig(ic.name)
File "/usr/lib/python3/dist-packages/obspy/core/util/testing.py", line 470, in __exit__
raise ImageComparisonException(msg)
obspy.core.util.testing.ImageComparisonException: Image comparison failed.
	File: spherical_many_phases.png
	RMS: 34.55619053078623
	Tolerance: 3.0
	Expected: /usr/lib/python3/dist-packages/obspy/taup/tests/images/spherical_many_phases.png
	Actual: /usr/lib/python3/dist-packages/obspy/taup/tests/images/testrun/spherical_many_phases.png
	Diff: /usr/lib/python3/dist-packages/obspy/taup/tests/images/testrun/spherical_many_phases-failed-diff.png
Upload to imgur failed (caught HTTPError: 400 Client Error: Bad Request for url: https://api.imgur.com/3/image).
Traceback (most recent call last):
File "/usr/lib/python3/dist-packages/obspy/taup/tests/test_plotting.py", line 74, in test_spherical_diff_phases
plt.savefig(ic.name)
File "/usr/lib/python3/dist-packages/obspy/core/util/testing.py", line 470, in __exit__
raise ImageComparisonException(msg)
obspy.core.util.testing.ImageComparisonException: Image comparison failed.
	File: spherical_diff_phases.png
	RMS: 21.2393973549157
	Tolerance: 3.0
	Expected: /usr/lib/python3/dist-packages/obspy/taup/tests/images/spherical_diff_phases.png
	Actual: /usr/lib/python3/dist-packages/obspy/taup/tests/images/testrun/spherical_diff_phases.png
	Diff: /usr/lib/python3/dist-packages/obspy/taup/tests/images/testrun/spherical_diff_phases-failed-diff.png
Upload to imgur failed (caught HTTPError: 400 Client Error: Bad Request for url: https://api.imgur.com/3/image).

Skipped Tests (42)

Submodule Test Skip Message
io.shapefile test_write_catalog_shapefile (obspy.io.shapefile.tests.test_core.ShapefileTestCase) gdal not installed or version is too old
io.shapefile test_write_catalog_shapefile_via_plugin (obspy.io.shapefile.tests.test_core.ShapefileTestCase) gdal not installed or version is too old
io.shapefile test_write_inventory_shapefile (obspy.io.shapefile.tests.test_core.ShapefileTestCase) gdal not installed or version is too old
io.shapefile test_write_inventory_shapefile_via_plugin (obspy.io.shapefile.tests.test_core.ShapefileTestCase) gdal not installed or version is too old
clients.arclink test_get_waveform_no_password (obspy.clients.arclink.tests.test_decrypt.ClientTestCase) Module M2Crypto is not installed
clients.arclink test_get_waveform_unknown_user (obspy.clients.arclink.tests.test_decrypt.ClientTestCase) Module M2Crypto is not installed
clients.arclink test_get_waveform_with_dcid_key (obspy.clients.arclink.tests.test_decrypt.ClientTestCase) Module M2Crypto is not installed
clients.arclink test_get_waveform_with_dcid_key_file (obspy.clients.arclink.tests.test_decrypt.ClientTestCase) Module M2Crypto is not installed
clients.arclink test_get_waveform_with_default_dcid_key_file (obspy.clients.arclink.tests.test_decrypt.ClientTestCase) Module M2Crypto is not installed
clients.arclink test_get_waveform_wrong_password (obspy.clients.arclink.tests.test_decrypt.ClientTestCase) Module M2Crypto is not installed
clients.seedlink test_info (obspy.clients.seedlink.tests.test_slclient.SLClientTestCase) test must be started manually
clients.seedlink test_issue708 (obspy.clients.seedlink.tests.test_slclient.SLClientTestCase) test must be started manually
clients.seedlink test_time_window (obspy.clients.seedlink.tests.test_slclient.SLClientTestCase) test must be started manually
clients.seishub runTest (doctest.DocTestCase) Seishub test server not reachable.
clients.seishub runTest (doctest.DocTestCase) Seishub test server not reachable.
clients.seishub runTest (doctest.DocTestCase) Seishub test server not reachable.
clients.seishub test_get_channel_ids (obspy.clients.seishub.tests.test_client.ClientTestCase) Seishub test server not reachable.
clients.seishub test_get_coordinates (obspy.clients.seishub.tests.test_client.ClientTestCase) Seishub test server not reachable.
clients.seishub test_get_event_list (obspy.clients.seishub.tests.test_client.ClientTestCase) Seishub test server not reachable.
clients.seishub test_get_location_ids (obspy.clients.seishub.tests.test_client.ClientTestCase) Seishub test server not reachable.
clients.seishub test_get_network_ids (obspy.clients.seishub.tests.test_client.ClientTestCase) Seishub test server not reachable.
clients.seishub test_get_paz (obspy.clients.seishub.tests.test_client.ClientTestCase) Seishub test server not reachable.
clients.seishub test_get_preview (obspy.clients.seishub.tests.test_client.ClientTestCase) Seishub test server not reachable.
clients.seishub test_get_preview_by_ids (obspy.clients.seishub.tests.test_client.ClientTestCase) Seishub test server not reachable.
clients.seishub test_get_station_ids (obspy.clients.seishub.tests.test_client.ClientTestCase) Seishub test server not reachable.
clients.seishub test_get_waveform_with_metadata (obspy.clients.seishub.tests.test_client.ClientTestCase) Seishub test server not reachable.
clients.seishub test_localcache (obspy.clients.seishub.tests.test_client.ClientTestCase) Seishub test server not reachable.
clients.seishub test_ping (obspy.clients.seishub.tests.test_client.ClientTestCase) Seishub test server not reachable.
geodetics test_gps_2_dist_azimuth_bug150 (obspy.geodetics.tests.test_util_geodetics.UtilGeodeticsTestCase) Module geographiclib is installed, not using calc_vincenty_inverse
io.wav test_rescale_on_write (obspy.io.wav.tests.test_core.CoreTestCase) needs a recent NumPy version
imaging test_script_plot (obspy.imaging.tests.test_mopad_script.MopadTestCase) Currently broken until further review.
core test_location_plot_global (obspy.core.tests.test_inventory.InventoryCartopyTestCase) cartopy not installed
core test_location_plot_local (obspy.core.tests.test_inventory.InventoryCartopyTestCase) cartopy not installed
core test_location_plot_ortho (obspy.core.tests.test_inventory.InventoryCartopyTestCase) cartopy not installed
core test_catalog_plot_global (obspy.core.tests.test_event.CatalogCartopyTestCase) Cartopy not installed or too old
core test_catalog_plot_local (obspy.core.tests.test_event.CatalogCartopyTestCase) Cartopy not installed or too old
core test_catalog_plot_ortho (obspy.core.tests.test_event.CatalogCartopyTestCase) Cartopy not installed or too old
core test_catalog_plot_ortho_longitude_wrap (obspy.core.tests.test_event.CatalogCartopyTestCase) Cartopy not installed or too old
core test_flake8 (obspy.core.tests.test_code_formatting.CodeFormattingTestCase) flake8 check disabled
core test_location_plot_global (obspy.core.tests.test_network.NetworkCartopyTestCase) cartopy not installed
core test_location_plot_local (obspy.core.tests.test_network.NetworkCartopyTestCase) cartopy not installed
core test_location_plot_ortho (obspy.core.tests.test_network.NetworkCartopyTestCase) cartopy not installed

Slowest Tests (20)

Runtime Test
20.996s test_get_networks (obspy.clients.arclink.tests.test_client.ClientTestCase)
16.080s test_plot_farfield_without_quiver_with_maps (obspy.core.tests.test_event.EventTestCase)
15.519s test_get_inventory (obspy.clients.arclink.tests.test_client.ClientTestCase)
13.182s test_get_waveform_instrument_change (obspy.clients.arclink.tests.test_client.ClientTestCase)
10.784s test_kennet_ak135_ttime_tables_s_shallow (obspy.taup.tests.test_tau.TauPyModelTestCase)
10.639s test_kennet_ak135_ttime_tables_p_shallow (obspy.taup.tests.test_tau.TauPyModelTestCase)
9.794s test_dataselect_bulk (obspy.clients.fdsn.tests.test_client.ClientTestCase)
9.660s test_redirection_auth (obspy.clients.fdsn.tests.test_client.ClientTestCase)
9.560s test_kennet_ak135_ttime_tables_p_deep (obspy.taup.tests.test_tau.TauPyModelTestCase)
9.545s test_remove_response_plot (obspy.core.tests.test_trace.TraceTestCase)
8.848s test_redirection (obspy.clients.fdsn.tests.test_client.ClientTestCase)
8.265s test_get_routing (obspy.clients.arclink.tests.test_client.ClientTestCase)
7.937s test_get_waveform_with_metadata (obspy.clients.arclink.tests.test_client.ClientTestCase)
7.751s test_kennet_ak135_ttime_tables_s_deep (obspy.taup.tests.test_tau.TauPyModelTestCase)
7.712s test_delayed_request (obspy.clients.arclink.tests.test_client.ClientTestCase)
7.459s test_evalresp (obspy.clients.iris.tests.test_client.ClientTestCase)
7.237s test_plot_colored_section (obspy.imaging.tests.test_waveform.WaveformTestCase)
7.166s test_get_inventory_twice (obspy.clients.arclink.tests.test_client.ClientTestCase)
7.056s test_plot_default_section (obspy.imaging.tests.test_waveform.WaveformTestCase)
6.794s test_plot_horizontal_section (obspy.imaging.tests.test_waveform.WaveformTestCase)

Chuck Norris Fact

Chuck Norris's log statements are always at the FATAL level.