#95199 Report by node docker-deb-debian_8_jessie_32bit covering 1799 tests from 52 modules resulted into 3 errors

Report

ObsPy Version
1.0.3.post0+1220.g6b4902c26...
Continuous Integration
-
GitHub Pull Request
-
Report File
XML Document
Total Runtime
515.0 sec
Report Date/Time
2018-05-07 13:59:19

System / Python

Architecture
32bit
Machine
x86_64
Node
docker-deb-debian_8_jessie_32bit
Processor
None
Python Compiler
GCC 4.9.2
Python Implementation
CPython
Python Version
2.7.9
Release
4.4.0-119-generic
System
Linux
Version
#143-Ubuntu SMP Mon Apr 2 16:08:24 UTC 2018

Dependencies

cartopy
---
decorator
3.4.0
flake8
---
future
0.16.0
geographiclib
???
lxml.etree
3.4.0
m2crypto
---
matplotlib
1.4.2
mock
1.0.1
mpl_toolkits.basemap
1.0.7
numpy
1.8.2
osgeo.gdal
---
pep8-naming
---
pyflakes
0.8.1
pyimgur
0.5.3
pyproj
1.8.9
requests
2.4.3
scipy
0.14.0
setuptools
5.5.1
sqlalchemy
0.9.8

Modules (52)

Module Errors /
Failures
Tracebacks
obspy.clients.arclink 1 1
obspy.clients.earthworm - -
obspy.clients.fdsn - -
obspy.clients.filesystem - -
obspy.clients.iris 2 2 3
obspy.clients.neic - -
obspy.clients.seedlink - -
obspy.clients.seishub - -
obspy.clients.syngine - -
obspy.core - -
obspy.db - -
obspy.geodetics - -
obspy.imaging - -
obspy.io.ah - -
obspy.io.arclink - -
obspy.io.ascii - -
obspy.io.cmtsolution - -
obspy.io.cnv - -
obspy.io.css - -
obspy.io.gcf - -
obspy.io.gse2 - -
obspy.io.json - -
obspy.io.kinemetrics - -
obspy.io.kml - -
obspy.io.mseed - -
obspy.io.ndk - -
obspy.io.nied - -
obspy.io.nlloc - -
obspy.io.nordic - -
obspy.io.pdas - -
obspy.io.pde - -
obspy.io.quakeml - -
obspy.io.reftek - -
obspy.io.sac - -
obspy.io.scardec - -
obspy.io.seg2 - -
obspy.io.segy - -
obspy.io.seisan - -
obspy.io.seiscomp - -
obspy.io.sh - -
obspy.io.shapefile - -
obspy.io.stationtxt - -
obspy.io.stationxml - -
obspy.io.wav - -
obspy.io.win - -
obspy.io.xseed - -
obspy.io.y - -
obspy.io.zmap - -
obspy.realtime - -
obspy.scripts - -
obspy.signal - -
obspy.taup - -
Summary 3 3

Tracebacks (3)

Traceback (most recent call last):
File "/usr/lib/python2.7/dist-packages/obspy/clients/arclink/tests/test_client.py", line 277, in test_get_waveform_with_metadata
self.assertEqual(st[0].stats, results)
AssertionError: Stats({u'processing': [u'ObsPy 1.0.3.post0+1220.g6b4902c262.dirty: trim(endtime=UTCDateTime(2010, 8, 1, 12, 1)::fill_value=None::nearest_sample=True::pad=False::starttime=UTCDateTime(2010, 8, 1, 12, 0))'], u'network': u'BW', '_format': 'MSEED', u'paz': AttribDict({u'normalization_factor': 60077000.0, u'name': 'RJOB.2007.351.HZ', u'sensitivity': 2516800000.0, u'normalization_frequency': 1.0, u'sensor_manufacturer': 'Streckeisen', u'sensitivity_unit': 'M/S', u'sensitivity_frequency': 0.02, u'zeros': [0j, 0j], u'gain': 60077000.0, u'poles': [(-0.037004+0.037016j), (-0.037004-0.037016j), (-251.33+0j), (-131.04-467.29j), (-131.04+467.29j)], u'sensor_model': 'STS-2', u'response_type': 'A'}), u'mseed': AttribDict({u'record_length': 512, u'encoding': u'STEIM1', 'filesize': 30720, u'dataquality': u'D', u'number_of_records': 4L, u'byteorder': u'>'}), u'coordinates': AttribDict({u'latitude': 47.737167, u'elevation': 860.0, u'longitude': 12.795714}), u'sampling_rate': 200.0, u'station': u'RJOB', u'location': u'', u'starttime': UTCDateTime(2010, 8, 1, 12, 0), u'delta': 0.005, u'calib': 1.0, u'npts': 1370, u'endtime': UTCDateTime(2010, 8, 1, 12, 0, 6, 845000), u'channel': u'EHZ'}) != {u'processing': [u'ObsPy 1.0.3.post0+1220.g6b4902c262.dirty: trim(endtime=UTCDateTime(2010, 8, 1, 12, 1)::fill_value=None::nearest_sample=True::pad=False::starttime=UTCDateTime(2010, 8, 1, 12, 0))'], u'mseed': AttribDict({u'record_length': 512, u'encoding': u'STEIM1', u'filesize': 30720, u'dataquality': u'D', u'number_of_records': 60, u'byteorder': u'>'}), u'delta': 0.005, u'endtime': UTCDateTime(2010, 8, 1, 12, 0, 6, 845000), u'network': u'BW', u'_format': u'MSEED', u'paz': AttribDict({u'sensitivity_frequency': 0.02, u'name': u'RJOB.2007.351.HZ', u'sensitivity': 2516800000.0, u'normalization_frequency': 1.0, u'sensor_manufacturer': u'Streckeisen', u'sensitivity_unit': u'M/S', u'normalization_factor': 60077000.0, u'poles': [(-0.037004+0.037016j), (-0.037004-0.037016j), (-251.33+0j), (-131.04-467.29j), (-131.04+467.29j)], u'gain': 60077000.0, u'zeros': [0j, 0j], u'sensor_model': u'STS-2', u'response_type': u'A'}), u'coordinates': AttribDict({u'latitude': 47.737167, u'elevation': 860.0, u'longitude': 12.795714}), u'station': u'RJOB', u'location': u'', u'starttime': UTCDateTime(2010, 8, 1, 12, 0), u'npts': 1370, u'calib': 1.0, u'sampling_rate': 200.0, u'channel': u'EHZ'}
Traceback (most recent call last):
File "/usr/lib/python2.7/dist-packages/obspy/clients/iris/tests/test_client.py", line 256, in test_timeseries
filter=["correct"])
File "/usr/lib/python2.7/dist-packages/obspy/clients/iris/client.py", line 344, in timeseries
raise Exception(msg)
Exception: No waveform data available (HTTPError: HTTP Error 400: Bad Request)
Traceback (most recent call last):
File "/usr/lib/python2.7/doctest.py", line 2226, in runTest
raise self.failureException(self.format_failure(new.getvalue()))
AssertionError: Failed doctest test for obspy.clients.iris.client.Client.timeseries
File "/usr/lib/python2.7/dist-packages/obspy/clients/iris/client.py", line 177, in timeseries
----------------------------------------------------------------------
File "/usr/lib/python2.7/dist-packages/obspy/clients/iris/client.py", line 318, in obspy.clients.iris.client.Client.timeseries
Failed example:
st = client.timeseries("IU", "ANMO", "00", "BHZ", dt, dt+10,
filter=["correct", "demean", "lp=2.0"])
Exception raised:
Traceback (most recent call last):
File "/usr/lib/python2.7/doctest.py", line 1315, in __run
compileflags, 1) in test.globs
File "<doctest obspy.clients.iris.client.Client.timeseries[6]>", line 2, in <module>
filter=["correct", "demean", "lp=2.0"])
File "/usr/lib/python2.7/dist-packages/obspy/clients/iris/client.py", line 344, in timeseries
raise Exception(msg)
Exception: No waveform data available (HTTPError: HTTP Error 400: Bad Request)
----------------------------------------------------------------------
File "/usr/lib/python2.7/dist-packages/obspy/clients/iris/client.py", line 320, in obspy.clients.iris.client.Client.timeseries
Failed example:
print(st[0].data) # doctest: +ELLIPSIS
Expected:
[ -1.57488682e-06 -1.26318002e-06 -7.84807128e-07 ...
Got:
[ 24 20 19 19 19 15 10 4 -4 -11 -19 -26 -35 -48 -60
-72 -83 -95 -109 -121 -133 -147 -162 -179 -195 -208 -221 -238 -256 -272
-285 -301 -314 -324 -333 -341 -350 -358 -365 -370 -376 -378 -378 -380 -381
-381 -378 -376 -374 -370 -364 -359 -356 -352 -345 -337 -331 -328 -323 -316
-310 -305 -301 -295 -290 -289 -283 -275 -271 -269 -267 -263 -258 -257 -253
-248 -243 -240 -239 -237 -233 -229 -224 -218 -211 -208 -205 -202 -200 -195
-191 -185 -181 -180 -179 -177 -177 -177 -176 -176 -179 -183 -185 -187 -189
-192 -198 -204 -210 -216 -220 -227 -235 -241 -247 -253 -262 -270 -277 -284
-294 -304 -313 -323 -332 -340 -345 -350 -355 -358 -361 -364 -369 -372 -371
-372 -374 -373 -368 -364 -362 -357 -349 -344 -338 -331 -320 -311 -302 -291
-280 -268 -255 -243 -231 -218 -203 -187 -173 -160 -147 -132 -119 -108 -97
-86 -73 -62 -54 -48 -42 -37 -33 -29 -27 -27 -25 -26 -27 -29
-31 -30 -31 -36 -40 -44 -52 -59 -68 -77 -83 -89 -95 -101 -108
-116 -123 -130 -141 -150]

Skipped Tests (39)

Submodule Test Skip Message
geodetics test_gps_2_dist_azimuth_bug150 (obspy.geodetics.tests.test_util_geodetics.UtilGeodeticsTestCase) Module geographiclib is installed, not using calc_vincenty_inverse
clients.arclink test_pycrypto (obspy.clients.arclink.tests.test_decrypt.ClientTestCase) PyCrypto is not installed
clients.seishub runTest (doctest.DocTestCase) Seishub test server not reachable.
clients.seishub runTest (doctest.DocTestCase) Seishub test server not reachable.
clients.seishub runTest (doctest.DocTestCase) Seishub test server not reachable.
clients.seishub runTest (doctest.DocTestCase) Seishub test server not reachable.
clients.seishub test_get_channel_ids (obspy.clients.seishub.tests.test_client.ClientTestCase) Seishub test server not reachable.
clients.seishub test_get_coordinates (obspy.clients.seishub.tests.test_client.ClientTestCase) Seishub test server not reachable.
clients.seishub test_get_event_list (obspy.clients.seishub.tests.test_client.ClientTestCase) Seishub test server not reachable.
clients.seishub test_get_location_ids (obspy.clients.seishub.tests.test_client.ClientTestCase) Seishub test server not reachable.
clients.seishub test_get_network_ids (obspy.clients.seishub.tests.test_client.ClientTestCase) Seishub test server not reachable.
clients.seishub test_get_paz (obspy.clients.seishub.tests.test_client.ClientTestCase) Seishub test server not reachable.
clients.seishub test_get_preview (obspy.clients.seishub.tests.test_client.ClientTestCase) Seishub test server not reachable.
clients.seishub test_get_preview_by_ids (obspy.clients.seishub.tests.test_client.ClientTestCase) Seishub test server not reachable.
clients.seishub test_get_station_ids (obspy.clients.seishub.tests.test_client.ClientTestCase) Seishub test server not reachable.
clients.seishub test_get_waveform_with_metadata (obspy.clients.seishub.tests.test_client.ClientTestCase) Seishub test server not reachable.
clients.seishub test_get_waveforms (obspy.clients.seishub.tests.test_client.ClientTestCase) Seishub test server not reachable.
clients.seishub test_localcache (obspy.clients.seishub.tests.test_client.ClientTestCase) Seishub test server not reachable.
clients.seishub test_ping (obspy.clients.seishub.tests.test_client.ClientTestCase) Seishub test server not reachable.
core test_location_plot_global (obspy.core.tests.test_inventory.InventoryCartopyTestCase) cartopy not installed
core test_location_plot_local (obspy.core.tests.test_inventory.InventoryCartopyTestCase) cartopy not installed
core test_location_plot_ortho (obspy.core.tests.test_inventory.InventoryCartopyTestCase) cartopy not installed
core test_catalog_plot_global (obspy.core.tests.test_event.CatalogCartopyTestCase) Cartopy not installed or too old
core test_catalog_plot_local (obspy.core.tests.test_event.CatalogCartopyTestCase) Cartopy not installed or too old
core test_catalog_plot_ortho (obspy.core.tests.test_event.CatalogCartopyTestCase) Cartopy not installed or too old
core test_catalog_plot_ortho_longitude_wrap (obspy.core.tests.test_event.CatalogCartopyTestCase) Cartopy not installed or too old
core test_flake8 (obspy.core.tests.test_code_formatting.CodeFormattingTestCase) Formatting tests require at least flake8 3.0.
core test_location_plot_global (obspy.core.tests.test_network.NetworkCartopyTestCase) cartopy not installed
core test_location_plot_local (obspy.core.tests.test_network.NetworkCartopyTestCase) cartopy not installed
core test_location_plot_ortho (obspy.core.tests.test_network.NetworkCartopyTestCase) cartopy not installed
io.shapefile test_write_catalog_shapefile (obspy.io.shapefile.tests.test_core.ShapefileTestCase) gdal not installed or version is too old
io.shapefile test_write_catalog_shapefile_via_plugin (obspy.io.shapefile.tests.test_core.ShapefileTestCase) gdal not installed or version is too old
io.shapefile test_write_inventory_shapefile (obspy.io.shapefile.tests.test_core.ShapefileTestCase) gdal not installed or version is too old
io.shapefile test_write_inventory_shapefile_via_plugin (obspy.io.shapefile.tests.test_core.ShapefileTestCase) gdal not installed or version is too old
imaging test_script_plot (obspy.imaging.tests.test_mopad_script.MopadTestCase) Currently broken until further review.
clients.seedlink test_info (obspy.clients.seedlink.tests.test_slclient.SLClientTestCase) test must be started manually
clients.seedlink test_issue708 (obspy.clients.seedlink.tests.test_slclient.SLClientTestCase) test must be started manually
clients.seedlink test_time_window (obspy.clients.seedlink.tests.test_slclient.SLClientTestCase) test must be started manually
taup test_path_geo (obspy.taup.tests.test_taup_geo.TaupGeoTestCase) Module geographiclib is not installed or too old.

Slowest Tests (20)

Runtime Test
21.524s test_get_networks (obspy.clients.arclink.tests.test_client.ClientTestCase)
16.060s test_get_inventory (obspy.clients.arclink.tests.test_client.ClientTestCase)
13.199s test_get_waveform_instrument_change (obspy.clients.arclink.tests.test_client.ClientTestCase)
11.029s test_get_waveform_nscl (obspy.clients.neic.tests.test_client.ClientTestCase)
10.757s test_dataselect_bulk (obspy.clients.fdsn.tests.test_client.ClientTestCase)
10.016s test_redirection_auth (obspy.clients.fdsn.tests.test_client.ClientTestCase)
9.298s test_plot_farfield_without_quiver_with_maps (obspy.core.tests.test_event.EventTestCase)
9.183s test_redirection (obspy.clients.fdsn.tests.test_client.ClientTestCase)
8.839s test_ppsd_restricted_stacks (obspy.signal.tests.test_spectral_estimation.PsdTestCase)
8.771s test_iris_example_queries_dataselect (obspy.clients.fdsn.tests.test_client.ClientTestCase)
8.270s test_get_routing (obspy.clients.arclink.tests.test_client.ClientTestCase)
7.672s test_evalresp (obspy.clients.iris.tests.test_client.ClientTestCase)
7.194s test_get_inventory_twice (obspy.clients.arclink.tests.test_client.ClientTestCase)
6.344s test_delayed_request (obspy.clients.arclink.tests.test_client.ClientTestCase)
6.095s test_issue_372 (obspy.clients.arclink.tests.test_client.ClientTestCase)
6.054s test_issue_311 (obspy.clients.arclink.tests.test_client.ClientTestCase)
5.527s test_save_waveform_no_compression (obspy.clients.arclink.tests.test_client.ClientTestCase)
5.522s __init__ (obspy.clients.fdsn.client.Client)
5.487s test_get_waveform_with_dcid_key_file (obspy.clients.arclink.tests.test_decrypt.ClientTestCase)
5.052s get_waveforms (obspy.clients.fdsn.client.Client)

Chuck Norris Fact

Chuck Norris's first program was kill -9.