#95736 Report by node docker-deb-ubuntu_14_04_trusty_32bit covering 1975 tests from 54 modules resulted into 2 errors

Report

ObsPy Version
1.1.1
Continuous Integration
-
GitHub Pull Request
-
Report File
XML Document
Total Runtime
532.3 sec
Report Date/Time
2018-05-18 20:04:49

System / Python

Architecture
32bit
Machine
x86_64
Node
docker-deb-ubuntu_14_04_trusty_32bit
Processor
x86_64
Python Compiler
GCC 4.8.2
Python Implementation
CPython
Python Version
3.4.0
Release
4.4.0-124-generic
System
Linux
Version
#148-Ubuntu SMP Wed May 2 13:00:18 UTC 2018

Dependencies

cartopy
---
decorator
3.4.0
flake8
2.1.0
future
0.16.0
geographiclib
---
lxml.etree
3.3.3
m2crypto
---
matplotlib
1.3.1
mock
1.0.1
mpl_toolkits.basemap
---
numpy
1.8.1
pep8-naming
---
pyflakes
0.8.1
pyimgur
0.5.3
pyproj
1.8.9
requests
2.2.1
scipy
0.13.3
setuptools
3.3
shapefile
???
sqlalchemy
0.8.4

Modules (54)

Module Errors /
Failures
Tracebacks
obspy.clients.arclink 1 1
obspy.clients.earthworm - -
obspy.clients.fdsn 1 2
obspy.clients.filesystem - -
obspy.clients.iris - -
obspy.clients.neic - -
obspy.clients.nrl - -
obspy.clients.seedlink - -
obspy.clients.seishub - -
obspy.clients.syngine - -
obspy.core - -
obspy.db - -
obspy.geodetics - -
obspy.imaging - -
obspy.io.ah - -
obspy.io.arclink - -
obspy.io.ascii - -
obspy.io.cmtsolution - -
obspy.io.cnv - -
obspy.io.css - -
obspy.io.gcf - -
obspy.io.gse2 - -
obspy.io.iaspei - -
obspy.io.json - -
obspy.io.kinemetrics - -
obspy.io.kml - -
obspy.io.mseed - -
obspy.io.ndk - -
obspy.io.nied - -
obspy.io.nlloc - -
obspy.io.nordic - -
obspy.io.pdas - -
obspy.io.pde - -
obspy.io.quakeml - -
obspy.io.reftek - -
obspy.io.sac - -
obspy.io.scardec - -
obspy.io.seg2 - -
obspy.io.segy - -
obspy.io.seisan - -
obspy.io.seiscomp - -
obspy.io.sh - -
obspy.io.shapefile - -
obspy.io.stationtxt - -
obspy.io.stationxml - -
obspy.io.wav - -
obspy.io.win - -
obspy.io.xseed - -
obspy.io.y - -
obspy.io.zmap - -
obspy.realtime - -
obspy.scripts - -
obspy.signal - -
obspy.taup - -
Summary 2 2

Tracebacks (2)

Traceback (most recent call last):
File "/usr/lib/python3/dist-packages/obspy/clients/arclink/tests/test_client.py", line 773, in test_get_waveform_instrument_change
metadata=True)
File "/usr/lib/python3/dist-packages/obspy/clients/arclink/client.py", line 458, in get_waveforms
instruments=True, route=route)
File "/usr/lib/python3/dist-packages/obspy/clients/arclink/client.py", line 1123, in get_inventory
result = self._fetch(rtype, rdata, route=route)
File "/usr/lib/python3/dist-packages/obspy/clients/arclink/client.py", line 225, in _fetch
endtime=request_data[1])
File "/usr/lib/python3/dist-packages/obspy/clients/arclink/client.py", line 622, in get_routing
result = self._fetch(rtype, rdata, route=False)
File "/usr/lib/python3/dist-packages/obspy/clients/arclink/client.py", line 219, in _fetch
return self._request(request_type, request_data)
File "/usr/lib/python3/dist-packages/obspy/clients/arclink/client.py", line 324, in _request
raise ArcLinkException("%s %s" % (err_code, msg))
obspy.clients.arclink.client.ArcLinkException: b'UNSET'
Traceback (most recent call last):
File "/usr/lib/python3/dist-packages/obspy/clients/fdsn/tests/test_federator_routing_client.py", line 328, in test_get_waveforms_integration_test
latitude=35.0, longitude=-110, maxradius=0.3)
File "<string>", line 2, in get_waveforms_bulk
File "/usr/lib/python3/dist-packages/obspy/clients/fdsn/routing/routing_client.py", line 89, in _assert_attach_response_not_in_kwargs
return f(*args, **kwargs)
File "<string>", line 2, in get_waveforms_bulk
File "/usr/lib/python3/dist-packages/obspy/clients/fdsn/routing/routing_client.py", line 82, in _assert_filename_not_in_kwargs
return f(*args, **kwargs)
File "/usr/lib/python3/dist-packages/obspy/clients/fdsn/routing/federator_routing_client.py", line 87, in get_waveforms_bulk
r = self._download(self._url + "/query", data=bulk_str)
File "/usr/lib/python3/dist-packages/obspy/clients/base.py", line 245, in _download
self._handle_requests_http_error(r)
File "/usr/lib/python3/dist-packages/obspy/clients/fdsn/routing/routing_client.py", line 303, in _handle_requests_http_error
raise_on_error(r.status_code, buf)
File "/usr/lib/python3/dist-packages/obspy/clients/fdsn/client.py", line 1728, in raise_on_error
server_info)
obspy.clients.fdsn.header.FDSNException: Service responds: Internal server error
Detailed response of server:
Internal Server Error -- Error 500: *** note, WSS warning, a possible programing error has occurred - a null error message was received, alongwith Status: Internal Server Error
Request:
http://service.iris.edu/irisws/fedcatalog/1/query
Request Submitted:
2018/05/19 01:00:19 UTC
Service version:
Service: irisws-fedcatalog version: 1.1.5

Skipped Tests (61)

Submodule Test Skip Message
core test_combined_station_event_plot (obspy.core.tests.test_inventory.InventoryBasemapTestCase) basemap not installed
core test_location_plot_global (obspy.core.tests.test_inventory.InventoryBasemapTestCase) basemap not installed
core test_location_plot_local (obspy.core.tests.test_inventory.InventoryBasemapTestCase) basemap not installed
core test_location_plot_ortho (obspy.core.tests.test_inventory.InventoryBasemapTestCase) basemap not installed
core test_location_plot_global (obspy.core.tests.test_inventory.InventoryCartopyTestCase) cartopy not installed
core test_location_plot_local (obspy.core.tests.test_inventory.InventoryCartopyTestCase) cartopy not installed
core test_location_plot_ortho (obspy.core.tests.test_inventory.InventoryCartopyTestCase) cartopy not installed
core test_catalog_plot_global (obspy.core.tests.test_event.CatalogBasemapTestCase) basemap not installed
core test_catalog_plot_local (obspy.core.tests.test_event.CatalogBasemapTestCase) basemap not installed
core test_catalog_plot_ortho (obspy.core.tests.test_event.CatalogBasemapTestCase) basemap not installed
core test_catalog_plot_ortho_longitude_wrap (obspy.core.tests.test_event.CatalogBasemapTestCase) basemap not installed
core test_catalog_plot_global (obspy.core.tests.test_event.CatalogCartopyTestCase) Cartopy not installed or too old
core test_catalog_plot_local (obspy.core.tests.test_event.CatalogCartopyTestCase) Cartopy not installed or too old
core test_catalog_plot_ortho (obspy.core.tests.test_event.CatalogCartopyTestCase) Cartopy not installed or too old
core test_catalog_plot_ortho_longitude_wrap (obspy.core.tests.test_event.CatalogCartopyTestCase) Cartopy not installed or too old
core test_plot_farfield_without_quiver_with_maps (obspy.core.tests.test_event.EventTestCase) basemap not installed
core test_flake8 (obspy.core.tests.test_code_formatting.CodeFormattingTestCase) No code formatting tests for release builds
core test_use_obspy_deprecation_warning (obspy.core.tests.test_code_formatting.CodeFormattingTestCase) No code formatting tests for release builds
core test_future_imports_in_every_file (obspy.core.tests.test_code_formatting.FutureUsageTestCase) No code formatting tests for release builds
core test_no_pyplot_import_in_any_file (obspy.core.tests.test_code_formatting.MatplotlibBackendUsageTestCase) No code formatting tests for release builds
core test_location_plot_global (obspy.core.tests.test_network.NetworkBasemapTestCase) basemap not installed
core test_location_plot_local (obspy.core.tests.test_network.NetworkBasemapTestCase) basemap not installed
core test_location_plot_ortho (obspy.core.tests.test_network.NetworkBasemapTestCase) basemap not installed
core test_location_plot_global (obspy.core.tests.test_network.NetworkCartopyTestCase) cartopy not installed
core test_location_plot_local (obspy.core.tests.test_network.NetworkCartopyTestCase) cartopy not installed
core test_location_plot_ortho (obspy.core.tests.test_network.NetworkCartopyTestCase) cartopy not installed
clients.seedlink test_info (obspy.clients.seedlink.tests.test_slclient.SLClientTestCase) test must be started manually
clients.seedlink test_issue708 (obspy.clients.seedlink.tests.test_slclient.SLClientTestCase) test must be started manually
clients.seedlink test_time_window (obspy.clients.seedlink.tests.test_slclient.SLClientTestCase) test must be started manually
clients.arclink test_cryptography (obspy.clients.arclink.tests.test_decrypt.ClientTestCase) M2Crypto, PyCrypto or cryptography is not installed
clients.arclink test_get_waveform_no_password (obspy.clients.arclink.tests.test_decrypt.ClientTestCase) M2Crypto, PyCrypto or cryptography is not installed
clients.arclink test_get_waveform_unknown_user (obspy.clients.arclink.tests.test_decrypt.ClientTestCase) M2Crypto, PyCrypto or cryptography is not installed
clients.arclink test_get_waveform_with_dcid_key (obspy.clients.arclink.tests.test_decrypt.ClientTestCase) M2Crypto, PyCrypto or cryptography is not installed
clients.arclink test_get_waveform_with_dcid_key_file (obspy.clients.arclink.tests.test_decrypt.ClientTestCase) M2Crypto, PyCrypto or cryptography is not installed
clients.arclink test_get_waveform_with_default_dcid_key_file (obspy.clients.arclink.tests.test_decrypt.ClientTestCase) M2Crypto, PyCrypto or cryptography is not installed
clients.arclink test_get_waveform_wrong_password (obspy.clients.arclink.tests.test_decrypt.ClientTestCase) M2Crypto, PyCrypto or cryptography is not installed
clients.arclink test_m2crypto (obspy.clients.arclink.tests.test_decrypt.ClientTestCase) M2Crypto, PyCrypto or cryptography is not installed
clients.arclink test_pycrypto (obspy.clients.arclink.tests.test_decrypt.ClientTestCase) M2Crypto, PyCrypto or cryptography is not installed
taup test_compute_ray_paths (obspy.taup.tests.test_ray_paths.RayPathCalculationsTestCase) test needs geographiclib >= 1.34
taup test_path_geo (obspy.taup.tests.test_taup_geo.TaupGeoTestCase) Module geographiclib is not installed or too old.
taup test_path_resampling (obspy.taup.tests.test_taup_geo.TaupGeoTestCase) Module geographiclib is not installed or too old.
taup test_p_iasp91_geo_manual (obspy.taup.tests.test_tau.TauPyModelTestCase) Module geographiclib is not installed
taup test_pierce_p_iasp91_geo (obspy.taup.tests.test_tau.TauPyModelTestCase) test needs geographiclib >= 1.34
taup test_single_path_geo_iasp91 (obspy.taup.tests.test_tau.TauPyModelTestCase) test needs geographiclib >= 1.34
geodetics test_gps_2_dist_azimuth_with_geographiclib (obspy.geodetics.tests.test_util_geodetics.UtilGeodeticsTestCase) Module geographiclib is not installed
geodetics test_issue_375 (obspy.geodetics.tests.test_util_geodetics.UtilGeodeticsTestCase) Module geographiclib is not installed
imaging test_script_plot (obspy.imaging.tests.test_mopad_script.MopadTestCase) Currently broken until further review.
imaging test_farfield_with_quiver (obspy.imaging.tests.test_source.RadPatternTestCase) matplotlib >= 1.4 needed for 3D quiver plot.
clients.seishub test_get_channel_ids (obspy.clients.seishub.tests.test_client.ClientTestCase) Seishub test server not reachable.
clients.seishub test_get_coordinates (obspy.clients.seishub.tests.test_client.ClientTestCase) Seishub test server not reachable.
clients.seishub test_get_event_list (obspy.clients.seishub.tests.test_client.ClientTestCase) Seishub test server not reachable.
clients.seishub test_get_location_ids (obspy.clients.seishub.tests.test_client.ClientTestCase) Seishub test server not reachable.
clients.seishub test_get_network_ids (obspy.clients.seishub.tests.test_client.ClientTestCase) Seishub test server not reachable.
clients.seishub test_get_paz (obspy.clients.seishub.tests.test_client.ClientTestCase) Seishub test server not reachable.
clients.seishub test_get_preview (obspy.clients.seishub.tests.test_client.ClientTestCase) Seishub test server not reachable.
clients.seishub test_get_preview_by_ids (obspy.clients.seishub.tests.test_client.ClientTestCase) Seishub test server not reachable.
clients.seishub test_get_station_ids (obspy.clients.seishub.tests.test_client.ClientTestCase) Seishub test server not reachable.
clients.seishub test_get_waveform_with_metadata (obspy.clients.seishub.tests.test_client.ClientTestCase) Seishub test server not reachable.
clients.seishub test_get_waveforms (obspy.clients.seishub.tests.test_client.ClientTestCase) Seishub test server not reachable.
clients.seishub test_localcache (obspy.clients.seishub.tests.test_client.ClientTestCase) Seishub test server not reachable.
clients.seishub test_ping (obspy.clients.seishub.tests.test_client.ClientTestCase) Seishub test server not reachable.

Slowest Tests (20)

Runtime Test
38.863s test_get_waveform_instrument_change (obspy.clients.arclink.tests.test_client.ClientTestCase)
20.676s test_get_networks (obspy.clients.arclink.tests.test_client.ClientTestCase)
12.251s test_ppsd_restricted_stacks (obspy.signal.tests.test_spectral_estimation.PsdTestCase)
10.236s test_redirection_auth (obspy.clients.fdsn.tests.test_client.ClientTestCase)
9.498s test_get_inventory (obspy.clients.arclink.tests.test_client.ClientTestCase)
9.056s test_redirection (obspy.clients.fdsn.tests.test_client.ClientTestCase)
8.989s test_dataselect_bulk (obspy.clients.fdsn.tests.test_client.ClientTestCase)
8.305s test_get_routing (obspy.clients.arclink.tests.test_client.ClientTestCase)
7.944s test_get_waveform_with_metadata (obspy.clients.arclink.tests.test_client.ClientTestCase)
7.459s test_evalresp (obspy.clients.iris.tests.test_client.ClientTestCase)
7.030s __init__ (obspy.taup)
6.638s test_get_waveform_nscl (obspy.clients.neic.tests.test_client.ClientTestCase)
6.465s test_issue_311 (obspy.clients.arclink.tests.test_client.ClientTestCase)
6.276s test_delayed_request (obspy.clients.arclink.tests.test_client.ClientTestCase)
6.247s test_response_calculation_from_seed_and_xseed (obspy.io.xseed.tests.test_core.CoreTestCase)
6.143s test_iris_example_queries_dataselect (obspy.clients.fdsn.tests.test_client.ClientTestCase)
6.114s test_get_stations (obspy.clients.arclink.tests.test_client.ClientTestCase)
5.958s test_issue_372 (obspy.clients.arclink.tests.test_client.ClientTestCase)
5.886s __init__ (obspy.clients.fdsn.client.Client)
5.533s test_save_waveform_no_compression (obspy.clients.arclink.tests.test_client.ClientTestCase)

Chuck Norris Fact

The class object inherits from Chuck Norris