#95771 Report by node travis-ci covering 1975 tests from 54 modules resulted into 2 errors

Report

ObsPy Version
1.1.1rc1
Continuous Integration
https://travis-ci.org/obspy/obspy/jobs/379680943
GitHub Pull Request
-
Report File
XML Document
Total Runtime
974.9 sec
Report Date/Time
2018-05-22 08:53:32

System / Python

Architecture
64bit
Machine
x86_64
Node
travis-ci
Processor
x86_64
Python Compiler
GCC 7.2.0
Python Implementation
CPython
Python Version
3.5.5
Release
4.14.12-041412-generic
System
Linux
Version
#201801051649 SMP Fri Jan 5 16:50:54 UTC 2018

Dependencies

cartopy
---
decorator
4.3.0
flake8
---
future
0.16.0
geographiclib
1.49
lxml.etree
4.1.1
m2crypto
---
matplotlib
2.0.2
mock
2.0.0
mpl_toolkits.basemap
1.0.7
numpy
1.13.3
pep8-naming
---
pyflakes
---
pyimgur
0.5.2
pyproj
1.9.5.1
requests
2.18.4
scipy
1.1.0
setuptools
39.1.0
shapefile
1.2.12
sqlalchemy
1.2.7

Modules (54)

Module Errors /
Failures
Tracebacks
obspy.clients.arclink 1 1
obspy.clients.earthworm - -
obspy.clients.fdsn 1 2
obspy.clients.filesystem - -
obspy.clients.iris - -
obspy.clients.neic - -
obspy.clients.nrl - -
obspy.clients.seedlink - -
obspy.clients.seishub - -
obspy.clients.syngine - -
obspy.core - -
obspy.db - -
obspy.geodetics - -
obspy.imaging - -
obspy.io.ah - -
obspy.io.arclink - -
obspy.io.ascii - -
obspy.io.cmtsolution - -
obspy.io.cnv - -
obspy.io.css - -
obspy.io.gcf - -
obspy.io.gse2 - -
obspy.io.iaspei - -
obspy.io.json - -
obspy.io.kinemetrics - -
obspy.io.kml - -
obspy.io.mseed - -
obspy.io.ndk - -
obspy.io.nied - -
obspy.io.nlloc - -
obspy.io.nordic - -
obspy.io.pdas - -
obspy.io.pde - -
obspy.io.quakeml - -
obspy.io.reftek - -
obspy.io.sac - -
obspy.io.scardec - -
obspy.io.seg2 - -
obspy.io.segy - -
obspy.io.seisan - -
obspy.io.seiscomp - -
obspy.io.sh - -
obspy.io.shapefile - -
obspy.io.stationtxt - -
obspy.io.stationxml - -
obspy.io.wav - -
obspy.io.win - -
obspy.io.xseed - -
obspy.io.y - -
obspy.io.zmap - -
obspy.realtime - -
obspy.scripts - -
obspy.signal - -
obspy.taup - -
Summary 2 2

Tracebacks (2)

Traceback (most recent call last):
File "/home/travis/miniconda/envs/test-environment/lib/python3.5/site-packages/obspy/clients/arclink/tests/test_client.py", line 270, in test_get_waveform_with_metadata
metadata=True)
File "/home/travis/miniconda/envs/test-environment/lib/python3.5/site-packages/obspy/clients/arclink/client.py", line 444, in get_waveforms
compressed=compressed, route=route)
File "/home/travis/miniconda/envs/test-environment/lib/python3.5/site-packages/obspy/clients/arclink/client.py", line 565, in save_waveforms
data = self._fetch(rtype, rdata, route=route)
File "/home/travis/miniconda/envs/test-environment/lib/python3.5/site-packages/obspy/clients/arclink/client.py", line 225, in _fetch
endtime=request_data[1])
File "/home/travis/miniconda/envs/test-environment/lib/python3.5/site-packages/obspy/clients/arclink/client.py", line 622, in get_routing
result = self._fetch(rtype, rdata, route=False)
File "/home/travis/miniconda/envs/test-environment/lib/python3.5/site-packages/obspy/clients/arclink/client.py", line 219, in _fetch
return self._request(request_type, request_data)
File "/home/travis/miniconda/envs/test-environment/lib/python3.5/site-packages/obspy/clients/arclink/client.py", line 324, in _request
raise ArcLinkException("%s %s" % (err_code, msg))
obspy.clients.arclink.client.ArcLinkException: b'UNSET'
Traceback (most recent call last):
File "/home/travis/miniconda/envs/test-environment/lib/python3.5/site-packages/obspy/clients/fdsn/tests/test_federator_routing_client.py", line 318, in test_get_waveforms_integration_test
channel="LHZ")
File "<decorator-gen-60>", line 2, in get_waveforms
File "/home/travis/miniconda/envs/test-environment/lib/python3.5/site-packages/obspy/clients/fdsn/routing/routing_client.py", line 82, in _assert_filename_not_in_kwargs
return f(*args, **kwargs)
File "<decorator-gen-59>", line 2, in get_waveforms
File "/home/travis/miniconda/envs/test-environment/lib/python3.5/site-packages/obspy/clients/fdsn/routing/routing_client.py", line 89, in _assert_attach_response_not_in_kwargs
return f(*args, **kwargs)
File "/home/travis/miniconda/envs/test-environment/lib/python3.5/site-packages/obspy/clients/fdsn/routing/routing_client.py", line 334, in get_waveforms
return self.get_waveforms_bulk([bulk], **kwargs)
File "<decorator-gen-67>", line 2, in get_waveforms_bulk
File "/home/travis/miniconda/envs/test-environment/lib/python3.5/site-packages/obspy/clients/fdsn/routing/routing_client.py", line 89, in _assert_attach_response_not_in_kwargs
return f(*args, **kwargs)
File "<decorator-gen-66>", line 2, in get_waveforms_bulk
File "/home/travis/miniconda/envs/test-environment/lib/python3.5/site-packages/obspy/clients/fdsn/routing/routing_client.py", line 82, in _assert_filename_not_in_kwargs
return f(*args, **kwargs)
File "/home/travis/miniconda/envs/test-environment/lib/python3.5/site-packages/obspy/clients/fdsn/routing/federator_routing_client.py", line 87, in get_waveforms_bulk
r = self._download(self._url + "/query", data=bulk_str)
File "/home/travis/miniconda/envs/test-environment/lib/python3.5/site-packages/obspy/clients/base.py", line 245, in _download
self._handle_requests_http_error(r)
File "/home/travis/miniconda/envs/test-environment/lib/python3.5/site-packages/obspy/clients/fdsn/routing/routing_client.py", line 303, in _handle_requests_http_error
raise_on_error(r.status_code, buf)
File "/home/travis/miniconda/envs/test-environment/lib/python3.5/site-packages/obspy/clients/fdsn/client.py", line 1728, in raise_on_error
server_info)
obspy.clients.fdsn.header.FDSNException: Service responds: Internal server error
Detailed response of server:
Internal Server Error -- Error 500: *** note, WSS warning, a possible programing error has occurred - a null error message was received, alongwith Status: Internal Server Error
Request:
http://service.iris.edu/irisws/fedcatalog/1/query
Request Submitted:
2018/05/22 13:43:52 UTC
Service version:
Service: irisws-fedcatalog version: 1.1.5

Skipped Tests (31)

Submodule Test Skip Message
imaging test_script_plot (obspy.imaging.tests.test_mopad_script.MopadTestCase) Currently broken until further review.
core test_flake8 (obspy.core.tests.test_code_formatting.CodeFormattingTestCase) Formatting tests require at least flake8 3.0.
core test_catalog_plot_global (obspy.core.tests.test_event.CatalogCartopyTestCase) Cartopy not installed or too old
core test_catalog_plot_local (obspy.core.tests.test_event.CatalogCartopyTestCase) Cartopy not installed or too old
core test_catalog_plot_ortho (obspy.core.tests.test_event.CatalogCartopyTestCase) Cartopy not installed or too old
core test_catalog_plot_ortho_longitude_wrap (obspy.core.tests.test_event.CatalogCartopyTestCase) Cartopy not installed or too old
core test_location_plot_global (obspy.core.tests.test_inventory.InventoryCartopyTestCase) cartopy not installed
core test_location_plot_local (obspy.core.tests.test_inventory.InventoryCartopyTestCase) cartopy not installed
core test_location_plot_ortho (obspy.core.tests.test_inventory.InventoryCartopyTestCase) cartopy not installed
core test_location_plot_global (obspy.core.tests.test_network.NetworkCartopyTestCase) cartopy not installed
core test_location_plot_local (obspy.core.tests.test_network.NetworkCartopyTestCase) cartopy not installed
core test_location_plot_ortho (obspy.core.tests.test_network.NetworkCartopyTestCase) cartopy not installed
clients.seedlink test_info (obspy.clients.seedlink.tests.test_slclient.SLClientTestCase) test must be started manually
clients.seedlink test_issue708 (obspy.clients.seedlink.tests.test_slclient.SLClientTestCase) test must be started manually
clients.seedlink test_time_window (obspy.clients.seedlink.tests.test_slclient.SLClientTestCase) test must be started manually
geodetics test_gps_2_dist_azimuth_bug150 (obspy.geodetics.tests.test_util_geodetics.UtilGeodeticsTestCase) Module geographiclib is installed, not using calc_vincenty_inverse
clients.seishub test_get_channel_ids (obspy.clients.seishub.tests.test_client.ClientTestCase) Seishub test server not reachable.
clients.seishub test_get_coordinates (obspy.clients.seishub.tests.test_client.ClientTestCase) Seishub test server not reachable.
clients.seishub test_get_event_list (obspy.clients.seishub.tests.test_client.ClientTestCase) Seishub test server not reachable.
clients.seishub test_get_location_ids (obspy.clients.seishub.tests.test_client.ClientTestCase) Seishub test server not reachable.
clients.seishub test_get_network_ids (obspy.clients.seishub.tests.test_client.ClientTestCase) Seishub test server not reachable.
clients.seishub test_get_paz (obspy.clients.seishub.tests.test_client.ClientTestCase) Seishub test server not reachable.
clients.seishub test_get_preview (obspy.clients.seishub.tests.test_client.ClientTestCase) Seishub test server not reachable.
clients.seishub test_get_preview_by_ids (obspy.clients.seishub.tests.test_client.ClientTestCase) Seishub test server not reachable.
clients.seishub test_get_station_ids (obspy.clients.seishub.tests.test_client.ClientTestCase) Seishub test server not reachable.
clients.seishub test_get_waveform_with_metadata (obspy.clients.seishub.tests.test_client.ClientTestCase) Seishub test server not reachable.
clients.seishub test_get_waveforms (obspy.clients.seishub.tests.test_client.ClientTestCase) Seishub test server not reachable.
clients.seishub test_localcache (obspy.clients.seishub.tests.test_client.ClientTestCase) Seishub test server not reachable.
clients.seishub test_ping (obspy.clients.seishub.tests.test_client.ClientTestCase) Seishub test server not reachable.
clients.arclink test_m2crypto (obspy.clients.arclink.tests.test_decrypt.ClientTestCase) M2Crypto is not installed
clients.arclink test_pycrypto (obspy.clients.arclink.tests.test_decrypt.ClientTestCase) PyCrypto is not installed

Slowest Tests (20)

Runtime Test
37.628s test_get_waveform_with_metadata (obspy.clients.arclink.tests.test_client.ClientTestCase)
26.936s test_get_networks (obspy.clients.arclink.tests.test_client.ClientTestCase)
26.600s test_plot_farfield_without_quiver_with_maps (obspy.core.tests.test_event.EventTestCase)
26.075s test_get_waveform_instrument_change (obspy.clients.arclink.tests.test_client.ClientTestCase)
25.608s test_response_calculation_from_seed_and_xseed (obspy.io.xseed.tests.test_core.CoreTestCase)
20.087s test_get_routing (obspy.clients.arclink.tests.test_client.ClientTestCase)
16.599s test_ppsd_restricted_stacks (obspy.signal.tests.test_spectral_estimation.PsdTestCase)
16.587s test_get_inventory (obspy.clients.arclink.tests.test_client.ClientTestCase)
15.831s test_get_stations (obspy.clients.arclink.tests.test_client.ClientTestCase)
14.338s test_get_waveform_with_dcid_key_file (obspy.clients.arclink.tests.test_decrypt.ClientTestCase)
13.263s __init__ (obspy.taup)
12.814s test_issue_311 (obspy.clients.arclink.tests.test_client.ClientTestCase)
11.980s test_save_waveform_no_compression (obspy.clients.arclink.tests.test_client.ClientTestCase)
11.800s test_plot_multiple_traces (obspy.imaging.tests.test_waveform.WaveformTestCase)
11.323s test_issue_372 (obspy.clients.arclink.tests.test_client.ClientTestCase)
10.337s test_delayed_request (obspy.clients.arclink.tests.test_client.ClientTestCase)
9.499s __init__ (obspy.clients.arclink)
9.449s test_shoot_existing_ray_param (obspy.taup.tests.test_seismic_phase.TauPySeismicPhaseTestCase)
9.267s test_save_waveform_compressed (obspy.clients.arclink.tests.test_client.ClientTestCase)
9.154s test_get_waveform (obspy.clients.arclink.tests.test_client.ClientTestCase)

Chuck Norris Fact

Chuck Norris's keyboard doesn't have a Ctrl key because nothing controls Chuck Norris.