#96760 Report by node docker-deb-ubuntu_17_10_artful covering 2039 tests from 55 modules resulted into 3 errors

Report

ObsPy Version
1.1.1rc1.post0+255.g06906f3...
Continuous Integration
-
GitHub Pull Request
-
Report File
XML Document
Total Runtime
526.0 sec
Report Date/Time
2018-06-05 10:33:26

System / Python

Architecture
64bit
Machine
x86_64
Node
docker-deb-ubuntu_17_10_artful
Processor
x86_64
Python Compiler
GCC 7.2.0
Python Implementation
CPython
Python Version
2.7.14
Release
4.4.0-124-generic
System
Linux
Version
#148-Ubuntu SMP Wed May 2 13:00:18 UTC 2018

Dependencies

cartopy
---
decorator
4.1.1
flake8
3.2.1
future
0.16.0
geographiclib
1.48
lxml.etree
4.0.0
m2crypto
---
matplotlib
2.0.0
mock
2.0.0
mpl_toolkits.basemap
1.0.7
numpy
1.12.1
pep8-naming
---
pyflakes
1.5.0
pyimgur
0.5.3
pyproj
1.9.5.1
requests
2.18.1
scipy
0.18.1
setuptools
36.2.7
shapefile
1.2.11
sqlalchemy
1.1.9

Modules (55)

Module Errors /
Failures
Tracebacks
obspy.clients.arclink 1 1
obspy.clients.earthworm - -
obspy.clients.fdsn 1 2
obspy.clients.filesystem - -
obspy.clients.iris - -
obspy.clients.neic - -
obspy.clients.nrl - -
obspy.clients.seedlink - -
obspy.clients.seishub - -
obspy.clients.syngine 1 3
obspy.core - -
obspy.db - -
obspy.geodetics - -
obspy.imaging - -
obspy.io.ah - -
obspy.io.arclink - -
obspy.io.ascii - -
obspy.io.cmtsolution - -
obspy.io.cnv - -
obspy.io.css - -
obspy.io.gcf - -
obspy.io.gse2 - -
obspy.io.iaspei - -
obspy.io.json - -
obspy.io.kinemetrics - -
obspy.io.kml - -
obspy.io.mseed - -
obspy.io.ndk - -
obspy.io.nied - -
obspy.io.nlloc - -
obspy.io.nordic - -
obspy.io.pdas - -
obspy.io.pde - -
obspy.io.quakeml - -
obspy.io.reftek - -
obspy.io.rg16 - -
obspy.io.sac - -
obspy.io.scardec - -
obspy.io.seg2 - -
obspy.io.segy - -
obspy.io.seisan - -
obspy.io.seiscomp - -
obspy.io.sh - -
obspy.io.shapefile - -
obspy.io.stationtxt - -
obspy.io.stationxml - -
obspy.io.wav - -
obspy.io.win - -
obspy.io.xseed - -
obspy.io.y - -
obspy.io.zmap - -
obspy.realtime - -
obspy.scripts - -
obspy.signal - -
obspy.taup - -
Summary 3 3

Tracebacks (3)

Traceback (most recent call last):
File "/usr/lib/python2.7/dist-packages/obspy/clients/arclink/tests/test_decrypt.py", line 81, in test_get_waveform_with_dcid_key_file
stream1 = client1.get_waveforms('GE', 'APE', '', 'BHZ', start, end)
File "/usr/lib/python2.7/dist-packages/obspy/clients/arclink/client.py", line 444, in get_waveforms
compressed=compressed, route=route)
File "/usr/lib/python2.7/dist-packages/obspy/clients/arclink/client.py", line 565, in save_waveforms
data = self._fetch(rtype, rdata, route=route)
File "/usr/lib/python2.7/dist-packages/obspy/clients/arclink/client.py", line 252, in _fetch
return self._request(request_type, request_data)
File "/usr/lib/python2.7/dist-packages/obspy/clients/arclink/client.py", line 278, in _request
self._read_ln(b'OK')
File "/usr/lib/python2.7/dist-packages/obspy/clients/arclink/client.py", line 191, in _read_ln
raise ArcLinkException(msg % (value, line.decode()))
ArcLinkException: Timeout waiting for expected OK, got 24884
Traceback (most recent call last):
File "/usr/lib/python2.7/dist-packages/obspy/clients/fdsn/tests/test_federator_routing_client.py", line 318, in test_get_waveforms_integration_test
channel="LHZ")
File "<decorator-gen-63>", line 2, in get_waveforms
File "/usr/lib/python2.7/dist-packages/obspy/clients/fdsn/routing/routing_client.py", line 82, in _assert_filename_not_in_kwargs
return f(*args, **kwargs)
File "<decorator-gen-62>", line 2, in get_waveforms
File "/usr/lib/python2.7/dist-packages/obspy/clients/fdsn/routing/routing_client.py", line 89, in _assert_attach_response_not_in_kwargs
return f(*args, **kwargs)
File "/usr/lib/python2.7/dist-packages/obspy/clients/fdsn/routing/routing_client.py", line 334, in get_waveforms
return self.get_waveforms_bulk([bulk], **kwargs)
File "<decorator-gen-70>", line 2, in get_waveforms_bulk
File "/usr/lib/python2.7/dist-packages/obspy/clients/fdsn/routing/routing_client.py", line 89, in _assert_attach_response_not_in_kwargs
return f(*args, **kwargs)
File "<decorator-gen-69>", line 2, in get_waveforms_bulk
File "/usr/lib/python2.7/dist-packages/obspy/clients/fdsn/routing/routing_client.py", line 82, in _assert_filename_not_in_kwargs
return f(*args, **kwargs)
File "/usr/lib/python2.7/dist-packages/obspy/clients/fdsn/routing/federator_routing_client.py", line 87, in get_waveforms_bulk
r = self._download(self._url + "/query", data=bulk_str)
File "/usr/lib/python2.7/dist-packages/obspy/clients/base.py", line 245, in _download
self._handle_requests_http_error(r)
File "/usr/lib/python2.7/dist-packages/obspy/clients/fdsn/routing/routing_client.py", line 303, in _handle_requests_http_error
raise_on_error(r.status_code, buf)
File "/usr/lib/python2.7/dist-packages/obspy/clients/fdsn/client.py", line 1728, in raise_on_error
server_info)
FDSNException: Service responds: Internal server error
Detailed response of server:
Internal Server Error -- Error 500: *** note, WSS warning, a possible programing error has occurred - a null error message was received, alongwith Status: Internal Server Error
Request:
http://service.iris.edu/irisws/fedcatalog/1/query
Request Submitted:
2018/06/05 15:29:16 UTC
Service version:
Service: irisws-fedcatalog version: 1.1.7
Traceback (most recent call last):
File "/usr/lib/python2.7/dist-packages/obspy/clients/syngine/tests/test_client.py", line 456, in test_reading_saczip_files
self.assertEqual(st, st_bulk)
AssertionError: <obspy.core.stream.Stream object at 0x7f8183a1bdd0> != <obspy.core.stream.Stream object at 0x7f81841aaf10>

Skipped Tests (30)

Submodule Test Skip Message
geodetics test_gps_2_dist_azimuth_bug150 (obspy.geodetics.tests.test_util_geodetics.UtilGeodeticsTestCase) Module geographiclib is installed, not using calc_vincenty_inverse
clients.arclink test_pycrypto (obspy.clients.arclink.tests.test_decrypt.ClientTestCase) PyCrypto is not installed
clients.seishub test_get_channel_ids (obspy.clients.seishub.tests.test_client.ClientTestCase) Seishub test server not reachable.
clients.seishub test_get_coordinates (obspy.clients.seishub.tests.test_client.ClientTestCase) Seishub test server not reachable.
clients.seishub test_get_event_list (obspy.clients.seishub.tests.test_client.ClientTestCase) Seishub test server not reachable.
clients.seishub test_get_location_ids (obspy.clients.seishub.tests.test_client.ClientTestCase) Seishub test server not reachable.
clients.seishub test_get_network_ids (obspy.clients.seishub.tests.test_client.ClientTestCase) Seishub test server not reachable.
clients.seishub test_get_paz (obspy.clients.seishub.tests.test_client.ClientTestCase) Seishub test server not reachable.
clients.seishub test_get_preview (obspy.clients.seishub.tests.test_client.ClientTestCase) Seishub test server not reachable.
clients.seishub test_get_preview_by_ids (obspy.clients.seishub.tests.test_client.ClientTestCase) Seishub test server not reachable.
clients.seishub test_get_station_ids (obspy.clients.seishub.tests.test_client.ClientTestCase) Seishub test server not reachable.
clients.seishub test_get_waveform_with_metadata (obspy.clients.seishub.tests.test_client.ClientTestCase) Seishub test server not reachable.
clients.seishub test_get_waveforms (obspy.clients.seishub.tests.test_client.ClientTestCase) Seishub test server not reachable.
clients.seishub test_localcache (obspy.clients.seishub.tests.test_client.ClientTestCase) Seishub test server not reachable.
clients.seishub test_ping (obspy.clients.seishub.tests.test_client.ClientTestCase) Seishub test server not reachable.
core test_location_plot_global (obspy.core.tests.test_inventory.InventoryCartopyTestCase) cartopy not installed
core test_location_plot_local (obspy.core.tests.test_inventory.InventoryCartopyTestCase) cartopy not installed
core test_location_plot_ortho (obspy.core.tests.test_inventory.InventoryCartopyTestCase) cartopy not installed
core test_catalog_plot_global (obspy.core.tests.test_event.CatalogCartopyTestCase) Cartopy not installed or too old
core test_catalog_plot_local (obspy.core.tests.test_event.CatalogCartopyTestCase) Cartopy not installed or too old
core test_catalog_plot_ortho (obspy.core.tests.test_event.CatalogCartopyTestCase) Cartopy not installed or too old
core test_catalog_plot_ortho_longitude_wrap (obspy.core.tests.test_event.CatalogCartopyTestCase) Cartopy not installed or too old
core test_flake8 (obspy.core.tests.test_code_formatting.CodeFormattingTestCase) flake8 check disabled
core test_location_plot_global (obspy.core.tests.test_network.NetworkCartopyTestCase) cartopy not installed
core test_location_plot_local (obspy.core.tests.test_network.NetworkCartopyTestCase) cartopy not installed
core test_location_plot_ortho (obspy.core.tests.test_network.NetworkCartopyTestCase) cartopy not installed
imaging test_script_plot (obspy.imaging.tests.test_mopad_script.MopadTestCase) Currently broken until further review.
clients.seedlink test_info (obspy.clients.seedlink.tests.test_slclient.SLClientTestCase) test must be started manually
clients.seedlink test_issue708 (obspy.clients.seedlink.tests.test_slclient.SLClientTestCase) test must be started manually
clients.seedlink test_time_window (obspy.clients.seedlink.tests.test_slclient.SLClientTestCase) test must be started manually

Slowest Tests (20)

Runtime Test
23.504s test_get_waveform_with_dcid_key_file (obspy.clients.arclink.tests.test_decrypt.ClientTestCase)
20.815s test_get_networks (obspy.clients.arclink.tests.test_client.ClientTestCase)
13.221s test_get_waveform_instrument_change (obspy.clients.arclink.tests.test_client.ClientTestCase)
10.132s test_redirection_auth (obspy.clients.fdsn.tests.test_client.ClientTestCase)
9.523s test_get_inventory (obspy.clients.arclink.tests.test_client.ClientTestCase)
9.140s test_redirection (obspy.clients.fdsn.tests.test_client.ClientTestCase)
8.935s test_dataselect_bulk (obspy.clients.fdsn.tests.test_client.ClientTestCase)
8.392s test_plot_farfield_without_quiver_with_maps (obspy.core.tests.test_event.EventTestCase)
8.277s test_get_routing (obspy.clients.arclink.tests.test_client.ClientTestCase)
8.061s test_response_calculation_from_seed_and_xseed (obspy.io.xseed.tests.test_core.CoreTestCase)
8.031s test_get_waveform_with_metadata (obspy.clients.arclink.tests.test_client.ClientTestCase)
7.405s test_issue_372 (obspy.clients.arclink.tests.test_client.ClientTestCase)
7.382s test_evalresp (obspy.clients.iris.tests.test_client.ClientTestCase)
7.360s test_eida_token_resolution (obspy.clients.fdsn.tests.test_client.ClientTestCase)
6.667s test_get_stations (obspy.clients.arclink.tests.test_client.ClientTestCase)
6.259s test_delayed_request (obspy.clients.arclink.tests.test_client.ClientTestCase)
5.554s test_iris_example_queries_dataselect (obspy.clients.fdsn.tests.test_client.ClientTestCase)
5.539s test_save_waveform_no_compression (obspy.clients.arclink.tests.test_client.ClientTestCase)
5.393s test_issue_311 (obspy.clients.arclink.tests.test_client.ClientTestCase)
5.364s __init__ (obspy.clients.fdsn.client.Client)

Chuck Norris Fact

When Chuck Norris break the build, you can't fix it, because there is not a single line of code left.