#96819 Report by node docker-deb-debian_9_stretch covering 1977 tests from 54 modules resulted into 2 errors

Report

ObsPy Version
1.1.1rc1.post0+8.ge8094b2e0...
Continuous Integration
-
GitHub Pull Request
-
Report File
XML Document
Total Runtime
486.9 sec
Report Date/Time
2018-06-05 17:18:08

System / Python

Architecture
64bit
Machine
x86_64
Node
docker-deb-debian_9_stretch
Processor
None
Python Compiler
GCC 6.3.0 20170118
Python Implementation
CPython
Python Version
3.5.3
Release
4.4.0-124-generic
System
Linux
Version
#148-Ubuntu SMP Wed May 2 13:00:18 UTC 2018

Dependencies

cartopy
---
decorator
4.0.11
flake8
3.2.1
future
0.15.2
geographiclib
1.46
lxml.etree
3.7.1
m2crypto
---
matplotlib
2.0.0
mock
2.0.0
mpl_toolkits.basemap
1.0.7
numpy
1.12.1
pep8-naming
---
pyflakes
1.3.0
pyimgur
0.5.3
pyproj
1.9.5.1
requests
2.12.4
scipy
0.18.1
setuptools
33.1.1
shapefile
1.2.10
sqlalchemy
1.0.15

Modules (54)

Module Errors /
Failures
Tracebacks
obspy.clients.arclink - -
obspy.clients.earthworm - -
obspy.clients.fdsn 1 1
obspy.clients.filesystem - -
obspy.clients.iris - -
obspy.clients.neic - -
obspy.clients.nrl - -
obspy.clients.seedlink - -
obspy.clients.seishub - -
obspy.clients.syngine - -
obspy.core 1 2
obspy.db - -
obspy.geodetics - -
obspy.imaging - -
obspy.io.ah - -
obspy.io.arclink - -
obspy.io.ascii - -
obspy.io.cmtsolution - -
obspy.io.cnv - -
obspy.io.css - -
obspy.io.gcf - -
obspy.io.gse2 - -
obspy.io.iaspei - -
obspy.io.json - -
obspy.io.kinemetrics - -
obspy.io.kml - -
obspy.io.mseed - -
obspy.io.ndk - -
obspy.io.nied - -
obspy.io.nlloc - -
obspy.io.nordic - -
obspy.io.pdas - -
obspy.io.pde - -
obspy.io.quakeml - -
obspy.io.reftek - -
obspy.io.sac - -
obspy.io.scardec - -
obspy.io.seg2 - -
obspy.io.segy - -
obspy.io.seisan - -
obspy.io.seiscomp - -
obspy.io.sh - -
obspy.io.shapefile - -
obspy.io.stationtxt - -
obspy.io.stationxml - -
obspy.io.wav - -
obspy.io.win - -
obspy.io.xseed - -
obspy.io.y - -
obspy.io.zmap - -
obspy.realtime - -
obspy.scripts - -
obspy.signal - -
obspy.taup - -
Summary 2 2

Tracebacks (2)

Traceback (most recent call last):
File "/usr/lib/python3/dist-packages/obspy/clients/fdsn/tests/test_federator_routing_client.py", line 318, in test_get_waveforms_integration_test
channel="LHZ")
File "<decorator-gen-60>", line 2, in get_waveforms
File "/usr/lib/python3/dist-packages/obspy/clients/fdsn/routing/routing_client.py", line 82, in _assert_filename_not_in_kwargs
return f(*args, **kwargs)
File "<decorator-gen-59>", line 2, in get_waveforms
File "/usr/lib/python3/dist-packages/obspy/clients/fdsn/routing/routing_client.py", line 89, in _assert_attach_response_not_in_kwargs
return f(*args, **kwargs)
File "/usr/lib/python3/dist-packages/obspy/clients/fdsn/routing/routing_client.py", line 334, in get_waveforms
return self.get_waveforms_bulk([bulk], **kwargs)
File "<decorator-gen-67>", line 2, in get_waveforms_bulk
File "/usr/lib/python3/dist-packages/obspy/clients/fdsn/routing/routing_client.py", line 89, in _assert_attach_response_not_in_kwargs
return f(*args, **kwargs)
File "<decorator-gen-66>", line 2, in get_waveforms_bulk
File "/usr/lib/python3/dist-packages/obspy/clients/fdsn/routing/routing_client.py", line 82, in _assert_filename_not_in_kwargs
return f(*args, **kwargs)
File "/usr/lib/python3/dist-packages/obspy/clients/fdsn/routing/federator_routing_client.py", line 87, in get_waveforms_bulk
r = self._download(self._url + "/query", data=bulk_str)
File "/usr/lib/python3/dist-packages/obspy/clients/base.py", line 245, in _download
self._handle_requests_http_error(r)
File "/usr/lib/python3/dist-packages/obspy/clients/fdsn/routing/routing_client.py", line 303, in _handle_requests_http_error
raise_on_error(r.status_code, buf)
File "/usr/lib/python3/dist-packages/obspy/clients/fdsn/client.py", line 1728, in raise_on_error
server_info)
obspy.clients.fdsn.header.FDSNException: Service responds: Internal server error
Detailed response of server:
Internal Server Error -- Error 500: *** note, WSS warning, a possible programing error has occurred - a null error message was received, alongwith Status: Internal Server Error
Request:
http://service.iris.edu/irisws/fedcatalog/1/query
Request Submitted:
2018/06/05 22:14:06 UTC
Service version:
Service: irisws-fedcatalog version: 1.1.7
Traceback (most recent call last):
File "/usr/lib/python3/dist-packages/obspy/core/tests/test_utcdatetime.py", line 1135, in test_strftime_with_years_less_than_1900
self.assertEqual(t.strftime('%Y-%m-%d'), '0998-11-09')
AssertionError: '998-11-09' != '0998-11-09'
- 998-11-09
+ 0998-11-09
? +

Skipped Tests (31)

Submodule Test Skip Message
clients.seedlink test_info (obspy.clients.seedlink.tests.test_slclient.SLClientTestCase) test must be started manually
clients.seedlink test_issue708 (obspy.clients.seedlink.tests.test_slclient.SLClientTestCase) test must be started manually
clients.seedlink test_time_window (obspy.clients.seedlink.tests.test_slclient.SLClientTestCase) test must be started manually
imaging test_script_plot (obspy.imaging.tests.test_mopad_script.MopadTestCase) Currently broken until further review.
core test_location_plot_global (obspy.core.tests.test_inventory.InventoryCartopyTestCase) cartopy not installed
core test_location_plot_local (obspy.core.tests.test_inventory.InventoryCartopyTestCase) cartopy not installed
core test_location_plot_ortho (obspy.core.tests.test_inventory.InventoryCartopyTestCase) cartopy not installed
core test_catalog_plot_global (obspy.core.tests.test_event.CatalogCartopyTestCase) Cartopy not installed or too old
core test_catalog_plot_local (obspy.core.tests.test_event.CatalogCartopyTestCase) Cartopy not installed or too old
core test_catalog_plot_ortho (obspy.core.tests.test_event.CatalogCartopyTestCase) Cartopy not installed or too old
core test_catalog_plot_ortho_longitude_wrap (obspy.core.tests.test_event.CatalogCartopyTestCase) Cartopy not installed or too old
core test_flake8 (obspy.core.tests.test_code_formatting.CodeFormattingTestCase) flake8 check disabled
core test_location_plot_global (obspy.core.tests.test_network.NetworkCartopyTestCase) cartopy not installed
core test_location_plot_local (obspy.core.tests.test_network.NetworkCartopyTestCase) cartopy not installed
core test_location_plot_ortho (obspy.core.tests.test_network.NetworkCartopyTestCase) cartopy not installed
clients.arclink test_m2crypto (obspy.clients.arclink.tests.test_decrypt.ClientTestCase) M2Crypto is not installed
clients.arclink test_pycrypto (obspy.clients.arclink.tests.test_decrypt.ClientTestCase) PyCrypto is not installed
clients.seishub test_get_channel_ids (obspy.clients.seishub.tests.test_client.ClientTestCase) Seishub test server not reachable.
clients.seishub test_get_coordinates (obspy.clients.seishub.tests.test_client.ClientTestCase) Seishub test server not reachable.
clients.seishub test_get_event_list (obspy.clients.seishub.tests.test_client.ClientTestCase) Seishub test server not reachable.
clients.seishub test_get_location_ids (obspy.clients.seishub.tests.test_client.ClientTestCase) Seishub test server not reachable.
clients.seishub test_get_network_ids (obspy.clients.seishub.tests.test_client.ClientTestCase) Seishub test server not reachable.
clients.seishub test_get_paz (obspy.clients.seishub.tests.test_client.ClientTestCase) Seishub test server not reachable.
clients.seishub test_get_preview (obspy.clients.seishub.tests.test_client.ClientTestCase) Seishub test server not reachable.
clients.seishub test_get_preview_by_ids (obspy.clients.seishub.tests.test_client.ClientTestCase) Seishub test server not reachable.
clients.seishub test_get_station_ids (obspy.clients.seishub.tests.test_client.ClientTestCase) Seishub test server not reachable.
clients.seishub test_get_waveform_with_metadata (obspy.clients.seishub.tests.test_client.ClientTestCase) Seishub test server not reachable.
clients.seishub test_get_waveforms (obspy.clients.seishub.tests.test_client.ClientTestCase) Seishub test server not reachable.
clients.seishub test_localcache (obspy.clients.seishub.tests.test_client.ClientTestCase) Seishub test server not reachable.
clients.seishub test_ping (obspy.clients.seishub.tests.test_client.ClientTestCase) Seishub test server not reachable.
geodetics test_gps_2_dist_azimuth_bug150 (obspy.geodetics.tests.test_util_geodetics.UtilGeodeticsTestCase) Module geographiclib is installed, not using calc_vincenty_inverse

Slowest Tests (20)

Runtime Test
19.769s test_get_networks (obspy.clients.arclink.tests.test_client.ClientTestCase)
12.623s test_get_waveform_instrument_change (obspy.clients.arclink.tests.test_client.ClientTestCase)
9.524s test_dataselect_bulk (obspy.clients.fdsn.tests.test_client.ClientTestCase)
9.494s test_get_inventory (obspy.clients.arclink.tests.test_client.ClientTestCase)
9.405s test_redirection_auth (obspy.clients.fdsn.tests.test_client.ClientTestCase)
9.336s test_plot_farfield_without_quiver_with_maps (obspy.core.tests.test_event.EventTestCase)
9.119s test_ppsd_restricted_stacks (obspy.signal.tests.test_spectral_estimation.PsdTestCase)
9.071s test_redirection (obspy.clients.fdsn.tests.test_client.ClientTestCase)
8.552s test_get_waveform_with_metadata (obspy.clients.arclink.tests.test_client.ClientTestCase)
8.269s test_get_routing (obspy.clients.arclink.tests.test_client.ClientTestCase)
6.785s test_get_stations (obspy.clients.arclink.tests.test_client.ClientTestCase)
6.264s test_evalresp (obspy.clients.iris.tests.test_client.ClientTestCase)
6.258s test_delayed_request (obspy.clients.arclink.tests.test_client.ClientTestCase)
6.022s test_iris_example_queries_dataselect (obspy.clients.fdsn.tests.test_client.ClientTestCase)
5.844s test_issue_372 (obspy.clients.arclink.tests.test_client.ClientTestCase)
5.532s test_save_waveform_no_compression (obspy.clients.arclink.tests.test_client.ClientTestCase)
5.526s __init__ (obspy.clients.fdsn.client.Client)
5.496s test_get_waveform_with_dcid_key_file (obspy.clients.arclink.tests.test_decrypt.ClientTestCase)
5.384s test_issue_311 (obspy.clients.arclink.tests.test_client.ClientTestCase)
5.267s test_plot_catalog_before_1900 (obspy.core.tests.test_event.CatalogBasemapTestCase)

Chuck Norris Fact

Chuck Norris doesn't use GUI, he prefers COMMAND line.