#96826 Report by node docker-deb-ubuntu_18_04_bionic covering 1977 tests from 54 modules resulted into 6 errors

Report

ObsPy Version
1.1.1rc1.post0+8.ge8094b2e0...
Continuous Integration
-
GitHub Pull Request
-
Report File
XML Document
Total Runtime
618.2 sec
Report Date/Time
2018-06-05 18:24:15

System / Python

Architecture
64bit
Machine
x86_64
Node
docker-deb-ubuntu_18_04_bionic
Processor
x86_64
Python Compiler
GCC 7.3.0
Python Implementation
CPython
Python Version
3.6.5
Release
4.4.0-124-generic
System
Linux
Version
#148-Ubuntu SMP Wed May 2 13:00:18 UTC 2018

Dependencies

cartopy
---
decorator
4.1.2
flake8
3.5.0
future
0.15.2
geographiclib
1.49
lxml.etree
4.2.1
m2crypto
---
matplotlib
2.1.1
mock
2.0.0
mpl_toolkits.basemap
1.1.0
numpy
1.13.3
pep8-naming
---
pyflakes
1.6.0
pyimgur
0.5.3
pyproj
1.9.5.1
requests
2.18.4
scipy
0.19.1
setuptools
39.0.1
shapefile
1.2.12
sqlalchemy
1.1.11

Modules (54)

Module Errors /
Failures
Tracebacks
obspy.clients.arclink 4 1 2 3 4
obspy.clients.earthworm - -
obspy.clients.fdsn 1 5
obspy.clients.filesystem - -
obspy.clients.iris - -
obspy.clients.neic - -
obspy.clients.nrl - -
obspy.clients.seedlink - -
obspy.clients.seishub - -
obspy.clients.syngine - -
obspy.core 1 6
obspy.db - -
obspy.geodetics - -
obspy.imaging - -
obspy.io.ah - -
obspy.io.arclink - -
obspy.io.ascii - -
obspy.io.cmtsolution - -
obspy.io.cnv - -
obspy.io.css - -
obspy.io.gcf - -
obspy.io.gse2 - -
obspy.io.iaspei - -
obspy.io.json - -
obspy.io.kinemetrics - -
obspy.io.kml - -
obspy.io.mseed - -
obspy.io.ndk - -
obspy.io.nied - -
obspy.io.nlloc - -
obspy.io.nordic - -
obspy.io.pdas - -
obspy.io.pde - -
obspy.io.quakeml - -
obspy.io.reftek - -
obspy.io.sac - -
obspy.io.scardec - -
obspy.io.seg2 - -
obspy.io.segy - -
obspy.io.seisan - -
obspy.io.seiscomp - -
obspy.io.sh - -
obspy.io.shapefile - -
obspy.io.stationtxt - -
obspy.io.stationxml - -
obspy.io.wav - -
obspy.io.win - -
obspy.io.xseed - -
obspy.io.y - -
obspy.io.zmap - -
obspy.realtime - -
obspy.scripts - -
obspy.signal - -
obspy.taup - -
Summary 6 6

Tracebacks (6)

Traceback (most recent call last):
File "/usr/lib/python3/dist-packages/obspy/clients/arclink/tests/test_client.py", line 226, in test_get_inventory_stationgroup
result = client.get_inventory(network="_NFOTABOO", route=True)
File "/usr/lib/python3/dist-packages/obspy/clients/arclink/client.py", line 1121, in get_inventory
result = self._fetch(rtype, rdata, route=False)
File "/usr/lib/python3/dist-packages/obspy/clients/arclink/client.py", line 219, in _fetch
return self._request(request_type, request_data)
File "/usr/lib/python3/dist-packages/obspy/clients/arclink/client.py", line 324, in _request
raise ArcLinkException("%s %s" % (err_code, msg))
obspy.clients.arclink.client.ArcLinkException: b'UNSET'
Traceback (most recent call last):
File "/usr/lib/python3/dist-packages/obspy/clients/arclink/tests/test_client.py", line 259, in test_get_inventory_twice
client.get_inventory('BW', starttime=dt, endtime=dt + 1)
File "/usr/lib/python3/dist-packages/obspy/clients/arclink/client.py", line 1123, in get_inventory
result = self._fetch(rtype, rdata, route=route)
File "/usr/lib/python3/dist-packages/obspy/clients/arclink/client.py", line 219, in _fetch
return self._request(request_type, request_data)
File "/usr/lib/python3/dist-packages/obspy/clients/arclink/client.py", line 324, in _request
raise ArcLinkException("%s %s" % (err_code, msg))
obspy.clients.arclink.client.ArcLinkException: b'UNSET'
Traceback (most recent call last):
File "/usr/lib/python3/dist-packages/obspy/clients/arclink/tests/test_client.py", line 699, in test_issue_311
metadata=True)
File "/usr/lib/python3/dist-packages/obspy/clients/arclink/client.py", line 444, in get_waveforms
compressed=compressed, route=route)
File "/usr/lib/python3/dist-packages/obspy/clients/arclink/client.py", line 565, in save_waveforms
data = self._fetch(rtype, rdata, route=route)
File "/usr/lib/python3/dist-packages/obspy/clients/arclink/client.py", line 225, in _fetch
endtime=request_data[1])
File "/usr/lib/python3/dist-packages/obspy/clients/arclink/client.py", line 622, in get_routing
result = self._fetch(rtype, rdata, route=False)
File "/usr/lib/python3/dist-packages/obspy/clients/arclink/client.py", line 219, in _fetch
return self._request(request_type, request_data)
File "/usr/lib/python3/dist-packages/obspy/clients/arclink/client.py", line 324, in _request
raise ArcLinkException("%s %s" % (err_code, msg))
obspy.clients.arclink.client.ArcLinkException: b'UNSET'
Traceback (most recent call last):
File "/usr/lib/python3.6/doctest.py", line 2199, in runTest
raise self.failureException(self.format_failure(new.getvalue()))
AssertionError: Failed doctest test for obspy.clients.arclink.client.Client.get_metadata
File "/usr/lib/python3/dist-packages/obspy/clients/arclink/client.py", line 751, in get_metadata
----------------------------------------------------------------------
File "/usr/lib/python3/dist-packages/obspy/clients/arclink/client.py", line 777, in obspy.clients.arclink.client.Client.get_metadata
Failed example:
data = client.get_metadata('BW', 'MANZ', '', 'EHZ', t)
Exception raised:
Traceback (most recent call last):
File "/usr/lib/python3.6/doctest.py", line 1330, in __run
compileflags, 1), test.globs)
File "<doctest obspy.clients.arclink.client.Client.get_metadata[4]>", line 1, in <module>
data = client.get_metadata('BW', 'MANZ', '', 'EHZ', t)
File "/usr/lib/python3/dist-packages/obspy/clients/arclink/client.py", line 805, in get_metadata
instruments=True, route=route)
File "/usr/lib/python3/dist-packages/obspy/clients/arclink/client.py", line 1123, in get_inventory
result = self._fetch(rtype, rdata, route=route)
File "/usr/lib/python3/dist-packages/obspy/clients/arclink/client.py", line 219, in _fetch
return self._request(request_type, request_data)
File "/usr/lib/python3/dist-packages/obspy/clients/arclink/client.py", line 324, in _request
raise ArcLinkException("%s %s" % (err_code, msg))
obspy.clients.arclink.client.ArcLinkException: b'UNSET'
Traceback (most recent call last):
File "/usr/lib/python3/dist-packages/obspy/clients/fdsn/tests/test_federator_routing_client.py", line 318, in test_get_waveforms_integration_test
channel="LHZ")
File "<decorator-gen-60>", line 2, in get_waveforms
File "/usr/lib/python3/dist-packages/obspy/clients/fdsn/routing/routing_client.py", line 82, in _assert_filename_not_in_kwargs
return f(*args, **kwargs)
File "<decorator-gen-59>", line 2, in get_waveforms
File "/usr/lib/python3/dist-packages/obspy/clients/fdsn/routing/routing_client.py", line 89, in _assert_attach_response_not_in_kwargs
return f(*args, **kwargs)
File "/usr/lib/python3/dist-packages/obspy/clients/fdsn/routing/routing_client.py", line 334, in get_waveforms
return self.get_waveforms_bulk([bulk], **kwargs)
File "<decorator-gen-67>", line 2, in get_waveforms_bulk
File "/usr/lib/python3/dist-packages/obspy/clients/fdsn/routing/routing_client.py", line 89, in _assert_attach_response_not_in_kwargs
return f(*args, **kwargs)
File "<decorator-gen-66>", line 2, in get_waveforms_bulk
File "/usr/lib/python3/dist-packages/obspy/clients/fdsn/routing/routing_client.py", line 82, in _assert_filename_not_in_kwargs
return f(*args, **kwargs)
File "/usr/lib/python3/dist-packages/obspy/clients/fdsn/routing/federator_routing_client.py", line 87, in get_waveforms_bulk
r = self._download(self._url + "/query", data=bulk_str)
File "/usr/lib/python3/dist-packages/obspy/clients/base.py", line 245, in _download
self._handle_requests_http_error(r)
File "/usr/lib/python3/dist-packages/obspy/clients/fdsn/routing/routing_client.py", line 303, in _handle_requests_http_error
raise_on_error(r.status_code, buf)
File "/usr/lib/python3/dist-packages/obspy/clients/fdsn/client.py", line 1728, in raise_on_error
server_info)
obspy.clients.fdsn.header.FDSNException: Service responds: Internal server error
Detailed response of server:
Internal Server Error -- Error 500: *** note, WSS warning, a possible programing error has occurred - a null error message was received, alongwith Status: Internal Server Error
Request:
http://service.iris.edu/irisws/fedcatalog/1/query
Request Submitted:
2018/06/05 23:20:21 UTC
Service version:
Service: irisws-fedcatalog version: 1.1.7
Traceback (most recent call last):
File "/usr/lib/python3/dist-packages/obspy/core/tests/test_utcdatetime.py", line 1135, in test_strftime_with_years_less_than_1900
self.assertEqual(t.strftime('%Y-%m-%d'), '0998-11-09')
AssertionError: '998-11-09' != '0998-11-09'
- 998-11-09
+ 0998-11-09
? +

Skipped Tests (31)

Submodule Test Skip Message
clients.arclink test_m2crypto (obspy.clients.arclink.tests.test_decrypt.ClientTestCase) M2Crypto is not installed
clients.arclink test_pycrypto (obspy.clients.arclink.tests.test_decrypt.ClientTestCase) PyCrypto is not installed
clients.seedlink test_info (obspy.clients.seedlink.tests.test_slclient.SLClientTestCase) test must be started manually
clients.seedlink test_issue708 (obspy.clients.seedlink.tests.test_slclient.SLClientTestCase) test must be started manually
clients.seedlink test_time_window (obspy.clients.seedlink.tests.test_slclient.SLClientTestCase) test must be started manually
clients.seishub test_get_channel_ids (obspy.clients.seishub.tests.test_client.ClientTestCase) Seishub test server not reachable.
clients.seishub test_get_coordinates (obspy.clients.seishub.tests.test_client.ClientTestCase) Seishub test server not reachable.
clients.seishub test_get_event_list (obspy.clients.seishub.tests.test_client.ClientTestCase) Seishub test server not reachable.
clients.seishub test_get_location_ids (obspy.clients.seishub.tests.test_client.ClientTestCase) Seishub test server not reachable.
clients.seishub test_get_network_ids (obspy.clients.seishub.tests.test_client.ClientTestCase) Seishub test server not reachable.
clients.seishub test_get_paz (obspy.clients.seishub.tests.test_client.ClientTestCase) Seishub test server not reachable.
clients.seishub test_get_preview (obspy.clients.seishub.tests.test_client.ClientTestCase) Seishub test server not reachable.
clients.seishub test_get_preview_by_ids (obspy.clients.seishub.tests.test_client.ClientTestCase) Seishub test server not reachable.
clients.seishub test_get_station_ids (obspy.clients.seishub.tests.test_client.ClientTestCase) Seishub test server not reachable.
clients.seishub test_get_waveform_with_metadata (obspy.clients.seishub.tests.test_client.ClientTestCase) Seishub test server not reachable.
clients.seishub test_get_waveforms (obspy.clients.seishub.tests.test_client.ClientTestCase) Seishub test server not reachable.
clients.seishub test_localcache (obspy.clients.seishub.tests.test_client.ClientTestCase) Seishub test server not reachable.
clients.seishub test_ping (obspy.clients.seishub.tests.test_client.ClientTestCase) Seishub test server not reachable.
core test_location_plot_global (obspy.core.tests.test_inventory.InventoryCartopyTestCase) cartopy not installed
core test_location_plot_local (obspy.core.tests.test_inventory.InventoryCartopyTestCase) cartopy not installed
core test_location_plot_ortho (obspy.core.tests.test_inventory.InventoryCartopyTestCase) cartopy not installed
core test_catalog_plot_global (obspy.core.tests.test_event.CatalogCartopyTestCase) Cartopy not installed or too old
core test_catalog_plot_local (obspy.core.tests.test_event.CatalogCartopyTestCase) Cartopy not installed or too old
core test_catalog_plot_ortho (obspy.core.tests.test_event.CatalogCartopyTestCase) Cartopy not installed or too old
core test_catalog_plot_ortho_longitude_wrap (obspy.core.tests.test_event.CatalogCartopyTestCase) Cartopy not installed or too old
core test_flake8 (obspy.core.tests.test_code_formatting.CodeFormattingTestCase) flake8 check disabled
core test_location_plot_global (obspy.core.tests.test_network.NetworkCartopyTestCase) cartopy not installed
core test_location_plot_local (obspy.core.tests.test_network.NetworkCartopyTestCase) cartopy not installed
core test_location_plot_ortho (obspy.core.tests.test_network.NetworkCartopyTestCase) cartopy not installed
geodetics test_gps_2_dist_azimuth_bug150 (obspy.geodetics.tests.test_util_geodetics.UtilGeodeticsTestCase) Module geographiclib is installed, not using calc_vincenty_inverse
imaging test_script_plot (obspy.imaging.tests.test_mopad_script.MopadTestCase) Currently broken until further review.

Slowest Tests (20)

Runtime Test
30.602s test_get_stations_inconsistency (obspy.clients.arclink.tests.test_client.ClientTestCase)
30.474s test_get_inventory_twice (obspy.clients.arclink.tests.test_client.ClientTestCase)
30.435s test_issue_311 (obspy.clients.arclink.tests.test_client.ClientTestCase)
28.713s get_metadata (obspy.clients.arclink.client.Client)
28.697s test_get_inventory_stationgroup (obspy.clients.arclink.tests.test_client.ClientTestCase)
22.773s test_get_networks (obspy.clients.arclink.tests.test_client.ClientTestCase)
12.674s test_get_waveform_instrument_change (obspy.clients.arclink.tests.test_client.ClientTestCase)
10.127s test_redirection_auth (obspy.clients.fdsn.tests.test_client.ClientTestCase)
9.494s test_get_inventory (obspy.clients.arclink.tests.test_client.ClientTestCase)
9.071s test_dataselect_bulk (obspy.clients.fdsn.tests.test_client.ClientTestCase)
8.819s test_ppsd_restricted_stacks (obspy.signal.tests.test_spectral_estimation.PsdTestCase)
8.619s test_redirection (obspy.clients.fdsn.tests.test_client.ClientTestCase)
8.394s test_plot_farfield_without_quiver_with_maps (obspy.core.tests.test_event.EventTestCase)
8.303s test_get_routing (obspy.clients.arclink.tests.test_client.ClientTestCase)
7.937s test_get_waveform_with_metadata (obspy.clients.arclink.tests.test_client.ClientTestCase)
7.509s test_evalresp (obspy.clients.iris.tests.test_client.ClientTestCase)
7.094s test_get_stations (obspy.clients.arclink.tests.test_client.ClientTestCase)
6.771s __init__ (obspy.clients.fdsn.client.Client)
6.479s test_get_waveform_with_dcid_key_file (obspy.clients.arclink.tests.test_decrypt.ClientTestCase)
6.313s test_delayed_request (obspy.clients.arclink.tests.test_client.ClientTestCase)

Chuck Norris Fact

Chuck Norris burst the dot com bubble.