#99402 Report by node sphinx covering 2076 tests from 55 modules resulted into 61 errors

Report

ObsPy Version
1.1.1rc1.post0+436.g3ffa320...
Continuous Integration
-
GitHub Pull Request
-
Report File
XML Document
Total Runtime
735.4 sec
Report Date/Time
2018-11-07 12:10:49

System / Python

Architecture
32bit
Machine
i686
Node
sphinx
Processor
i686
Python Compiler
GCC 4.4.7 20120313 (Red Hat 4.4.7-1)
Python Implementation
CPython
Python Version
3.4.4
Release
2.6.32-042stab134.3
System
Linux
Version
#1 SMP Sun Oct 14 12:26:01 MSK 2018

Dependencies

cartopy
---
decorator
4.0.6
flake8
2.5.1
future
0.15.2
geographiclib
---
lxml.etree
3.3.5
m2crypto
---
matplotlib
2.0.2
mock
1.3.0
mpl_toolkits.basemap
1.0.7
numpy
1.10.4
pep8-naming
---
pyflakes
1.0.0
pyimgur
---
pyproj
1.9.4
requests
2.9.1
scipy
0.17.0
setuptools
19.6.2
shapefile
---
sqlalchemy
1.0.11

Modules (55)

Module Errors /
Failures
Tracebacks
obspy.clients.arclink - -
obspy.clients.earthworm 2 1 2
obspy.clients.fdsn 29 3 4 5 6 7 8 9 10 11 12 13 14 15 16 17 18 19 20 21 22 23 24 25 26 27 28 29 30 31
obspy.clients.filesystem - -
obspy.clients.iris 15 32 33 34 35 36 37 38 39 40 41 42 43 44 45 46
obspy.clients.neic 4 47 48 49 50
obspy.clients.nrl 1 51
obspy.clients.seedlink - -
obspy.clients.seishub - -
obspy.clients.syngine 10 52 53 54 55 56 57 58 59 60 61
obspy.core - -
obspy.db - -
obspy.geodetics - -
obspy.imaging - -
obspy.io.ah - -
obspy.io.arclink - -
obspy.io.ascii - -
obspy.io.cmtsolution - -
obspy.io.cnv - -
obspy.io.css - -
obspy.io.gcf - -
obspy.io.gse2 - -
obspy.io.iaspei - -
obspy.io.json - -
obspy.io.kinemetrics - -
obspy.io.kml - -
obspy.io.mseed - -
obspy.io.ndk - -
obspy.io.nied - -
obspy.io.nlloc - -
obspy.io.nordic - -
obspy.io.pdas - -
obspy.io.pde - -
obspy.io.quakeml - -
obspy.io.reftek - -
obspy.io.rg16 - -
obspy.io.sac - -
obspy.io.scardec - -
obspy.io.seg2 - -
obspy.io.segy - -
obspy.io.seisan - -
obspy.io.seiscomp - -
obspy.io.sh - -
obspy.io.shapefile - -
obspy.io.stationtxt - -
obspy.io.stationxml - -
obspy.io.wav - -
obspy.io.win - -
obspy.io.xseed - -
obspy.io.y - -
obspy.io.zmap - -
obspy.realtime - -
obspy.scripts - -
obspy.signal - -
obspy.taup - -
Summary 61 61

Tracebacks (61)

Traceback (most recent call last):
File "<decorator-gen-55>", line 2, in test_get_waveform
File "/private-backup/home/obspy/update-docs/src/obspy/obspy/core/util/decorator.py", line 126, in skip_on_network_error
return func(*args, **kwargs)
File "/private-backup/home/obspy/update-docs/src/obspy/obspy/clients/earthworm/tests/test_client.py", line 41, in test_get_waveform
self.assertEqual(len(stream), 1)
AssertionError: 0 != 1
Traceback (most recent call last):
File "<decorator-gen-56>", line 2, in test_save_waveform
File "/private-backup/home/obspy/update-docs/src/obspy/obspy/core/util/decorator.py", line 126, in skip_on_network_error
return func(*args, **kwargs)
File "/private-backup/home/obspy/update-docs/src/obspy/obspy/clients/earthworm/tests/test_client.py", line 97, in test_save_waveform
format="SLIST")
File "/private-backup/home/obspy/update-docs/src/obspy/obspy/clients/earthworm/client.py", line 167, in save_waveforms
st.write(filename, format=format)
File "/private-backup/home/obspy/update-docs/src/obspy/obspy/core/stream.py", line 1423, in write
raise ObsPyException(msg)
obspy.core.util.obspy_types.ObsPyException: Can not write empty stream to file.
Traceback (most recent call last):
File "/private-backup/home/obspy/update-docs/src/obspy/obspy/clients/fdsn/tests/test_client.py", line 692, in test_dataselect_bulk
got = client.get_waveforms_bulk(bulk, **params)
File "/private-backup/home/obspy/update-docs/src/obspy/obspy/clients/fdsn/client.py", line 998, in get_waveforms_bulk
raise ValueError(msg)
ValueError: The current client does not have a dataselect service.
Traceback (most recent call last):
File "/home/obspy/anaconda3/envs/tmp_build_docs/lib/python3.4/doctest.py", line 2187, in runTest
raise self.failureException(self.format_failure(new.getvalue()))
AssertionError: Failed doctest test for obspy.clients.fdsn.client.Client.get_events
File "/private-backup/home/obspy/update-docs/src/obspy/obspy/clients/fdsn/client.py", line 390, in get_events
----------------------------------------------------------------------
File "/private-backup/home/obspy/update-docs/src/obspy/obspy/clients/fdsn/client.py", line 395, in obspy.clients.fdsn.client.Client.get_events
Failed example:
cat = client.get_events(eventid=609301)
Exception raised:
Traceback (most recent call last):
File "/home/obspy/anaconda3/envs/tmp_build_docs/lib/python3.4/doctest.py", line 1318, in __run
compileflags, 1), test.globs)
File "<doctest obspy.clients.fdsn.client.Client.get_events[1]>", line 1, in <module>
cat = client.get_events(eventid=609301)
File "/private-backup/home/obspy/update-docs/src/obspy/obspy/clients/fdsn/client.py", line 506, in get_events
raise ValueError(msg)
ValueError: The current client does not have an event service.
----------------------------------------------------------------------
File "/private-backup/home/obspy/update-docs/src/obspy/obspy/clients/fdsn/client.py", line 396, in obspy.clients.fdsn.client.Client.get_events
Failed example:
print(cat)
Exception raised:
Traceback (most recent call last):
File "/home/obspy/anaconda3/envs/tmp_build_docs/lib/python3.4/doctest.py", line 1318, in __run
compileflags, 1), test.globs)
File "<doctest obspy.clients.fdsn.client.Client.get_events[2]>", line 1, in <module>
print(cat)
NameError: name 'cat' is not defined
----------------------------------------------------------------------
File "/private-backup/home/obspy/update-docs/src/obspy/obspy/clients/fdsn/client.py", line 405, in obspy.clients.fdsn.client.Client.get_events
Failed example:
cat = client.get_events(starttime=t1, endtime=t2, minmagnitude=4,
catalog="ISC")
Exception raised:
Traceback (most recent call last):
File "/home/obspy/anaconda3/envs/tmp_build_docs/lib/python3.4/doctest.py", line 1318, in __run
compileflags, 1), test.globs)
File "<doctest obspy.clients.fdsn.client.Client.get_events[5]>", line 2, in <module>
catalog="ISC")
File "/private-backup/home/obspy/update-docs/src/obspy/obspy/clients/fdsn/client.py", line 506, in get_events
raise ValueError(msg)
ValueError: The current client does not have an event service.
----------------------------------------------------------------------
File "/private-backup/home/obspy/update-docs/src/obspy/obspy/clients/fdsn/client.py", line 407, in obspy.clients.fdsn.client.Client.get_events
Failed example:
print(cat)
Exception raised:
Traceback (most recent call last):
File "/home/obspy/anaconda3/envs/tmp_build_docs/lib/python3.4/doctest.py", line 1318, in __run
compileflags, 1), test.globs)
File "<doctest obspy.clients.fdsn.client.Client.get_events[6]>", line 1, in <module>
print(cat)
NameError: name 'cat' is not defined
Traceback (most recent call last):
File "/private-backup/home/obspy/update-docs/src/obspy/obspy/clients/fdsn/tests/test_client.py", line 1088, in test_redirection
user_agent=USER_AGENT)
File "/private-backup/home/obspy/update-docs/src/obspy/obspy/clients/fdsn/client.py", line 256, in __init__
self._discover_services()
File "/private-backup/home/obspy/update-docs/src/obspy/obspy/clients/fdsn/client.py", line 1533, in _discover_services
raise FDSNException(msg)
obspy.clients.fdsn.header.FDSNException: No FDSN services could be discovered at 'http://service.iris.edu'. This could be due to a temporary service outage or an invalid FDSN service address.
Traceback (most recent call last):
File "/private-backup/home/obspy/update-docs/src/obspy/obspy/clients/fdsn/tests/test_client.py", line 985, in test_manually_deactivate_single_service
service_mappings={"event": None})
File "/private-backup/home/obspy/update-docs/src/obspy/obspy/clients/fdsn/client.py", line 256, in __init__
self._discover_services()
File "/private-backup/home/obspy/update-docs/src/obspy/obspy/clients/fdsn/client.py", line 1533, in _discover_services
raise FDSNException(msg)
obspy.clients.fdsn.header.FDSNException: No FDSN services could be discovered at 'http://service.iris.edu'. This could be due to a temporary service outage or an invalid FDSN service address.
Traceback (most recent call last):
File "/private-backup/home/obspy/update-docs/src/obspy/obspy/clients/fdsn/tests/test_client.py", line 1286, in test_eida_token_resolution
user, password = client._resolve_eida_token(token=token)
File "/private-backup/home/obspy/update-docs/src/obspy/obspy/clients/fdsn/client.py", line 374, in _resolve_eida_token
use_gzip=True, return_string=True)
File "/private-backup/home/obspy/update-docs/src/obspy/obspy/clients/fdsn/client.py", line 1383, in _download
raise_on_error(code, data)
File "/private-backup/home/obspy/update-docs/src/obspy/obspy/clients/fdsn/client.py", line 1736, in raise_on_error
(str(data.__class__.__name__), str(data))))
obspy.clients.fdsn.header.FDSNException: Unknown Error (URLError): <urlopen error [SSL: CERTIFICATE_VERIFY_FAILED] certificate verify failed (_ssl.c:600)>
Traceback (most recent call last):
File "/private-backup/home/obspy/update-docs/src/obspy/obspy/clients/fdsn/tests/test_client.py", line 370, in test_iris_event_contributors_availability
xml = lxml.etree.fromstring(response.content)
File "lxml.etree.pyx", line 3032, in lxml.etree.fromstring (src/lxml/lxml.etree.c:68121)
File "parser.pxi", line 1786, in lxml.etree._parseMemoryDocument (src/lxml/lxml.etree.c:102470)
File "parser.pxi", line 1674, in lxml.etree._parseDoc (src/lxml/lxml.etree.c:101299)
File "parser.pxi", line 1074, in lxml.etree._BaseParser._parseDoc (src/lxml/lxml.etree.c:96481)
File "parser.pxi", line 582, in lxml.etree._ParserContext._handleParseResultDoc (src/lxml/lxml.etree.c:91290)
File "parser.pxi", line 683, in lxml.etree._handleParseResult (src/lxml/lxml.etree.c:92476)
File "parser.pxi", line 622, in lxml.etree._raiseParseError (src/lxml/lxml.etree.c:91772)
File "<string>", line None
lxml.etree.XMLSyntaxError: StartTag: invalid element name, line 1, column 2
Traceback (most recent call last):
File "/home/obspy/anaconda3/envs/tmp_build_docs/lib/python3.4/doctest.py", line 2187, in runTest
raise self.failureException(self.format_failure(new.getvalue()))
AssertionError: Failed doctest test for obspy.clients.fdsn.client.Client.get_waveforms_bulk
File "/private-backup/home/obspy/update-docs/src/obspy/obspy/clients/fdsn/client.py", line 872, in get_waveforms_bulk
----------------------------------------------------------------------
File "/private-backup/home/obspy/update-docs/src/obspy/obspy/clients/fdsn/client.py", line 903, in obspy.clients.fdsn.client.Client.get_waveforms_bulk
Failed example:
st = client.get_waveforms_bulk(bulk)
Exception raised:
Traceback (most recent call last):
File "/home/obspy/anaconda3/envs/tmp_build_docs/lib/python3.4/doctest.py", line 1318, in __run
compileflags, 1), test.globs)
File "<doctest obspy.clients.fdsn.client.Client.get_waveforms_bulk[5]>", line 1, in <module>
st = client.get_waveforms_bulk(bulk)
File "/private-backup/home/obspy/update-docs/src/obspy/obspy/clients/fdsn/client.py", line 998, in get_waveforms_bulk
raise ValueError(msg)
ValueError: The current client does not have a dataselect service.
----------------------------------------------------------------------
File "/private-backup/home/obspy/update-docs/src/obspy/obspy/clients/fdsn/client.py", line 904, in obspy.clients.fdsn.client.Client.get_waveforms_bulk
Failed example:
print(st) # doctest: +ELLIPSIS
Exception raised:
Traceback (most recent call last):
File "/home/obspy/anaconda3/envs/tmp_build_docs/lib/python3.4/doctest.py", line 1318, in __run
compileflags, 1), test.globs)
File "<doctest obspy.clients.fdsn.client.Client.get_waveforms_bulk[6]>", line 1, in <module>
print(st) # doctest: +ELLIPSIS
NameError: name 'st' is not defined
----------------------------------------------------------------------
File "/private-backup/home/obspy/update-docs/src/obspy/obspy/clients/fdsn/client.py", line 916, in obspy.clients.fdsn.client.Client.get_waveforms_bulk
Failed example:
st = client.get_waveforms_bulk(bulk)
Exception raised:
Traceback (most recent call last):
File "/home/obspy/anaconda3/envs/tmp_build_docs/lib/python3.4/doctest.py", line 1318, in __run
compileflags, 1), test.globs)
File "<doctest obspy.clients.fdsn.client.Client.get_waveforms_bulk[8]>", line 1, in <module>
st = client.get_waveforms_bulk(bulk)
File "/private-backup/home/obspy/update-docs/src/obspy/obspy/clients/fdsn/client.py", line 998, in get_waveforms_bulk
raise ValueError(msg)
ValueError: The current client does not have a dataselect service.
----------------------------------------------------------------------
File "/private-backup/home/obspy/update-docs/src/obspy/obspy/clients/fdsn/client.py", line 917, in obspy.clients.fdsn.client.Client.get_waveforms_bulk
Failed example:
print(st) # doctest: +ELLIPSIS
Exception raised:
Traceback (most recent call last):
File "/home/obspy/anaconda3/envs/tmp_build_docs/lib/python3.4/doctest.py", line 1318, in __run
compileflags, 1), test.globs)
File "<doctest obspy.clients.fdsn.client.Client.get_waveforms_bulk[9]>", line 1, in <module>
print(st) # doctest: +ELLIPSIS
NameError: name 'st' is not defined
----------------------------------------------------------------------
File "/private-backup/home/obspy/update-docs/src/obspy/obspy/clients/fdsn/client.py", line 939, in obspy.clients.fdsn.client.Client.get_waveforms_bulk
Failed example:
st = client.get_waveforms_bulk(bulk, attach_response=True)
Exception raised:
Traceback (most recent call last):
File "/home/obspy/anaconda3/envs/tmp_build_docs/lib/python3.4/doctest.py", line 1318, in __run
compileflags, 1), test.globs)
File "<doctest obspy.clients.fdsn.client.Client.get_waveforms_bulk[16]>", line 1, in <module>
st = client.get_waveforms_bulk(bulk, attach_response=True)
File "/private-backup/home/obspy/update-docs/src/obspy/obspy/clients/fdsn/client.py", line 998, in get_waveforms_bulk
raise ValueError(msg)
ValueError: The current client does not have a dataselect service.
----------------------------------------------------------------------
File "/private-backup/home/obspy/update-docs/src/obspy/obspy/clients/fdsn/client.py", line 940, in obspy.clients.fdsn.client.Client.get_waveforms_bulk
Failed example:
st.remove_response(output="VEL") # doctest: +ELLIPSIS
Exception raised:
Traceback (most recent call last):
File "/home/obspy/anaconda3/envs/tmp_build_docs/lib/python3.4/doctest.py", line 1318, in __run
compileflags, 1), test.globs)
File "<doctest obspy.clients.fdsn.client.Client.get_waveforms_bulk[17]>", line 1, in <module>
st.remove_response(output="VEL") # doctest: +ELLIPSIS
NameError: name 'st' is not defined
Traceback (most recent call last):
File "/home/obspy/anaconda3/envs/tmp_build_docs/lib/python3.4/doctest.py", line 2187, in runTest
raise self.failureException(self.format_failure(new.getvalue()))
AssertionError: Failed doctest test for obspy.clients.fdsn.client.Client.get_stations_bulk
File "/private-backup/home/obspy/update-docs/src/obspy/obspy/clients/fdsn/client.py", line 1024, in get_stations_bulk
----------------------------------------------------------------------
File "/private-backup/home/obspy/update-docs/src/obspy/obspy/clients/fdsn/client.py", line 1055, in obspy.clients.fdsn.client.Client.get_stations_bulk
Failed example:
inv = client.get_stations_bulk(bulk)
Exception raised:
Traceback (most recent call last):
File "/home/obspy/anaconda3/envs/tmp_build_docs/lib/python3.4/doctest.py", line 1318, in __run
compileflags, 1), test.globs)
File "<doctest obspy.clients.fdsn.client.Client.get_stations_bulk[5]>", line 1, in <module>
inv = client.get_stations_bulk(bulk)
File "/private-backup/home/obspy/update-docs/src/obspy/obspy/clients/fdsn/client.py", line 1144, in get_stations_bulk
raise ValueError(msg)
ValueError: The current client does not have a station service.
----------------------------------------------------------------------
File "/private-backup/home/obspy/update-docs/src/obspy/obspy/clients/fdsn/client.py", line 1056, in obspy.clients.fdsn.client.Client.get_stations_bulk
Failed example:
print(inv) # doctest: +ELLIPSIS +NORMALIZE_WHITESPACE
Exception raised:
Traceback (most recent call last):
File "/home/obspy/anaconda3/envs/tmp_build_docs/lib/python3.4/doctest.py", line 1318, in __run
compileflags, 1), test.globs)
File "<doctest obspy.clients.fdsn.client.Client.get_stations_bulk[6]>", line 1, in <module>
print(inv) # doctest: +ELLIPSIS +NORMALIZE_WHITESPACE
NameError: name 'inv' is not defined
----------------------------------------------------------------------
File "/private-backup/home/obspy/update-docs/src/obspy/obspy/clients/fdsn/client.py", line 1085, in obspy.clients.fdsn.client.Client.get_stations_bulk
Failed example:
inv = client.get_stations_bulk(bulk, level="channel")
Exception raised:
Traceback (most recent call last):
File "/home/obspy/anaconda3/envs/tmp_build_docs/lib/python3.4/doctest.py", line 1318, in __run
compileflags, 1), test.globs)
File "<doctest obspy.clients.fdsn.client.Client.get_stations_bulk[8]>", line 1, in <module>
inv = client.get_stations_bulk(bulk, level="channel")
File "/private-backup/home/obspy/update-docs/src/obspy/obspy/clients/fdsn/client.py", line 1144, in get_stations_bulk
raise ValueError(msg)
ValueError: The current client does not have a station service.
----------------------------------------------------------------------
File "/private-backup/home/obspy/update-docs/src/obspy/obspy/clients/fdsn/client.py", line 1086, in obspy.clients.fdsn.client.Client.get_stations_bulk
Failed example:
print(inv) # doctest: +ELLIPSIS +NORMALIZE_WHITESPACE
Exception raised:
Traceback (most recent call last):
File "/home/obspy/anaconda3/envs/tmp_build_docs/lib/python3.4/doctest.py", line 1318, in __run
compileflags, 1), test.globs)
File "<doctest obspy.clients.fdsn.client.Client.get_stations_bulk[9]>", line 1, in <module>
print(inv) # doctest: +ELLIPSIS +NORMALIZE_WHITESPACE
NameError: name 'inv' is not defined
Traceback (most recent call last):
File "/private-backup/home/obspy/update-docs/src/obspy/obspy/clients/fdsn/tests/test_client.py", line 542, in test_iris_example_queries_dataselect
got = client.get_waveforms(*query)
File "/private-backup/home/obspy/update-docs/src/obspy/obspy/clients/fdsn/client.py", line 817, in get_waveforms
raise ValueError(msg)
ValueError: The current client does not have a dataselect service.
Traceback (most recent call last):
File "/private-backup/home/obspy/update-docs/src/obspy/obspy/clients/fdsn/tests/test_client.py", line 669, in test_str_method
self.assertEqual(got, expected, failmsg(got, expected))
AssertionError: Lists differ: ['FDS[75 chars]es: 'available_event_catalogs'", '', "Use e.g.[152 chars]es.'] != ['FDS[75 chars]es: 'dataselect' (vX.X.X) 'event' (vX.X.X) 'st[241 chars]es.']
First differing element 1:
Available Services: 'available_event_catalogs'
Available Services: 'dataselect' (vX.X.X) 'event' (vX.X.X) 'station' (vX.X.X) 'available_event_catalogs' 'available_event_contributors'
['FDSN Webservice Client (base url: http://service.iris.edu)',
- "Available Services: 'available_event_catalogs'",
+ "Available Services: 'dataselect' (vX.X.X) 'event' (vX.X.X) 'station' "
+ "(vX.X.X) 'available_event_catalogs' 'available_event_contributors'",
'',
"Use e.g. client.help('dataselect') for the",
'parameter description of the individual services',
'or client.help() for parameter description of',
'all webservices.'] :
Got:
['FDSN Webservice Client (base url: http://service.iris.edu)', "Available Services: 'available_event_catalogs'", '', "Use e.g. client.help('dataselect') for the", 'parameter description of the individual services', 'or client.help() for parameter description of', 'all webservices.']
Expected:
['FDSN Webservice Client (base url: http://service.iris.edu)', "Available Services: 'dataselect' (vX.X.X) 'event' (vX.X.X) 'station' (vX.X.X) 'available_event_catalogs' 'available_event_contributors'", '', "Use e.g. client.help('dataselect') for the", 'parameter description of the individual services', 'or client.help() for parameter description of', 'all webservices.']
Traceback (most recent call last):
File "/private-backup/home/obspy/update-docs/src/obspy/obspy/clients/fdsn/tests/test_client.py", line 409, in test_iris_example_queries_event
cat = client.get_events(eventid=609301)
File "/private-backup/home/obspy/update-docs/src/obspy/obspy/clients/fdsn/client.py", line 506, in get_events
raise ValueError(msg)
ValueError: The current client does not have an event service.
Traceback (most recent call last):
File "/private-backup/home/obspy/update-docs/src/obspy/obspy/clients/fdsn/tests/test_federator_routing_client.py", line 342, in test_get_stations_integration_test
channel="LHZ", level="station")
File "<decorator-gen-65>", line 2, in get_stations
File "/private-backup/home/obspy/update-docs/src/obspy/obspy/clients/fdsn/routing/routing_client.py", line 82, in _assert_filename_not_in_kwargs
return f(*args, **kwargs)
File "/private-backup/home/obspy/update-docs/src/obspy/obspy/clients/fdsn/routing/federator_routing_client.py", line 110, in get_stations
return super(FederatorRoutingClient, self).get_stations(**kwargs)
File "<decorator-gen-62>", line 2, in get_stations
File "/private-backup/home/obspy/update-docs/src/obspy/obspy/clients/fdsn/routing/routing_client.py", line 82, in _assert_filename_not_in_kwargs
return f(*args, **kwargs)
File "/private-backup/home/obspy/update-docs/src/obspy/obspy/clients/fdsn/routing/routing_client.py", line 367, in get_stations
return self.get_stations_bulk([bulk], **kwargs)
File "<decorator-gen-66>", line 2, in get_stations_bulk
File "/private-backup/home/obspy/update-docs/src/obspy/obspy/clients/fdsn/routing/routing_client.py", line 82, in _assert_filename_not_in_kwargs
return f(*args, **kwargs)
File "/private-backup/home/obspy/update-docs/src/obspy/obspy/clients/fdsn/routing/federator_routing_client.py", line 143, in get_stations_bulk
r = self._download(self._url + "/query", data=bulk_str)
File "/private-backup/home/obspy/update-docs/src/obspy/obspy/clients/base.py", line 245, in _download
self._handle_requests_http_error(r)
File "/private-backup/home/obspy/update-docs/src/obspy/obspy/clients/fdsn/routing/routing_client.py", line 303, in _handle_requests_http_error
raise_on_error(r.status_code, buf)
File "/private-backup/home/obspy/update-docs/src/obspy/obspy/clients/fdsn/client.py", line 1739, in raise_on_error
raise FDSNException("Unknown HTTP code: %i" % code, server_info)
obspy.clients.fdsn.header.FDSNException: Unknown HTTP code: 404
Detailed response of server:
NOT FOUND -- <!doctype html>
<html lang="en">
<head>
<title>
IRIS:
404 Page Not Found Error
</title>
<meta name="keywords" content="seismology, seismological data,
earthquakes, iris dmc" />
<meta name="description" content="IRIS is a consortium of
universities dedicated to the operation of science facilities
for the acquisition, management, and distribution of seismological
data." />
<!-- Forces IE to render in 'latest' compatible mode -->
<meta http-equiv="X-UA-Compatible" content="IE=Edge"/>
<meta charset="utf-8" />
<meta name="viewport" content="width=device-width, initial-scale=1" />
<link rel="stylesheet" media="all" type="text/css" href="/static/css/iris.css" />
<link rel="stylesheet" media="print" type="text/css" href="/static/css/print.css" />
<link rel="shortcut icon" href="/static/img/favicon.ico" />
<script type="text/javascript" src="//ajax.googleapis.com/ajax/libs/jquery/1.11.1/jquery.js"></script>
<script type="text/javascript" src="//netdna.bootstrapcdn.com/bootstrap/3.3.1/js/bootstrap.min.js"></script>
<script>
(function(i,s,o,g,r,a,m){i['GoogleAnalyticsObject']=r;i[r]=i[r]||function(){
(i[r].q=i[r].q||[]).push(arguments)},i[r].l=1*new Date();a=s.createElement(o),
m=s.getElementsByTagName(o)[0];a.async=1;a.src=g;m.parentNode.insertBefore(a,m)
})(window,document,'script','//www.google-analytics.com/analytics.js','ga');
ga('create', 'UA-1860730-1', 'iris.edu');
ga('send', 'pageview');
</script>
</head>
<body>
<div class="container">
<div class="container-inner">
<header>
<div id="header">
<div id="header-left">
<div id="logo">
<a href="http://ds.iris.edu/hq/" title="IRIS">
<img alt="IRIS" src="/static/img/layout/logos/iris_logo_shadow.png"/>
</a>
</div>
<div id="logo-name">
Incorporated Research Institutions for Seismology
</div>
</div>
<!-- #header-right -->
<div id="header-right">
<ul id="top-menu">
<li>
<a href="http://ds.iris.edu/ds/nodes/dmc/" title="IRIS DMC">DMC</a>
</li>
<li>
<a href="http://www.iris.edu/hq" title="IRIS HQ">Home</a>
</li>
</ul>
<div id="nsf-logo">
<a href="http://www.nsf.gov/" target="_blank" title="The National Science Foundation">
<img alt="The National Science Foundation" src="/static/img/layout/logos/nsf.png"/>
</a>
</div>
<!-- #nsf -->
</div>
<div class="shadow-down"></div>
</div>
<!-- #header -->
<!--Iris only meny -->
</header>
<div class="wrapper">
<div>
<ul class="breadcrumb">
<li>
<a href="/">Web Services</a>
</li>
</ul>
</div>
<div id="page">
<div id="page-content">
<div class="alert alert-block alert-info">
<h4>Maintenance Work on Wednesday 7 Nov</h4>
<small>Posted:
<time pubdate datetime="2018-11-06T11:58:28 PST">
11/06/2018 11:58 a.m.
</time>
</small>
	<p>Data Services will be performing a system upgrade on <strong>Wednesday 7 November</strong>, starting around <strong>06:30 <span class="caps">PST</span></strong>. This should have minimal impact on users, but there may be some temporary reductions in functionality throughout the day.</p>
</div>
<h1>
404 Page Not Found Error
</h1>
<div id="content">
<p>We are sorry, but the page you are requesting does not exist.</p>
<p>Please check the URL path you are requested and try again.</p>
<p>If you believe the error to be ours, please
<a href="http://www.iris.edu/hq/contact">contact</a>
us.</p>
</div>
</div>
</div>
</div>
<div id="footer">
<div class="shadow-up"></div>
<div id="footer-bottom">
<ul>
<li><span><a href="http://www.iris.edu/hq" title="IRIS"><img src="/static/img/layout/logos/URL_TXT.png" /></a></span></li>
<li><em><a href="http://www.nsf.gov/" title="The National Science Foundation" target="_blank">Sponsored by the National Science Foundation</a></em></li>
<li><a href="http://www.iris.edu/hq" title="IRIS">&copy; Copyright 2018 IRIS</a></li>
<li>1200 New York Avenue NW, Suite 400, Washington, DC 20005, 202-682-2220</li>
<li><a href="mailto:info@iris.edu">info@iris.edu</a></li>
</ul>
</div><!-- #footer-bottom -->
</div><!-- #footer -->
<div class="cachebuster" title="Click to force a refresh.">
Page built 10:01:18 | v.65d82faf
</div>
<script>
/* Cachebuster -- this is a link to the current page with a trailing query parameter, which will cause the cache to be bypassed */
$(function() {
// Cachebuster goes in the search attribute (eg. the query string)
var search = window.location.search;
// Only operate if there's no search or it's an existing cachebuster parameter
if (!search || search.match(/^\?\d+$/)) {
$('.cachebuster').click(function() {
window.location.search = '?' + (new Date()).getTime();
});
} else {
$('.cachebuster').empty();
}
});
</script>
</div>
</div><!-- #site-container -->
</body>
</html>
Traceback (most recent call last):
File "/private-backup/home/obspy/update-docs/src/obspy/obspy/clients/fdsn/tests/test_client.py", line 1161, in test_redirection_auth
user_agent=USER_AGENT, force_redirect=True)
File "/private-backup/home/obspy/update-docs/src/obspy/obspy/clients/fdsn/client.py", line 256, in __init__
self._discover_services()
File "/private-backup/home/obspy/update-docs/src/obspy/obspy/clients/fdsn/client.py", line 1533, in _discover_services
raise FDSNException(msg)
obspy.clients.fdsn.header.FDSNException: No FDSN services could be discovered at 'http://service.iris.edu'. This could be due to a temporary service outage or an invalid FDSN service address.
Traceback (most recent call last):
File "/private-backup/home/obspy/update-docs/src/obspy/obspy/clients/fdsn/tests/test_client.py", line 587, in test_conflicting_params
network="IU", net="IU")
File "/home/obspy/anaconda3/envs/tmp_build_docs/lib/python3.4/unittest/case.py", line 707, in assertRaises
return context.handle('assertRaises', callableObj, args, kwargs)
File "/home/obspy/anaconda3/envs/tmp_build_docs/lib/python3.4/unittest/case.py", line 162, in handle
callable_obj(*args, **kwargs)
File "/private-backup/home/obspy/update-docs/src/obspy/obspy/clients/fdsn/client.py", line 704, in get_stations
raise ValueError(msg)
ValueError: The current client does not have a station service.
Traceback (most recent call last):
File "/home/obspy/anaconda3/envs/tmp_build_docs/lib/python3.4/doctest.py", line 2187, in runTest
raise self.failureException(self.format_failure(new.getvalue()))
AssertionError: Failed doctest test for obspy.clients.fdsn.client.Client.get_waveforms
File "/private-backup/home/obspy/update-docs/src/obspy/obspy/clients/fdsn/client.py", line 726, in get_waveforms
----------------------------------------------------------------------
File "/private-backup/home/obspy/update-docs/src/obspy/obspy/clients/fdsn/client.py", line 733, in obspy.clients.fdsn.client.Client.get_waveforms
Failed example:
st = client.get_waveforms("IU", "ANMO", "00", "LHZ", t1, t2)
Exception raised:
Traceback (most recent call last):
File "/home/obspy/anaconda3/envs/tmp_build_docs/lib/python3.4/doctest.py", line 1318, in __run
compileflags, 1), test.globs)
File "<doctest obspy.clients.fdsn.client.Client.get_waveforms[3]>", line 1, in <module>
st = client.get_waveforms("IU", "ANMO", "00", "LHZ", t1, t2)
File "/private-backup/home/obspy/update-docs/src/obspy/obspy/clients/fdsn/client.py", line 817, in get_waveforms
raise ValueError(msg)
ValueError: The current client does not have a dataselect service.
----------------------------------------------------------------------
File "/private-backup/home/obspy/update-docs/src/obspy/obspy/clients/fdsn/client.py", line 734, in obspy.clients.fdsn.client.Client.get_waveforms
Failed example:
print(st) # doctest: +ELLIPSIS
Exception raised:
Traceback (most recent call last):
File "/home/obspy/anaconda3/envs/tmp_build_docs/lib/python3.4/doctest.py", line 1318, in __run
compileflags, 1), test.globs)
File "<doctest obspy.clients.fdsn.client.Client.get_waveforms[4]>", line 1, in <module>
print(st) # doctest: +ELLIPSIS
NameError: name 'st' is not defined
----------------------------------------------------------------------
File "/private-backup/home/obspy/update-docs/src/obspy/obspy/clients/fdsn/client.py", line 740, in obspy.clients.fdsn.client.Client.get_waveforms
Failed example:
st = client.get_waveforms("IU", "A*", "1?", "LHZ", t1, t2)
Exception raised:
Traceback (most recent call last):
File "/home/obspy/anaconda3/envs/tmp_build_docs/lib/python3.4/doctest.py", line 1318, in __run
compileflags, 1), test.globs)
File "<doctest obspy.clients.fdsn.client.Client.get_waveforms[5]>", line 1, in <module>
st = client.get_waveforms("IU", "A*", "1?", "LHZ", t1, t2)
File "/private-backup/home/obspy/update-docs/src/obspy/obspy/clients/fdsn/client.py", line 817, in get_waveforms
raise ValueError(msg)
ValueError: The current client does not have a dataselect service.
----------------------------------------------------------------------
File "/private-backup/home/obspy/update-docs/src/obspy/obspy/clients/fdsn/client.py", line 741, in obspy.clients.fdsn.client.Client.get_waveforms
Failed example:
print(st) # doctest: +ELLIPSIS
Exception raised:
Traceback (most recent call last):
File "/home/obspy/anaconda3/envs/tmp_build_docs/lib/python3.4/doctest.py", line 1318, in __run
compileflags, 1), test.globs)
File "<doctest obspy.clients.fdsn.client.Client.get_waveforms[6]>", line 1, in <module>
print(st) # doctest: +ELLIPSIS
NameError: name 'st' is not defined
----------------------------------------------------------------------
File "/private-backup/home/obspy/update-docs/src/obspy/obspy/clients/fdsn/client.py", line 752, in obspy.clients.fdsn.client.Client.get_waveforms
Failed example:
st = client.get_waveforms("TA", "E42A", "*", "BH?", t+300, t+400,
attach_response=True)
Exception raised:
Traceback (most recent call last):
File "/home/obspy/anaconda3/envs/tmp_build_docs/lib/python3.4/doctest.py", line 1318, in __run
compileflags, 1), test.globs)
File "<doctest obspy.clients.fdsn.client.Client.get_waveforms[8]>", line 2, in <module>
attach_response=True)
File "/private-backup/home/obspy/update-docs/src/obspy/obspy/clients/fdsn/client.py", line 817, in get_waveforms
raise ValueError(msg)
ValueError: The current client does not have a dataselect service.
----------------------------------------------------------------------
File "/private-backup/home/obspy/update-docs/src/obspy/obspy/clients/fdsn/client.py", line 754, in obspy.clients.fdsn.client.Client.get_waveforms
Failed example:
st.remove_response(output="VEL") # doctest: +ELLIPSIS
Exception raised:
Traceback (most recent call last):
File "/home/obspy/anaconda3/envs/tmp_build_docs/lib/python3.4/doctest.py", line 1318, in __run
compileflags, 1), test.globs)
File "<doctest obspy.clients.fdsn.client.Client.get_waveforms[9]>", line 1, in <module>
st.remove_response(output="VEL") # doctest: +ELLIPSIS
NameError: name 'st' is not defined
Traceback (most recent call last):
File "/private-backup/home/obspy/update-docs/src/obspy/obspy/clients/fdsn/tests/test_client.py", line 819, in test_get_waveform_attach_response
st = client.get_waveforms_bulk(bulk, attach_response=True)
File "/private-backup/home/obspy/update-docs/src/obspy/obspy/clients/fdsn/client.py", line 998, in get_waveforms_bulk
raise ValueError(msg)
ValueError: The current client does not have a dataselect service.
Traceback (most recent call last):
File "/private-backup/home/obspy/update-docs/src/obspy/obspy/clients/fdsn/tests/test_federator_routing_client.py", line 37, in test_get_service_version
LooseVersion(self.client.get_service_version()),
File "/private-backup/home/obspy/update-docs/src/obspy/obspy/clients/fdsn/routing/routing_client.py", line 340, in get_service_version
r = self._download(self._url + "/version")
File "/private-backup/home/obspy/update-docs/src/obspy/obspy/clients/base.py", line 245, in _download
self._handle_requests_http_error(r)
File "/private-backup/home/obspy/update-docs/src/obspy/obspy/clients/fdsn/routing/routing_client.py", line 303, in _handle_requests_http_error
raise_on_error(r.status_code, buf)
File "/private-backup/home/obspy/update-docs/src/obspy/obspy/clients/fdsn/client.py", line 1739, in raise_on_error
raise FDSNException("Unknown HTTP code: %i" % code, server_info)
obspy.clients.fdsn.header.FDSNException: Unknown HTTP code: 404
Detailed response of server:
NOT FOUND -- <!doctype html>
<html lang="en">
<head>
<title>
IRIS:
404 Page Not Found Error
</title>
<meta name="keywords" content="seismology, seismological data,
earthquakes, iris dmc" />
<meta name="description" content="IRIS is a consortium of
universities dedicated to the operation of science facilities
for the acquisition, management, and distribution of seismological
data." />
<!-- Forces IE to render in 'latest' compatible mode -->
<meta http-equiv="X-UA-Compatible" content="IE=Edge"/>
<meta charset="utf-8" />
<meta name="viewport" content="width=device-width, initial-scale=1" />
<link rel="stylesheet" media="all" type="text/css" href="/static/css/iris.css" />
<link rel="stylesheet" media="print" type="text/css" href="/static/css/print.css" />
<link rel="shortcut icon" href="/static/img/favicon.ico" />
<script type="text/javascript" src="//ajax.googleapis.com/ajax/libs/jquery/1.11.1/jquery.js"></script>
<script type="text/javascript" src="//netdna.bootstrapcdn.com/bootstrap/3.3.1/js/bootstrap.min.js"></script>
<script>
(function(i,s,o,g,r,a,m){i['GoogleAnalyticsObject']=r;i[r]=i[r]||function(){
(i[r].q=i[r].q||[]).push(arguments)},i[r].l=1*new Date();a=s.createElement(o),
m=s.getElementsByTagName(o)[0];a.async=1;a.src=g;m.parentNode.insertBefore(a,m)
})(window,document,'script','//www.google-analytics.com/analytics.js','ga');
ga('create', 'UA-1860730-1', 'iris.edu');
ga('send', 'pageview');
</script>
</head>
<body>
<div class="container">
<div class="container-inner">
<header>
<div id="header">
<div id="header-left">
<div id="logo">
<a href="http://ds.iris.edu/hq/" title="IRIS">
<img alt="IRIS" src="/static/img/layout/logos/iris_logo_shadow.png"/>
</a>
</div>
<div id="logo-name">
Incorporated Research Institutions for Seismology
</div>
</div>
<!-- #header-right -->
<div id="header-right">
<ul id="top-menu">
<li>
<a href="http://ds.iris.edu/ds/nodes/dmc/" title="IRIS DMC">DMC</a>
</li>
<li>
<a href="http://www.iris.edu/hq" title="IRIS HQ">Home</a>
</li>
</ul>
<div id="nsf-logo">
<a href="http://www.nsf.gov/" target="_blank" title="The National Science Foundation">
<img alt="The National Science Foundation" src="/static/img/layout/logos/nsf.png"/>
</a>
</div>
<!-- #nsf -->
</div>
<div class="shadow-down"></div>
</div>
<!-- #header -->
<!--Iris only meny -->
</header>
<div class="wrapper">
<div>
<ul class="breadcrumb">
<li>
<a href="/">Web Services</a>
</li>
</ul>
</div>
<div id="page">
<div id="page-content">
<div class="alert alert-block alert-info">
<h4>Maintenance Work on Wednesday 7 Nov</h4>
<small>Posted:
<time pubdate datetime="2018-11-06T11:58:28 PST">
11/06/2018 11:58 a.m.
</time>
</small>
	<p>Data Services will be performing a system upgrade on <strong>Wednesday 7 November</strong>, starting around <strong>06:30 <span class="caps">PST</span></strong>. This should have minimal impact on users, but there may be some temporary reductions in functionality throughout the day.</p>
</div>
<h1>
404 Page Not Found Error
</h1>
<div id="content">
<p>We are sorry, but the page you are requesting does not exist.</p>
<p>Please check the URL path you are requested and try again.</p>
<p>If you believe the error to be ours, please
<a href="http://www.iris.edu/hq/contact">contact</a>
us.</p>
</div>
</div>
</div>
</div>
<div id="footer">
<div class="shadow-up"></div>
<div id="footer-bottom">
<ul>
<li><span><a href="http://www.iris.edu/hq" title="IRIS"><img src="/static/img/layout/logos/URL_TXT.png" /></a></span></li>
<li><em><a href="http://www.nsf.gov/" title="The National Science Foundation" target="_blank">Sponsored by the National Science Foundation</a></em></li>
<li><a href="http://www.iris.edu/hq" title="IRIS">&copy; Copyright 2018 IRIS</a></li>
<li>1200 New York Avenue NW, Suite 400, Washington, DC 20005, 202-682-2220</li>
<li><a href="mailto:info@iris.edu">info@iris.edu</a></li>
</ul>
</div><!-- #footer-bottom -->
</div><!-- #footer -->
<div class="cachebuster" title="Click to force a refresh.">
Page built 10:01:18 | v.65d82faf
</div>
<script>
/* Cachebuster -- this is a link to the current page with a trailing query parameter, which will cause the cache to be bypassed */
$(function() {
// Cachebuster goes in the search attribute (eg. the query string)
var search = window.location.search;
// Only operate if there's no search or it's an existing cachebuster parameter
if (!search || search.match(/^\?\d+$/)) {
$('.cachebuster').click(function() {
window.location.search = '?' + (new Date()).getTime();
});
} else {
$('.cachebuster').empty();
}
});
</script>
</div>
</div><!-- #site-container -->
</body>
</html>
Traceback (most recent call last):
File "/private-backup/home/obspy/update-docs/src/obspy/obspy/clients/fdsn/tests/test_federator_routing_client.py", line 318, in test_get_waveforms_integration_test
channel="LHZ")
File "<decorator-gen-61>", line 2, in get_waveforms
File "/private-backup/home/obspy/update-docs/src/obspy/obspy/clients/fdsn/routing/routing_client.py", line 82, in _assert_filename_not_in_kwargs
return f(*args, **kwargs)
File "<decorator-gen-60>", line 2, in get_waveforms
File "/private-backup/home/obspy/update-docs/src/obspy/obspy/clients/fdsn/routing/routing_client.py", line 89, in _assert_attach_response_not_in_kwargs
return f(*args, **kwargs)
File "/private-backup/home/obspy/update-docs/src/obspy/obspy/clients/fdsn/routing/routing_client.py", line 334, in get_waveforms
return self.get_waveforms_bulk([bulk], **kwargs)
File "<decorator-gen-64>", line 2, in get_waveforms_bulk
File "/private-backup/home/obspy/update-docs/src/obspy/obspy/clients/fdsn/routing/routing_client.py", line 89, in _assert_attach_response_not_in_kwargs
return f(*args, **kwargs)
File "<decorator-gen-63>", line 2, in get_waveforms_bulk
File "/private-backup/home/obspy/update-docs/src/obspy/obspy/clients/fdsn/routing/routing_client.py", line 82, in _assert_filename_not_in_kwargs
return f(*args, **kwargs)
File "/private-backup/home/obspy/update-docs/src/obspy/obspy/clients/fdsn/routing/federator_routing_client.py", line 87, in get_waveforms_bulk
r = self._download(self._url + "/query", data=bulk_str)
File "/private-backup/home/obspy/update-docs/src/obspy/obspy/clients/base.py", line 245, in _download
self._handle_requests_http_error(r)
File "/private-backup/home/obspy/update-docs/src/obspy/obspy/clients/fdsn/routing/routing_client.py", line 303, in _handle_requests_http_error
raise_on_error(r.status_code, buf)
File "/private-backup/home/obspy/update-docs/src/obspy/obspy/clients/fdsn/client.py", line 1739, in raise_on_error
raise FDSNException("Unknown HTTP code: %i" % code, server_info)
obspy.clients.fdsn.header.FDSNException: Unknown HTTP code: 404
Detailed response of server:
NOT FOUND -- <!doctype html>
<html lang="en">
<head>
<title>
IRIS:
404 Page Not Found Error
</title>
<meta name="keywords" content="seismology, seismological data,
earthquakes, iris dmc" />
<meta name="description" content="IRIS is a consortium of
universities dedicated to the operation of science facilities
for the acquisition, management, and distribution of seismological
data." />
<!-- Forces IE to render in 'latest' compatible mode -->
<meta http-equiv="X-UA-Compatible" content="IE=Edge"/>
<meta charset="utf-8" />
<meta name="viewport" content="width=device-width, initial-scale=1" />
<link rel="stylesheet" media="all" type="text/css" href="/static/css/iris.css" />
<link rel="stylesheet" media="print" type="text/css" href="/static/css/print.css" />
<link rel="shortcut icon" href="/static/img/favicon.ico" />
<script type="text/javascript" src="//ajax.googleapis.com/ajax/libs/jquery/1.11.1/jquery.js"></script>
<script type="text/javascript" src="//netdna.bootstrapcdn.com/bootstrap/3.3.1/js/bootstrap.min.js"></script>
<script>
(function(i,s,o,g,r,a,m){i['GoogleAnalyticsObject']=r;i[r]=i[r]||function(){
(i[r].q=i[r].q||[]).push(arguments)},i[r].l=1*new Date();a=s.createElement(o),
m=s.getElementsByTagName(o)[0];a.async=1;a.src=g;m.parentNode.insertBefore(a,m)
})(window,document,'script','//www.google-analytics.com/analytics.js','ga');
ga('create', 'UA-1860730-1', 'iris.edu');
ga('send', 'pageview');
</script>
</head>
<body>
<div class="container">
<div class="container-inner">
<header>
<div id="header">
<div id="header-left">
<div id="logo">
<a href="http://ds.iris.edu/hq/" title="IRIS">
<img alt="IRIS" src="/static/img/layout/logos/iris_logo_shadow.png"/>
</a>
</div>
<div id="logo-name">
Incorporated Research Institutions for Seismology
</div>
</div>
<!-- #header-right -->
<div id="header-right">
<ul id="top-menu">
<li>
<a href="http://ds.iris.edu/ds/nodes/dmc/" title="IRIS DMC">DMC</a>
</li>
<li>
<a href="http://www.iris.edu/hq" title="IRIS HQ">Home</a>
</li>
</ul>
<div id="nsf-logo">
<a href="http://www.nsf.gov/" target="_blank" title="The National Science Foundation">
<img alt="The National Science Foundation" src="/static/img/layout/logos/nsf.png"/>
</a>
</div>
<!-- #nsf -->
</div>
<div class="shadow-down"></div>
</div>
<!-- #header -->
<!--Iris only meny -->
</header>
<div class="wrapper">
<div>
<ul class="breadcrumb">
<li>
<a href="/">Web Services</a>
</li>
</ul>
</div>
<div id="page">
<div id="page-content">
<div class="alert alert-block alert-info">
<h4>Maintenance Work on Wednesday 7 Nov</h4>
<small>Posted:
<time pubdate datetime="2018-11-06T11:58:28 PST">
11/06/2018 11:58 a.m.
</time>
</small>
	<p>Data Services will be performing a system upgrade on <strong>Wednesday 7 November</strong>, starting around <strong>06:30 <span class="caps">PST</span></strong>. This should have minimal impact on users, but there may be some temporary reductions in functionality throughout the day.</p>
</div>
<h1>
404 Page Not Found Error
</h1>
<div id="content">
<p>We are sorry, but the page you are requesting does not exist.</p>
<p>Please check the URL path you are requested and try again.</p>
<p>If you believe the error to be ours, please
<a href="http://www.iris.edu/hq/contact">contact</a>
us.</p>
</div>
</div>
</div>
</div>
<div id="footer">
<div class="shadow-up"></div>
<div id="footer-bottom">
<ul>
<li><span><a href="http://www.iris.edu/hq" title="IRIS"><img src="/static/img/layout/logos/URL_TXT.png" /></a></span></li>
<li><em><a href="http://www.nsf.gov/" title="The National Science Foundation" target="_blank">Sponsored by the National Science Foundation</a></em></li>
<li><a href="http://www.iris.edu/hq" title="IRIS">&copy; Copyright 2018 IRIS</a></li>
<li>1200 New York Avenue NW, Suite 400, Washington, DC 20005, 202-682-2220</li>
<li><a href="mailto:info@iris.edu">info@iris.edu</a></li>
</ul>
</div><!-- #footer-bottom -->
</div><!-- #footer -->
<div class="cachebuster" title="Click to force a refresh.">
Page built 10:01:19 | v.65d82faf
</div>
<script>
/* Cachebuster -- this is a link to the current page with a trailing query parameter, which will cause the cache to be bypassed */
$(function() {
// Cachebuster goes in the search attribute (eg. the query string)
var search = window.location.search;
// Only operate if there's no search or it's an existing cachebuster parameter
if (!search || search.match(/^\?\d+$/)) {
$('.cachebuster').click(function() {
window.location.search = '?' + (new Date()).getTime();
});
} else {
$('.cachebuster').empty();
}
});
</script>
</div>
</div><!-- #site-container -->
</body>
</html>
Traceback (most recent call last):
File "/private-backup/home/obspy/update-docs/src/obspy/obspy/clients/fdsn/tests/test_client.py", line 317, in test_service_discovery_iris
"available_event_catalogs")))
AssertionError: Items in the second set but not the first:
'dataselect'
'station'
'event'
'available_event_contributors'
Traceback (most recent call last):
File "/home/obspy/anaconda3/envs/tmp_build_docs/lib/python3.4/doctest.py", line 2187, in runTest
raise self.failureException(self.format_failure(new.getvalue()))
AssertionError: Failed doctest test for obspy.clients.fdsn.client.Client.__init__
File "/private-backup/home/obspy/update-docs/src/obspy/obspy/clients/fdsn/client.py", line 143, in __init__
----------------------------------------------------------------------
File "/private-backup/home/obspy/update-docs/src/obspy/obspy/clients/fdsn/client.py", line 148, in obspy.clients.fdsn.client.Client.__init__
Failed example:
print(client) # doctest: +ELLIPSIS +NORMALIZE_WHITESPACE
Expected:
FDSN Webservice Client (base url: http://service.iris.edu)
Available Services: 'dataselect' (v...), 'event' (v...),
'station' (v...), 'available_event_catalogs',
'available_event_contributors'
Use e.g. client.help('dataselect') for the
parameter description of the individual services
or client.help() for parameter description of
all webservices.
Got:
FDSN Webservice Client (base url: http://service.iris.edu)
Available Services: 'available_event_catalogs'
<BLANKLINE>
Use e.g. client.help('dataselect') for the
parameter description of the individual services
or client.help() for parameter description of
all webservices.
Traceback (most recent call last):
File "/private-backup/home/obspy/update-docs/src/obspy/obspy/clients/fdsn/tests/test_client.py", line 1242, in test_no_data
minmagnitude=8)
File "/home/obspy/anaconda3/envs/tmp_build_docs/lib/python3.4/unittest/case.py", line 707, in assertRaises
return context.handle('assertRaises', callableObj, args, kwargs)
File "/home/obspy/anaconda3/envs/tmp_build_docs/lib/python3.4/unittest/case.py", line 162, in handle
callable_obj(*args, **kwargs)
File "/private-backup/home/obspy/update-docs/src/obspy/obspy/clients/fdsn/client.py", line 506, in get_events
raise ValueError(msg)
ValueError: The current client does not have an event service.
Traceback (most recent call last):
File "/private-backup/home/obspy/update-docs/src/obspy/obspy/clients/fdsn/tests/test_client.py", line 770, in test_station_bulk
inv = client.get_stations_bulk(bulk, level="station")
File "/private-backup/home/obspy/update-docs/src/obspy/obspy/clients/fdsn/client.py", line 1144, in get_stations_bulk
raise ValueError(msg)
ValueError: The current client does not have a station service.
Traceback (most recent call last):
File "/private-backup/home/obspy/update-docs/src/obspy/obspy/clients/fdsn/tests/test_client.py", line 459, in test_iris_example_queries_station
maxradius=15)
File "/private-backup/home/obspy/update-docs/src/obspy/obspy/clients/fdsn/client.py", line 704, in get_stations
raise ValueError(msg)
ValueError: The current client does not have a station service.
Traceback (most recent call last):
File "/private-backup/home/obspy/update-docs/src/obspy/obspy/clients/fdsn/tests/test_client.py", line 252, in test_location_parameters
{"location": loc, "starttime": 0, "endtime": 1}))
File "/private-backup/home/obspy/update-docs/src/obspy/obspy/clients/fdsn/client.py", line 1178, in _create_url_from_parameters
service_params = self.services[service]
KeyError: 'station'
Traceback (most recent call last):
File "/private-backup/home/obspy/update-docs/src/obspy/obspy/clients/fdsn/tests/test_client.py", line 603, in test_help_function_with_iris
client.help("event")
File "/private-backup/home/obspy/update-docs/src/obspy/obspy/clients/fdsn/client.py", line 1265, in help
raise ValueError(msg)
ValueError: Service 'event' not available for current client.
Traceback (most recent call last):
File "/home/obspy/anaconda3/envs/tmp_build_docs/lib/python3.4/doctest.py", line 2187, in runTest
raise self.failureException(self.format_failure(new.getvalue()))
AssertionError: Failed doctest test for obspy.clients.fdsn.__init__
File "/private-backup/home/obspy/update-docs/src/obspy/obspy/clients/fdsn/__init__.py", line 1, in __init__
----------------------------------------------------------------------
File "/private-backup/home/obspy/update-docs/src/obspy/obspy/clients/fdsn/__init__.py", line 71, in obspy.clients.fdsn.__init__
Failed example:
st = client.get_waveforms("IU", "ANMO", "00", "LHZ", t, t + 60 * 60)
Exception raised:
Traceback (most recent call last):
File "/home/obspy/anaconda3/envs/tmp_build_docs/lib/python3.4/doctest.py", line 1318, in __run
compileflags, 1), test.globs)
File "<doctest obspy.clients.fdsn.__init__[6]>", line 1, in <module>
st = client.get_waveforms("IU", "ANMO", "00", "LHZ", t, t + 60 * 60)
File "/private-backup/home/obspy/update-docs/src/obspy/obspy/clients/fdsn/client.py", line 817, in get_waveforms
raise ValueError(msg)
ValueError: The current client does not have a dataselect service.
----------------------------------------------------------------------
File "/private-backup/home/obspy/update-docs/src/obspy/obspy/clients/fdsn/__init__.py", line 89, in obspy.clients.fdsn.__init__
Failed example:
cat = client.get_events(starttime=starttime, endtime=endtime,
minmagnitude=6, catalog="ISC")
Exception raised:
Traceback (most recent call last):
File "/home/obspy/anaconda3/envs/tmp_build_docs/lib/python3.4/doctest.py", line 1318, in __run
compileflags, 1), test.globs)
File "<doctest obspy.clients.fdsn.__init__[10]>", line 2, in <module>
minmagnitude=6, catalog="ISC")
File "/private-backup/home/obspy/update-docs/src/obspy/obspy/clients/fdsn/client.py", line 506, in get_events
raise ValueError(msg)
ValueError: The current client does not have an event service.
----------------------------------------------------------------------
File "/private-backup/home/obspy/update-docs/src/obspy/obspy/clients/fdsn/__init__.py", line 91, in obspy.clients.fdsn.__init__
Failed example:
print(cat) # doctest: +NORMALIZE_WHITESPACE
Exception raised:
Traceback (most recent call last):
File "/home/obspy/anaconda3/envs/tmp_build_docs/lib/python3.4/doctest.py", line 1318, in __run
compileflags, 1), test.globs)
File "<doctest obspy.clients.fdsn.__init__[11]>", line 1, in <module>
print(cat) # doctest: +NORMALIZE_WHITESPACE
NameError: name 'cat' is not defined
----------------------------------------------------------------------
File "/private-backup/home/obspy/update-docs/src/obspy/obspy/clients/fdsn/__init__.py", line 112, in obspy.clients.fdsn.__init__
Failed example:
inventory = client.get_stations(network="IU", station="A*",
starttime=starttime,
endtime=endtime)
Exception raised:
Traceback (most recent call last):
File "/home/obspy/anaconda3/envs/tmp_build_docs/lib/python3.4/doctest.py", line 1318, in __run
compileflags, 1), test.globs)
File "<doctest obspy.clients.fdsn.__init__[13]>", line 3, in <module>
endtime=endtime)
File "/private-backup/home/obspy/update-docs/src/obspy/obspy/clients/fdsn/client.py", line 704, in get_stations
raise ValueError(msg)
ValueError: The current client does not have a station service.
----------------------------------------------------------------------
File "/private-backup/home/obspy/update-docs/src/obspy/obspy/clients/fdsn/__init__.py", line 115, in obspy.clients.fdsn.__init__
Failed example:
print(inventory) # doctest: +ELLIPSIS +NORMALIZE_WHITESPACE
Exception raised:
Traceback (most recent call last):
File "/home/obspy/anaconda3/envs/tmp_build_docs/lib/python3.4/doctest.py", line 1318, in __run
compileflags, 1), test.globs)
File "<doctest obspy.clients.fdsn.__init__[14]>", line 1, in <module>
print(inventory) # doctest: +ELLIPSIS +NORMALIZE_WHITESPACE
NameError: name 'inventory' is not defined
Traceback (most recent call last):
File "/private-backup/home/obspy/update-docs/src/obspy/obspy/clients/fdsn/tests/test_client.py", line 293, in test_set_credentials
client = Client(base_url="IRIS", user_agent=USER_AGENT)
File "/private-backup/home/obspy/update-docs/src/obspy/obspy/clients/fdsn/client.py", line 256, in __init__
self._discover_services()
File "/private-backup/home/obspy/update-docs/src/obspy/obspy/clients/fdsn/client.py", line 1533, in _discover_services
raise FDSNException(msg)
obspy.clients.fdsn.header.FDSNException: No FDSN services could be discovered at 'http://service.iris.edu'. This could be due to a temporary service outage or an invalid FDSN service address.
Traceback (most recent call last):
File "/private-backup/home/obspy/update-docs/src/obspy/obspy/clients/fdsn/tests/test_client.py", line 575, in test_authentication
got = client.get_waveforms(*query)
File "/private-backup/home/obspy/update-docs/src/obspy/obspy/clients/fdsn/client.py", line 817, in get_waveforms
raise ValueError(msg)
ValueError: The current client does not have a dataselect service.
Traceback (most recent call last):
File "/home/obspy/anaconda3/envs/tmp_build_docs/lib/python3.4/doctest.py", line 2187, in runTest
raise self.failureException(self.format_failure(new.getvalue()))
AssertionError: Failed doctest test for obspy.clients.fdsn.client.Client.get_stations
File "/private-backup/home/obspy/update-docs/src/obspy/obspy/clients/fdsn/client.py", line 532, in get_stations
----------------------------------------------------------------------
File "/private-backup/home/obspy/update-docs/src/obspy/obspy/clients/fdsn/client.py", line 539, in obspy.clients.fdsn.client.Client.get_stations
Failed example:
inventory = client.get_stations(network="IU", station="A*",
starttime=starttime,
endtime=endtime)
Exception raised:
Traceback (most recent call last):
File "/home/obspy/anaconda3/envs/tmp_build_docs/lib/python3.4/doctest.py", line 1318, in __run
compileflags, 1), test.globs)
File "<doctest obspy.clients.fdsn.client.Client.get_stations[3]>", line 3, in <module>
endtime=endtime)
File "/private-backup/home/obspy/update-docs/src/obspy/obspy/clients/fdsn/client.py", line 704, in get_stations
raise ValueError(msg)
ValueError: The current client does not have a station service.
----------------------------------------------------------------------
File "/private-backup/home/obspy/update-docs/src/obspy/obspy/clients/fdsn/client.py", line 542, in obspy.clients.fdsn.client.Client.get_stations
Failed example:
print(inventory) # doctest: +ELLIPSIS +NORMALIZE_WHITESPACE
Exception raised:
Traceback (most recent call last):
File "/home/obspy/anaconda3/envs/tmp_build_docs/lib/python3.4/doctest.py", line 1318, in __run
compileflags, 1), test.globs)
File "<doctest obspy.clients.fdsn.client.Client.get_stations[4]>", line 1, in <module>
print(inventory) # doctest: +ELLIPSIS +NORMALIZE_WHITESPACE
NameError: name 'inventory' is not defined
----------------------------------------------------------------------
File "/private-backup/home/obspy/update-docs/src/obspy/obspy/clients/fdsn/client.py", line 579, in obspy.clients.fdsn.client.Client.get_stations
Failed example:
inventory = client.get_stations(
starttime=starttime, endtime=endtime,
network="IU", sta="ANMO", loc="00", channel="*Z",
level="response")
Exception raised:
Traceback (most recent call last):
File "/home/obspy/anaconda3/envs/tmp_build_docs/lib/python3.4/doctest.py", line 1318, in __run
compileflags, 1), test.globs)
File "<doctest obspy.clients.fdsn.client.Client.get_stations[6]>", line 4, in <module>
level="response")
File "/private-backup/home/obspy/update-docs/src/obspy/obspy/clients/fdsn/client.py", line 704, in get_stations
raise ValueError(msg)
ValueError: The current client does not have a station service.
----------------------------------------------------------------------
File "/private-backup/home/obspy/update-docs/src/obspy/obspy/clients/fdsn/client.py", line 583, in obspy.clients.fdsn.client.Client.get_stations
Failed example:
print(inventory) # doctest: +ELLIPSIS +NORMALIZE_WHITESPACE
Exception raised:
Traceback (most recent call last):
File "/home/obspy/anaconda3/envs/tmp_build_docs/lib/python3.4/doctest.py", line 1318, in __run
compileflags, 1), test.globs)
File "<doctest obspy.clients.fdsn.client.Client.get_stations[7]>", line 1, in <module>
print(inventory) # doctest: +ELLIPSIS +NORMALIZE_WHITESPACE
NameError: name 'inventory' is not defined
Traceback (most recent call last):
File "/private-backup/home/obspy/update-docs/src/obspy/obspy/clients/iris/client.py", line 825, in traveltime
data = self._fetch("traveltime", **kwargs)
File "/private-backup/home/obspy/update-docs/src/obspy/obspy/clients/iris/client.py", line 133, in _fetch
response = urllib_request.urlopen(req, timeout=self.timeout)
File "/home/obspy/anaconda3/envs/tmp_build_docs/lib/python3.4/urllib/request.py", line 161, in urlopen
return opener.open(url, data, timeout)
File "/home/obspy/anaconda3/envs/tmp_build_docs/lib/python3.4/urllib/request.py", line 470, in open
response = meth(req, response)
File "/home/obspy/anaconda3/envs/tmp_build_docs/lib/python3.4/urllib/request.py", line 580, in http_response
'http', request, response, code, msg, hdrs)
File "/home/obspy/anaconda3/envs/tmp_build_docs/lib/python3.4/urllib/request.py", line 508, in error
return self._call_chain(*args)
File "/home/obspy/anaconda3/envs/tmp_build_docs/lib/python3.4/urllib/request.py", line 442, in _call_chain
result = func(*args)
File "/home/obspy/anaconda3/envs/tmp_build_docs/lib/python3.4/urllib/request.py", line 588, in http_error_default
raise HTTPError(req.full_url, code, msg, hdrs, fp)
urllib.error.HTTPError: HTTP Error 404: NOT FOUND
During handling of the above exception, another exception occurred:
Traceback (most recent call last):
File "/private-backup/home/obspy/update-docs/src/obspy/obspy/clients/iris/tests/test_client.py", line 119, in test_traveltime
staloc=[(-33.45, -70.67), (47.61, -122.33), (35.69, 139.69)])
File "/private-backup/home/obspy/update-docs/src/obspy/obspy/clients/iris/client.py", line 829, in traveltime
raise Exception(msg)
Exception: No response data available (HTTPError: HTTP Error 404: NOT FOUND)
Traceback (most recent call last):
File "/home/obspy/anaconda3/envs/tmp_build_docs/lib/python3.4/doctest.py", line 2187, in runTest
raise self.failureException(self.format_failure(new.getvalue()))
AssertionError: Failed doctest test for obspy.clients.iris.client.Client.distaz
File "/private-backup/home/obspy/update-docs/src/obspy/obspy/clients/iris/client.py", line 561, in distaz
----------------------------------------------------------------------
File "/private-backup/home/obspy/update-docs/src/obspy/obspy/clients/iris/client.py", line 596, in obspy.clients.iris.client.Client.distaz
Failed example:
result = client.distaz(stalat=1.1, stalon=1.2, evtlat=3.2,
evtlon=1.4)
Exception raised:
Traceback (most recent call last):
File "/private-backup/home/obspy/update-docs/src/obspy/obspy/clients/iris/client.py", line 612, in distaz
evtlat=evtlat, evtlon=evtlon)
File "/private-backup/home/obspy/update-docs/src/obspy/obspy/clients/iris/client.py", line 133, in _fetch
response = urllib_request.urlopen(req, timeout=self.timeout)
File "/home/obspy/anaconda3/envs/tmp_build_docs/lib/python3.4/urllib/request.py", line 161, in urlopen
return opener.open(url, data, timeout)
File "/home/obspy/anaconda3/envs/tmp_build_docs/lib/python3.4/urllib/request.py", line 470, in open
response = meth(req, response)
File "/home/obspy/anaconda3/envs/tmp_build_docs/lib/python3.4/urllib/request.py", line 580, in http_response
'http', request, response, code, msg, hdrs)
File "/home/obspy/anaconda3/envs/tmp_build_docs/lib/python3.4/urllib/request.py", line 508, in error
return self._call_chain(*args)
File "/home/obspy/anaconda3/envs/tmp_build_docs/lib/python3.4/urllib/request.py", line 442, in _call_chain
result = func(*args)
File "/home/obspy/anaconda3/envs/tmp_build_docs/lib/python3.4/urllib/request.py", line 588, in http_error_default
raise HTTPError(req.full_url, code, msg, hdrs, fp)
urllib.error.HTTPError: HTTP Error 404: NOT FOUND
During handling of the above exception, another exception occurred:
Traceback (most recent call last):
File "/home/obspy/anaconda3/envs/tmp_build_docs/lib/python3.4/doctest.py", line 1318, in __run
compileflags, 1), test.globs)
File "<doctest obspy.clients.iris.client.Client.distaz[2]>", line 2, in <module>
evtlon=1.4)
File "/private-backup/home/obspy/update-docs/src/obspy/obspy/clients/iris/client.py", line 616, in distaz
raise Exception(msg)
Exception: No response data available (HTTPError: HTTP Error 404: NOT FOUND)
----------------------------------------------------------------------
File "/private-backup/home/obspy/update-docs/src/obspy/obspy/clients/iris/client.py", line 598, in obspy.clients.iris.client.Client.distaz
Failed example:
print(result['distance'])
Exception raised:
Traceback (most recent call last):
File "/home/obspy/anaconda3/envs/tmp_build_docs/lib/python3.4/doctest.py", line 1318, in __run
compileflags, 1), test.globs)
File "<doctest obspy.clients.iris.client.Client.distaz[3]>", line 1, in <module>
print(result['distance'])
NameError: name 'result' is not defined
----------------------------------------------------------------------
File "/private-backup/home/obspy/update-docs/src/obspy/obspy/clients/iris/client.py", line 600, in obspy.clients.iris.client.Client.distaz
Failed example:
print(result['distancemeters'])
Exception raised:
Traceback (most recent call last):
File "/home/obspy/anaconda3/envs/tmp_build_docs/lib/python3.4/doctest.py", line 1318, in __run
compileflags, 1), test.globs)
File "<doctest obspy.clients.iris.client.Client.distaz[4]>", line 1, in <module>
print(result['distancemeters'])
NameError: name 'result' is not defined
----------------------------------------------------------------------
File "/private-backup/home/obspy/update-docs/src/obspy/obspy/clients/iris/client.py", line 602, in obspy.clients.iris.client.Client.distaz
Failed example:
print(result['backazimuth'])
Exception raised:
Traceback (most recent call last):
File "/home/obspy/anaconda3/envs/tmp_build_docs/lib/python3.4/doctest.py", line 1318, in __run
compileflags, 1), test.globs)
File "<doctest obspy.clients.iris.client.Client.distaz[5]>", line 1, in <module>
print(result['backazimuth'])
NameError: name 'result' is not defined
----------------------------------------------------------------------
File "/private-backup/home/obspy/update-docs/src/obspy/obspy/clients/iris/client.py", line 604, in obspy.clients.iris.client.Client.distaz
Failed example:
print(result['azimuth'])
Exception raised:
Traceback (most recent call last):
File "/home/obspy/anaconda3/envs/tmp_build_docs/lib/python3.4/doctest.py", line 1318, in __run
compileflags, 1), test.globs)
File "<doctest obspy.clients.iris.client.Client.distaz[6]>", line 1, in <module>
print(result['azimuth'])
NameError: name 'result' is not defined
----------------------------------------------------------------------
File "/private-backup/home/obspy/update-docs/src/obspy/obspy/clients/iris/client.py", line 606, in obspy.clients.iris.client.Client.distaz
Failed example:
print(result['ellipsoidname'])
Exception raised:
Traceback (most recent call last):
File "/home/obspy/anaconda3/envs/tmp_build_docs/lib/python3.4/doctest.py", line 1318, in __run
compileflags, 1), test.globs)
File "<doctest obspy.clients.iris.client.Client.distaz[7]>", line 1, in <module>
print(result['ellipsoidname'])
NameError: name 'result' is not defined
Traceback (most recent call last):
File "/private-backup/home/obspy/update-docs/src/obspy/obspy/clients/iris/client.py", line 667, in flinnengdahl
return int(self._fetch(service, param_list=param_list))
File "/private-backup/home/obspy/update-docs/src/obspy/obspy/clients/iris/client.py", line 133, in _fetch
response = urllib_request.urlopen(req, timeout=self.timeout)
File "/home/obspy/anaconda3/envs/tmp_build_docs/lib/python3.4/urllib/request.py", line 161, in urlopen
return opener.open(url, data, timeout)
File "/home/obspy/anaconda3/envs/tmp_build_docs/lib/python3.4/urllib/request.py", line 470, in open
response = meth(req, response)
File "/home/obspy/anaconda3/envs/tmp_build_docs/lib/python3.4/urllib/request.py", line 580, in http_response
'http', request, response, code, msg, hdrs)
File "/home/obspy/anaconda3/envs/tmp_build_docs/lib/python3.4/urllib/request.py", line 508, in error
return self._call_chain(*args)
File "/home/obspy/anaconda3/envs/tmp_build_docs/lib/python3.4/urllib/request.py", line 442, in _call_chain
result = func(*args)
File "/home/obspy/anaconda3/envs/tmp_build_docs/lib/python3.4/urllib/request.py", line 588, in http_error_default
raise HTTPError(req.full_url, code, msg, hdrs, fp)
urllib.error.HTTPError: HTTP Error 404: NOT FOUND
During handling of the above exception, another exception occurred:
Traceback (most recent call last):
File "/private-backup/home/obspy/update-docs/src/obspy/obspy/clients/iris/tests/test_client.py", line 85, in test_flinnengdahl
result = client.flinnengdahl(lat=-20.5, lon=-100.6, rtype="code")
File "/private-backup/home/obspy/update-docs/src/obspy/obspy/clients/iris/client.py", line 684, in flinnengdahl
raise Exception(msg)
Exception: No Flinn-Engdahl data available (HTTPError: HTTP Error 404: NOT FOUND)
Traceback (most recent call last):
File "/home/obspy/anaconda3/envs/tmp_build_docs/lib/python3.4/doctest.py", line 2187, in runTest
raise self.failureException(self.format_failure(new.getvalue()))
AssertionError: Failed doctest test for obspy.clients.iris.client.Client.flinnengdahl
File "/private-backup/home/obspy/update-docs/src/obspy/obspy/clients/iris/client.py", line 626, in flinnengdahl
----------------------------------------------------------------------
File "/private-backup/home/obspy/update-docs/src/obspy/obspy/clients/iris/client.py", line 651, in obspy.clients.iris.client.Client.flinnengdahl
Failed example:
client.flinnengdahl(lat=-20.5, lon=-100.6, rtype="code")
Exception raised:
Traceback (most recent call last):
File "/private-backup/home/obspy/update-docs/src/obspy/obspy/clients/iris/client.py", line 667, in flinnengdahl
return int(self._fetch(service, param_list=param_list))
File "/private-backup/home/obspy/update-docs/src/obspy/obspy/clients/iris/client.py", line 133, in _fetch
response = urllib_request.urlopen(req, timeout=self.timeout)
File "/home/obspy/anaconda3/envs/tmp_build_docs/lib/python3.4/urllib/request.py", line 161, in urlopen
return opener.open(url, data, timeout)
File "/home/obspy/anaconda3/envs/tmp_build_docs/lib/python3.4/urllib/request.py", line 470, in open
response = meth(req, response)
File "/home/obspy/anaconda3/envs/tmp_build_docs/lib/python3.4/urllib/request.py", line 580, in http_response
'http', request, response, code, msg, hdrs)
File "/home/obspy/anaconda3/envs/tmp_build_docs/lib/python3.4/urllib/request.py", line 508, in error
return self._call_chain(*args)
File "/home/obspy/anaconda3/envs/tmp_build_docs/lib/python3.4/urllib/request.py", line 442, in _call_chain
result = func(*args)
File "/home/obspy/anaconda3/envs/tmp_build_docs/lib/python3.4/urllib/request.py", line 588, in http_error_default
raise HTTPError(req.full_url, code, msg, hdrs, fp)
urllib.error.HTTPError: HTTP Error 404: NOT FOUND
During handling of the above exception, another exception occurred:
Traceback (most recent call last):
File "/home/obspy/anaconda3/envs/tmp_build_docs/lib/python3.4/doctest.py", line 1318, in __run
compileflags, 1), test.globs)
File "<doctest obspy.clients.iris.client.Client.flinnengdahl[2]>", line 1, in <module>
client.flinnengdahl(lat=-20.5, lon=-100.6, rtype="code")
File "/private-backup/home/obspy/update-docs/src/obspy/obspy/clients/iris/client.py", line 684, in flinnengdahl
raise Exception(msg)
Exception: No Flinn-Engdahl data available (HTTPError: HTTP Error 404: NOT FOUND)
----------------------------------------------------------------------
File "/private-backup/home/obspy/update-docs/src/obspy/obspy/clients/iris/client.py", line 654, in obspy.clients.iris.client.Client.flinnengdahl
Failed example:
print(client.flinnengdahl(lat=42, lon=-122.24, rtype="region"))
Exception raised:
Traceback (most recent call last):
File "/private-backup/home/obspy/update-docs/src/obspy/obspy/clients/iris/client.py", line 672, in flinnengdahl
param_list=param_list).strip().decode()
File "/private-backup/home/obspy/update-docs/src/obspy/obspy/clients/iris/client.py", line 133, in _fetch
response = urllib_request.urlopen(req, timeout=self.timeout)
File "/home/obspy/anaconda3/envs/tmp_build_docs/lib/python3.4/urllib/request.py", line 161, in urlopen
return opener.open(url, data, timeout)
File "/home/obspy/anaconda3/envs/tmp_build_docs/lib/python3.4/urllib/request.py", line 470, in open
response = meth(req, response)
File "/home/obspy/anaconda3/envs/tmp_build_docs/lib/python3.4/urllib/request.py", line 580, in http_response
'http', request, response, code, msg, hdrs)
File "/home/obspy/anaconda3/envs/tmp_build_docs/lib/python3.4/urllib/request.py", line 508, in error
return self._call_chain(*args)
File "/home/obspy/anaconda3/envs/tmp_build_docs/lib/python3.4/urllib/request.py", line 442, in _call_chain
result = func(*args)
File "/home/obspy/anaconda3/envs/tmp_build_docs/lib/python3.4/urllib/request.py", line 588, in http_error_default
raise HTTPError(req.full_url, code, msg, hdrs, fp)
urllib.error.HTTPError: HTTP Error 404: NOT FOUND
During handling of the above exception, another exception occurred:
Traceback (most recent call last):
File "/home/obspy/anaconda3/envs/tmp_build_docs/lib/python3.4/doctest.py", line 1318, in __run
compileflags, 1), test.globs)
File "<doctest obspy.clients.iris.client.Client.flinnengdahl[3]>", line 1, in <module>
print(client.flinnengdahl(lat=42, lon=-122.24, rtype="region"))
File "/private-backup/home/obspy/update-docs/src/obspy/obspy/clients/iris/client.py", line 684, in flinnengdahl
raise Exception(msg)
Exception: No Flinn-Engdahl data available (HTTPError: HTTP Error 404: NOT FOUND)
----------------------------------------------------------------------
File "/private-backup/home/obspy/update-docs/src/obspy/obspy/clients/iris/client.py", line 657, in obspy.clients.iris.client.Client.flinnengdahl
Failed example:
code, region = client.flinnengdahl(lat=-20.5, lon=-100.6)
Exception raised:
Traceback (most recent call last):
File "/private-backup/home/obspy/update-docs/src/obspy/obspy/clients/iris/client.py", line 676, in flinnengdahl
code = int(self._fetch(service, param_list=param_list))
File "/private-backup/home/obspy/update-docs/src/obspy/obspy/clients/iris/client.py", line 133, in _fetch
response = urllib_request.urlopen(req, timeout=self.timeout)
File "/home/obspy/anaconda3/envs/tmp_build_docs/lib/python3.4/urllib/request.py", line 161, in urlopen
return opener.open(url, data, timeout)
File "/home/obspy/anaconda3/envs/tmp_build_docs/lib/python3.4/urllib/request.py", line 470, in open
response = meth(req, response)
File "/home/obspy/anaconda3/envs/tmp_build_docs/lib/python3.4/urllib/request.py", line 580, in http_response
'http', request, response, code, msg, hdrs)
File "/home/obspy/anaconda3/envs/tmp_build_docs/lib/python3.4/urllib/request.py", line 508, in error
return self._call_chain(*args)
File "/home/obspy/anaconda3/envs/tmp_build_docs/lib/python3.4/urllib/request.py", line 442, in _call_chain
result = func(*args)
File "/home/obspy/anaconda3/envs/tmp_build_docs/lib/python3.4/urllib/request.py", line 588, in http_error_default
raise HTTPError(req.full_url, code, msg, hdrs, fp)
urllib.error.HTTPError: HTTP Error 404: NOT FOUND
During handling of the above exception, another exception occurred:
Traceback (most recent call last):
File "/home/obspy/anaconda3/envs/tmp_build_docs/lib/python3.4/doctest.py", line 1318, in __run
compileflags, 1), test.globs)
File "<doctest obspy.clients.iris.client.Client.flinnengdahl[4]>", line 1, in <module>
code, region = client.flinnengdahl(lat=-20.5, lon=-100.6)
File "/private-backup/home/obspy/update-docs/src/obspy/obspy/clients/iris/client.py", line 684, in flinnengdahl
raise Exception(msg)
Exception: No Flinn-Engdahl data available (HTTPError: HTTP Error 404: NOT FOUND)
----------------------------------------------------------------------
File "/private-backup/home/obspy/update-docs/src/obspy/obspy/clients/iris/client.py", line 658, in obspy.clients.iris.client.Client.flinnengdahl
Failed example:
print(code, region)
Exception raised:
Traceback (most recent call last):
File "/home/obspy/anaconda3/envs/tmp_build_docs/lib/python3.4/doctest.py", line 1318, in __run
compileflags, 1), test.globs)
File "<doctest obspy.clients.iris.client.Client.flinnengdahl[5]>", line 1, in <module>
print(code, region)
NameError: name 'code' is not defined
Traceback (most recent call last):
File "/home/obspy/anaconda3/envs/tmp_build_docs/lib/python3.4/doctest.py", line 2187, in runTest
raise self.failureException(self.format_failure(new.getvalue()))
AssertionError: Failed doctest test for obspy.clients.iris.client.Client.sacpz
File "/private-backup/home/obspy/update-docs/src/obspy/obspy/clients/iris/client.py", line 454, in sacpz
----------------------------------------------------------------------
File "/private-backup/home/obspy/update-docs/src/obspy/obspy/clients/iris/client.py", line 491, in obspy.clients.iris.client.Client.sacpz
Failed example:
sacpz = client.sacpz("IU", "ANMO", "00", "BHZ", dt)
Exception raised:
Traceback (most recent call last):
File "/home/obspy/anaconda3/envs/tmp_build_docs/lib/python3.4/doctest.py", line 1318, in __run
compileflags, 1), test.globs)
File "<doctest obspy.clients.iris.client.Client.sacpz[4]>", line 1, in <module>
sacpz = client.sacpz("IU", "ANMO", "00", "BHZ", dt)
File "/private-backup/home/obspy/update-docs/src/obspy/obspy/clients/iris/client.py", line 558, in sacpz
data = self._fetch("sacpz", **kwargs)
File "/private-backup/home/obspy/update-docs/src/obspy/obspy/clients/iris/client.py", line 133, in _fetch
response = urllib_request.urlopen(req, timeout=self.timeout)
File "/home/obspy/anaconda3/envs/tmp_build_docs/lib/python3.4/urllib/request.py", line 161, in urlopen
return opener.open(url, data, timeout)
File "/home/obspy/anaconda3/envs/tmp_build_docs/lib/python3.4/urllib/request.py", line 470, in open
response = meth(req, response)
File "/home/obspy/anaconda3/envs/tmp_build_docs/lib/python3.4/urllib/request.py", line 580, in http_response
'http', request, response, code, msg, hdrs)
File "/home/obspy/anaconda3/envs/tmp_build_docs/lib/python3.4/urllib/request.py", line 508, in error
return self._call_chain(*args)
File "/home/obspy/anaconda3/envs/tmp_build_docs/lib/python3.4/urllib/request.py", line 442, in _call_chain
result = func(*args)
File "/home/obspy/anaconda3/envs/tmp_build_docs/lib/python3.4/urllib/request.py", line 588, in http_error_default
raise HTTPError(req.full_url, code, msg, hdrs, fp)
urllib.error.HTTPError: HTTP Error 404: NOT FOUND
----------------------------------------------------------------------
File "/private-backup/home/obspy/update-docs/src/obspy/obspy/clients/iris/client.py", line 492, in obspy.clients.iris.client.Client.sacpz
Failed example:
print(sacpz.decode()) # doctest: +ELLIPSIS +NORMALIZE_WHITESPACE
Exception raised:
Traceback (most recent call last):
File "/home/obspy/anaconda3/envs/tmp_build_docs/lib/python3.4/doctest.py", line 1318, in __run
compileflags, 1), test.globs)
File "<doctest obspy.clients.iris.client.Client.sacpz[5]>", line 1, in <module>
print(sacpz.decode()) # doctest: +ELLIPSIS +NORMALIZE_WHITESPACE
NameError: name 'sacpz' is not defined
Traceback (most recent call last):
File "/private-backup/home/obspy/update-docs/src/obspy/obspy/clients/iris/tests/test_client.py", line 35, in test_sacpz
result = client.sacpz("IU", "ANMO", "00", "BHZ", t1, t2)
File "/private-backup/home/obspy/update-docs/src/obspy/obspy/clients/iris/client.py", line 558, in sacpz
data = self._fetch("sacpz", **kwargs)
File "/private-backup/home/obspy/update-docs/src/obspy/obspy/clients/iris/client.py", line 133, in _fetch
response = urllib_request.urlopen(req, timeout=self.timeout)
File "/home/obspy/anaconda3/envs/tmp_build_docs/lib/python3.4/urllib/request.py", line 161, in urlopen
return opener.open(url, data, timeout)
File "/home/obspy/anaconda3/envs/tmp_build_docs/lib/python3.4/urllib/request.py", line 470, in open
response = meth(req, response)
File "/home/obspy/anaconda3/envs/tmp_build_docs/lib/python3.4/urllib/request.py", line 580, in http_response
'http', request, response, code, msg, hdrs)
File "/home/obspy/anaconda3/envs/tmp_build_docs/lib/python3.4/urllib/request.py", line 508, in error
return self._call_chain(*args)
File "/home/obspy/anaconda3/envs/tmp_build_docs/lib/python3.4/urllib/request.py", line 442, in _call_chain
result = func(*args)
File "/home/obspy/anaconda3/envs/tmp_build_docs/lib/python3.4/urllib/request.py", line 588, in http_error_default
raise HTTPError(req.full_url, code, msg, hdrs, fp)
urllib.error.HTTPError: HTTP Error 404: NOT FOUND
Traceback (most recent call last):
File "/home/obspy/anaconda3/envs/tmp_build_docs/lib/python3.4/doctest.py", line 2187, in runTest
raise self.failureException(self.format_failure(new.getvalue()))
AssertionError: Failed doctest test for obspy.clients.iris.client.Client.evalresp
File "/private-backup/home/obspy/update-docs/src/obspy/obspy/clients/iris/client.py", line 835, in evalresp
----------------------------------------------------------------------
File "/private-backup/home/obspy/update-docs/src/obspy/obspy/clients/iris/client.py", line 939, in obspy.clients.iris.client.Client.evalresp
Failed example:
data = client.evalresp("IU", "ANMO", "00", "BHZ", dt,
output='fap')
Exception raised:
Traceback (most recent call last):
File "/home/obspy/anaconda3/envs/tmp_build_docs/lib/python3.4/doctest.py", line 1318, in __run
compileflags, 1), test.globs)
File "<doctest obspy.clients.iris.client.Client.evalresp[3]>", line 2, in <module>
output='fap')
File "/private-backup/home/obspy/update-docs/src/obspy/obspy/clients/iris/client.py", line 987, in evalresp
data = self._fetch("evalresp", **kwargs)
File "/private-backup/home/obspy/update-docs/src/obspy/obspy/clients/iris/client.py", line 133, in _fetch
response = urllib_request.urlopen(req, timeout=self.timeout)
File "/home/obspy/anaconda3/envs/tmp_build_docs/lib/python3.4/urllib/request.py", line 161, in urlopen
return opener.open(url, data, timeout)
File "/home/obspy/anaconda3/envs/tmp_build_docs/lib/python3.4/urllib/request.py", line 470, in open
response = meth(req, response)
File "/home/obspy/anaconda3/envs/tmp_build_docs/lib/python3.4/urllib/request.py", line 580, in http_response
'http', request, response, code, msg, hdrs)
File "/home/obspy/anaconda3/envs/tmp_build_docs/lib/python3.4/urllib/request.py", line 508, in error
return self._call_chain(*args)
File "/home/obspy/anaconda3/envs/tmp_build_docs/lib/python3.4/urllib/request.py", line 442, in _call_chain
result = func(*args)
File "/home/obspy/anaconda3/envs/tmp_build_docs/lib/python3.4/urllib/request.py", line 588, in http_error_default
raise HTTPError(req.full_url, code, msg, hdrs, fp)
urllib.error.HTTPError: HTTP Error 500: Internal Server Error
----------------------------------------------------------------------
File "/private-backup/home/obspy/update-docs/src/obspy/obspy/clients/iris/client.py", line 941, in obspy.clients.iris.client.Client.evalresp
Failed example:
data[0] # frequency, amplitude, phase of first point
Exception raised:
Traceback (most recent call last):
File "/home/obspy/anaconda3/envs/tmp_build_docs/lib/python3.4/doctest.py", line 1318, in __run
compileflags, 1), test.globs)
File "<doctest obspy.clients.iris.client.Client.evalresp[4]>", line 1, in <module>
data[0] # frequency, amplitude, phase of first point
NameError: name 'data' is not defined
Traceback (most recent call last):
File "/home/obspy/anaconda3/envs/tmp_build_docs/lib/python3.4/doctest.py", line 2187, in runTest
raise self.failureException(self.format_failure(new.getvalue()))
AssertionError: Failed doctest test for obspy.clients.iris.client.Client.traveltime
File "/private-backup/home/obspy/update-docs/src/obspy/obspy/clients/iris/client.py", line 689, in traveltime
----------------------------------------------------------------------
File "/private-backup/home/obspy/update-docs/src/obspy/obspy/clients/iris/client.py", line 774, in obspy.clients.iris.client.Client.traveltime
Failed example:
result = client.traveltime(evloc=(-36.122,-72.898),
staloc=[(-33.45,-70.67),(47.61,-122.33),(35.69,139.69)],
evdepth=22.9)
Exception raised:
Traceback (most recent call last):
File "/private-backup/home/obspy/update-docs/src/obspy/obspy/clients/iris/client.py", line 825, in traveltime
data = self._fetch("traveltime", **kwargs)
File "/private-backup/home/obspy/update-docs/src/obspy/obspy/clients/iris/client.py", line 133, in _fetch
response = urllib_request.urlopen(req, timeout=self.timeout)
File "/home/obspy/anaconda3/envs/tmp_build_docs/lib/python3.4/urllib/request.py", line 161, in urlopen
return opener.open(url, data, timeout)
File "/home/obspy/anaconda3/envs/tmp_build_docs/lib/python3.4/urllib/request.py", line 470, in open
response = meth(req, response)
File "/home/obspy/anaconda3/envs/tmp_build_docs/lib/python3.4/urllib/request.py", line 580, in http_response
'http', request, response, code, msg, hdrs)
File "/home/obspy/anaconda3/envs/tmp_build_docs/lib/python3.4/urllib/request.py", line 508, in error
return self._call_chain(*args)
File "/home/obspy/anaconda3/envs/tmp_build_docs/lib/python3.4/urllib/request.py", line 442, in _call_chain
result = func(*args)
File "/home/obspy/anaconda3/envs/tmp_build_docs/lib/python3.4/urllib/request.py", line 588, in http_error_default
raise HTTPError(req.full_url, code, msg, hdrs, fp)
urllib.error.HTTPError: HTTP Error 404: NOT FOUND
During handling of the above exception, another exception occurred:
Traceback (most recent call last):
File "/home/obspy/anaconda3/envs/tmp_build_docs/lib/python3.4/doctest.py", line 1318, in __run
compileflags, 1), test.globs)
File "<doctest obspy.clients.iris.client.Client.traveltime[2]>", line 3, in <module>
evdepth=22.9)
File "/private-backup/home/obspy/update-docs/src/obspy/obspy/clients/iris/client.py", line 829, in traveltime
raise Exception(msg)
Exception: No response data available (HTTPError: HTTP Error 404: NOT FOUND)
----------------------------------------------------------------------
File "/private-backup/home/obspy/update-docs/src/obspy/obspy/clients/iris/client.py", line 777, in obspy.clients.iris.client.Client.traveltime
Failed example:
print(result.decode()) # doctest: +ELLIPSIS +NORMALIZE_WHITESPACE
Exception raised:
Traceback (most recent call last):
File "/home/obspy/anaconda3/envs/tmp_build_docs/lib/python3.4/doctest.py", line 1318, in __run
compileflags, 1), test.globs)
File "<doctest obspy.clients.iris.client.Client.traveltime[3]>", line 1, in <module>
print(result.decode()) # doctest: +ELLIPSIS +NORMALIZE_WHITESPACE
NameError: name 'result' is not defined
Traceback (most recent call last):
File "/home/obspy/anaconda3/envs/tmp_build_docs/lib/python3.4/doctest.py", line 2187, in runTest
raise self.failureException(self.format_failure(new.getvalue()))
AssertionError: Failed doctest test for obspy.clients.iris.client.Client.resp
File "/private-backup/home/obspy/update-docs/src/obspy/obspy/clients/iris/client.py", line 360, in resp
----------------------------------------------------------------------
File "/private-backup/home/obspy/update-docs/src/obspy/obspy/clients/iris/client.py", line 408, in obspy.clients.iris.client.Client.resp
Failed example:
data = client.resp("IU", "ANMO", "00", "BHZ", dt)
Exception raised:
Traceback (most recent call last):
File "/private-backup/home/obspy/update-docs/src/obspy/obspy/clients/iris/client.py", line 446, in resp
data = self._fetch("resp", **kwargs)
File "/private-backup/home/obspy/update-docs/src/obspy/obspy/clients/iris/client.py", line 133, in _fetch
response = urllib_request.urlopen(req, timeout=self.timeout)
File "/home/obspy/anaconda3/envs/tmp_build_docs/lib/python3.4/urllib/request.py", line 161, in urlopen
return opener.open(url, data, timeout)
File "/home/obspy/anaconda3/envs/tmp_build_docs/lib/python3.4/urllib/request.py", line 470, in open
response = meth(req, response)
File "/home/obspy/anaconda3/envs/tmp_build_docs/lib/python3.4/urllib/request.py", line 580, in http_response
'http', request, response, code, msg, hdrs)
File "/home/obspy/anaconda3/envs/tmp_build_docs/lib/python3.4/urllib/request.py", line 508, in error
return self._call_chain(*args)
File "/home/obspy/anaconda3/envs/tmp_build_docs/lib/python3.4/urllib/request.py", line 442, in _call_chain
result = func(*args)
File "/home/obspy/anaconda3/envs/tmp_build_docs/lib/python3.4/urllib/request.py", line 588, in http_error_default
raise HTTPError(req.full_url, code, msg, hdrs, fp)
urllib.error.HTTPError: HTTP Error 500: Internal Server Error
During handling of the above exception, another exception occurred:
Traceback (most recent call last):
File "/home/obspy/anaconda3/envs/tmp_build_docs/lib/python3.4/doctest.py", line 1318, in __run
compileflags, 1), test.globs)
File "<doctest obspy.clients.iris.client.Client.resp[4]>", line 1, in <module>
data = client.resp("IU", "ANMO", "00", "BHZ", dt)
File "/private-backup/home/obspy/update-docs/src/obspy/obspy/clients/iris/client.py", line 450, in resp
raise Exception(msg)
Exception: No response data available (HTTPError: HTTP Error 500: Internal Server Error)
----------------------------------------------------------------------
File "/private-backup/home/obspy/update-docs/src/obspy/obspy/clients/iris/client.py", line 409, in obspy.clients.iris.client.Client.resp
Failed example:
print(data.decode()) # doctest: +ELLIPSIS
Exception raised:
Traceback (most recent call last):
File "/home/obspy/anaconda3/envs/tmp_build_docs/lib/python3.4/doctest.py", line 1318, in __run
compileflags, 1), test.globs)
File "<doctest obspy.clients.iris.client.Client.resp[5]>", line 1, in <module>
print(data.decode()) # doctest: +ELLIPSIS
NameError: name 'data' is not defined
Traceback (most recent call last):
File "/private-backup/home/obspy/update-docs/src/obspy/obspy/clients/iris/client.py", line 446, in resp
data = self._fetch("resp", **kwargs)
File "/private-backup/home/obspy/update-docs/src/obspy/obspy/clients/iris/client.py", line 133, in _fetch
response = urllib_request.urlopen(req, timeout=self.timeout)
File "/home/obspy/anaconda3/envs/tmp_build_docs/lib/python3.4/urllib/request.py", line 161, in urlopen
return opener.open(url, data, timeout)
File "/home/obspy/anaconda3/envs/tmp_build_docs/lib/python3.4/urllib/request.py", line 470, in open
response = meth(req, response)
File "/home/obspy/anaconda3/envs/tmp_build_docs/lib/python3.4/urllib/request.py", line 580, in http_response
'http', request, response, code, msg, hdrs)
File "/home/obspy/anaconda3/envs/tmp_build_docs/lib/python3.4/urllib/request.py", line 508, in error
return self._call_chain(*args)
File "/home/obspy/anaconda3/envs/tmp_build_docs/lib/python3.4/urllib/request.py", line 442, in _call_chain
result = func(*args)
File "/home/obspy/anaconda3/envs/tmp_build_docs/lib/python3.4/urllib/request.py", line 588, in http_error_default
raise HTTPError(req.full_url, code, msg, hdrs, fp)
urllib.error.HTTPError: HTTP Error 500: Internal Server Error
During handling of the above exception, another exception occurred:
Traceback (most recent call last):
File "/private-backup/home/obspy/update-docs/src/obspy/obspy/clients/iris/tests/test_client.py", line 227, in test_resp
result = client.resp("IU", "ANMO", "00", "BHZ", t1, t2)
File "/private-backup/home/obspy/update-docs/src/obspy/obspy/clients/iris/client.py", line 450, in resp
raise Exception(msg)
Exception: No response data available (HTTPError: HTTP Error 500: Internal Server Error)
Traceback (most recent call last):
File "/private-backup/home/obspy/update-docs/src/obspy/obspy/clients/iris/client.py", line 612, in distaz
evtlat=evtlat, evtlon=evtlon)
File "/private-backup/home/obspy/update-docs/src/obspy/obspy/clients/iris/client.py", line 133, in _fetch
response = urllib_request.urlopen(req, timeout=self.timeout)
File "/home/obspy/anaconda3/envs/tmp_build_docs/lib/python3.4/urllib/request.py", line 161, in urlopen
return opener.open(url, data, timeout)
File "/home/obspy/anaconda3/envs/tmp_build_docs/lib/python3.4/urllib/request.py", line 470, in open
response = meth(req, response)
File "/home/obspy/anaconda3/envs/tmp_build_docs/lib/python3.4/urllib/request.py", line 580, in http_response
'http', request, response, code, msg, hdrs)
File "/home/obspy/anaconda3/envs/tmp_build_docs/lib/python3.4/urllib/request.py", line 508, in error
return self._call_chain(*args)
File "/home/obspy/anaconda3/envs/tmp_build_docs/lib/python3.4/urllib/request.py", line 442, in _call_chain
result = func(*args)
File "/home/obspy/anaconda3/envs/tmp_build_docs/lib/python3.4/urllib/request.py", line 588, in http_error_default
raise HTTPError(req.full_url, code, msg, hdrs, fp)
urllib.error.HTTPError: HTTP Error 404: NOT FOUND
During handling of the above exception, another exception occurred:
Traceback (most recent call last):
File "/private-backup/home/obspy/update-docs/src/obspy/obspy/clients/iris/tests/test_client.py", line 60, in test_distaz
result = client.distaz(stalat=1.1, stalon=1.2, evtlat=3.2, evtlon=1.4)
File "/private-backup/home/obspy/update-docs/src/obspy/obspy/clients/iris/client.py", line 616, in distaz
raise Exception(msg)
Exception: No response data available (HTTPError: HTTP Error 404: NOT FOUND)
Traceback (most recent call last):
File "/home/obspy/anaconda3/envs/tmp_build_docs/lib/python3.4/doctest.py", line 2187, in runTest
raise self.failureException(self.format_failure(new.getvalue()))
AssertionError: Failed doctest test for obspy.clients.iris.client.Client
File "/private-backup/home/obspy/update-docs/src/obspy/obspy/clients/iris/client.py", line 42, in Client
----------------------------------------------------------------------
File "/private-backup/home/obspy/update-docs/src/obspy/obspy/clients/iris/client.py", line 76, in obspy.clients.iris.client.Client
Failed example:
result = client.distaz(stalat=1.1, stalon=1.2, evtlat=3.2,
evtlon=1.4)
Exception raised:
Traceback (most recent call last):
File "/private-backup/home/obspy/update-docs/src/obspy/obspy/clients/iris/client.py", line 612, in distaz
evtlat=evtlat, evtlon=evtlon)
File "/private-backup/home/obspy/update-docs/src/obspy/obspy/clients/iris/client.py", line 133, in _fetch
response = urllib_request.urlopen(req, timeout=self.timeout)
File "/home/obspy/anaconda3/envs/tmp_build_docs/lib/python3.4/urllib/request.py", line 161, in urlopen
return opener.open(url, data, timeout)
File "/home/obspy/anaconda3/envs/tmp_build_docs/lib/python3.4/urllib/request.py", line 470, in open
response = meth(req, response)
File "/home/obspy/anaconda3/envs/tmp_build_docs/lib/python3.4/urllib/request.py", line 580, in http_response
'http', request, response, code, msg, hdrs)
File "/home/obspy/anaconda3/envs/tmp_build_docs/lib/python3.4/urllib/request.py", line 508, in error
return self._call_chain(*args)
File "/home/obspy/anaconda3/envs/tmp_build_docs/lib/python3.4/urllib/request.py", line 442, in _call_chain
result = func(*args)
File "/home/obspy/anaconda3/envs/tmp_build_docs/lib/python3.4/urllib/request.py", line 588, in http_error_default
raise HTTPError(req.full_url, code, msg, hdrs, fp)
urllib.error.HTTPError: HTTP Error 404: NOT FOUND
During handling of the above exception, another exception occurred:
Traceback (most recent call last):
File "/home/obspy/anaconda3/envs/tmp_build_docs/lib/python3.4/doctest.py", line 1318, in __run
compileflags, 1), test.globs)
File "<doctest obspy.clients.iris.client.Client[2]>", line 2, in <module>
evtlon=1.4)
File "/private-backup/home/obspy/update-docs/src/obspy/obspy/clients/iris/client.py", line 616, in distaz
raise Exception(msg)
Exception: No response data available (HTTPError: HTTP Error 404: NOT FOUND)
----------------------------------------------------------------------
File "/private-backup/home/obspy/update-docs/src/obspy/obspy/clients/iris/client.py", line 78, in obspy.clients.iris.client.Client
Failed example:
print(result['distance'])
Exception raised:
Traceback (most recent call last):
File "/home/obspy/anaconda3/envs/tmp_build_docs/lib/python3.4/doctest.py", line 1318, in __run
compileflags, 1), test.globs)
File "<doctest obspy.clients.iris.client.Client[3]>", line 1, in <module>
print(result['distance'])
NameError: name 'result' is not defined
----------------------------------------------------------------------
File "/private-backup/home/obspy/update-docs/src/obspy/obspy/clients/iris/client.py", line 80, in obspy.clients.iris.client.Client
Failed example:
print(result['backazimuth'])
Exception raised:
Traceback (most recent call last):
File "/home/obspy/anaconda3/envs/tmp_build_docs/lib/python3.4/doctest.py", line 1318, in __run
compileflags, 1), test.globs)
File "<doctest obspy.clients.iris.client.Client[4]>", line 1, in <module>
print(result['backazimuth'])
NameError: name 'result' is not defined
----------------------------------------------------------------------
File "/private-backup/home/obspy/update-docs/src/obspy/obspy/clients/iris/client.py", line 82, in obspy.clients.iris.client.Client
Failed example:
print(result['azimuth'])
Exception raised:
Traceback (most recent call last):
File "/home/obspy/anaconda3/envs/tmp_build_docs/lib/python3.4/doctest.py", line 1318, in __run
compileflags, 1), test.globs)
File "<doctest obspy.clients.iris.client.Client[5]>", line 1, in <module>
print(result['azimuth'])
NameError: name 'result' is not defined
Traceback (most recent call last):
File "/home/obspy/anaconda3/envs/tmp_build_docs/lib/python3.4/doctest.py", line 2187, in runTest
raise self.failureException(self.format_failure(new.getvalue()))
AssertionError: Failed doctest test for obspy.clients.iris.client.Client.timeseries
File "/private-backup/home/obspy/update-docs/src/obspy/obspy/clients/iris/client.py", line 177, in timeseries
----------------------------------------------------------------------
File "/private-backup/home/obspy/update-docs/src/obspy/obspy/clients/iris/client.py", line 315, in obspy.clients.iris.client.Client.timeseries
Failed example:
st = client.timeseries("IU", "ANMO", "00", "BHZ", dt, dt+10)
Exception raised:
Traceback (most recent call last):
File "/private-backup/home/obspy/update-docs/src/obspy/obspy/clients/iris/client.py", line 340, in timeseries
data = self._fetch("timeseries", param_list=filter, **kwargs)
File "/private-backup/home/obspy/update-docs/src/obspy/obspy/clients/iris/client.py", line 133, in _fetch
response = urllib_request.urlopen(req, timeout=self.timeout)
File "/home/obspy/anaconda3/envs/tmp_build_docs/lib/python3.4/urllib/request.py", line 161, in urlopen
return opener.open(url, data, timeout)
File "/home/obspy/anaconda3/envs/tmp_build_docs/lib/python3.4/urllib/request.py", line 470, in open
response = meth(req, response)
File "/home/obspy/anaconda3/envs/tmp_build_docs/lib/python3.4/urllib/request.py", line 580, in http_response
'http', request, response, code, msg, hdrs)
File "/home/obspy/anaconda3/envs/tmp_build_docs/lib/python3.4/urllib/request.py", line 508, in error
return self._call_chain(*args)
File "/home/obspy/anaconda3/envs/tmp_build_docs/lib/python3.4/urllib/request.py", line 442, in _call_chain
result = func(*args)
File "/home/obspy/anaconda3/envs/tmp_build_docs/lib/python3.4/urllib/request.py", line 588, in http_error_default
raise HTTPError(req.full_url, code, msg, hdrs, fp)
urllib.error.HTTPError: HTTP Error 404: Not Found
During handling of the above exception, another exception occurred:
Traceback (most recent call last):
File "/home/obspy/anaconda3/envs/tmp_build_docs/lib/python3.4/doctest.py", line 1318, in __run
compileflags, 1), test.globs)
File "<doctest obspy.clients.iris.client.Client.timeseries[4]>", line 1, in <module>
st = client.timeseries("IU", "ANMO", "00", "BHZ", dt, dt+10)
File "/private-backup/home/obspy/update-docs/src/obspy/obspy/clients/iris/client.py", line 344, in timeseries
raise Exception(msg)
Exception: No waveform data available (HTTPError: HTTP Error 404: Not Found)
----------------------------------------------------------------------
File "/private-backup/home/obspy/update-docs/src/obspy/obspy/clients/iris/client.py", line 316, in obspy.clients.iris.client.Client.timeseries
Failed example:
print(st[0].data) # doctest: +ELLIPSIS
Exception raised:
Traceback (most recent call last):
File "/home/obspy/anaconda3/envs/tmp_build_docs/lib/python3.4/doctest.py", line 1318, in __run
compileflags, 1), test.globs)
File "<doctest obspy.clients.iris.client.Client.timeseries[5]>", line 1, in <module>
print(st[0].data) # doctest: +ELLIPSIS
NameError: name 'st' is not defined
----------------------------------------------------------------------
File "/private-backup/home/obspy/update-docs/src/obspy/obspy/clients/iris/client.py", line 318, in obspy.clients.iris.client.Client.timeseries
Failed example:
st = client.timeseries("IU", "ANMO", "00", "BHZ", dt, dt+10,
filter=["correct", "demean", "lp=2.0"])
Exception raised:
Traceback (most recent call last):
File "/private-backup/home/obspy/update-docs/src/obspy/obspy/clients/iris/client.py", line 340, in timeseries
data = self._fetch("timeseries", param_list=filter, **kwargs)
File "/private-backup/home/obspy/update-docs/src/obspy/obspy/clients/iris/client.py", line 133, in _fetch
response = urllib_request.urlopen(req, timeout=self.timeout)
File "/home/obspy/anaconda3/envs/tmp_build_docs/lib/python3.4/urllib/request.py", line 161, in urlopen
return opener.open(url, data, timeout)
File "/home/obspy/anaconda3/envs/tmp_build_docs/lib/python3.4/urllib/request.py", line 470, in open
response = meth(req, response)
File "/home/obspy/anaconda3/envs/tmp_build_docs/lib/python3.4/urllib/request.py", line 580, in http_response
'http', request, response, code, msg, hdrs)
File "/home/obspy/anaconda3/envs/tmp_build_docs/lib/python3.4/urllib/request.py", line 508, in error
return self._call_chain(*args)
File "/home/obspy/anaconda3/envs/tmp_build_docs/lib/python3.4/urllib/request.py", line 442, in _call_chain
result = func(*args)
File "/home/obspy/anaconda3/envs/tmp_build_docs/lib/python3.4/urllib/request.py", line 588, in http_error_default
raise HTTPError(req.full_url, code, msg, hdrs, fp)
urllib.error.HTTPError: HTTP Error 404: Not Found
During handling of the above exception, another exception occurred:
Traceback (most recent call last):
File "/home/obspy/anaconda3/envs/tmp_build_docs/lib/python3.4/doctest.py", line 1318, in __run
compileflags, 1), test.globs)
File "<doctest obspy.clients.iris.client.Client.timeseries[6]>", line 2, in <module>
filter=["correct", "demean", "lp=2.0"])
File "/private-backup/home/obspy/update-docs/src/obspy/obspy/clients/iris/client.py", line 344, in timeseries
raise Exception(msg)
Exception: No waveform data available (HTTPError: HTTP Error 404: Not Found)
----------------------------------------------------------------------
File "/private-backup/home/obspy/update-docs/src/obspy/obspy/clients/iris/client.py", line 320, in obspy.clients.iris.client.Client.timeseries
Failed example:
print(st[0].data) # doctest: +ELLIPSIS
Exception raised:
Traceback (most recent call last):
File "/home/obspy/anaconda3/envs/tmp_build_docs/lib/python3.4/doctest.py", line 1318, in __run
compileflags, 1), test.globs)
File "<doctest obspy.clients.iris.client.Client.timeseries[7]>", line 1, in <module>
print(st[0].data) # doctest: +ELLIPSIS
NameError: name 'st' is not defined
Traceback (most recent call last):
File "/private-backup/home/obspy/update-docs/src/obspy/obspy/clients/iris/tests/test_client.py", line 133, in test_evalresp
filename=tempfile)
File "/private-backup/home/obspy/update-docs/src/obspy/obspy/clients/iris/client.py", line 987, in evalresp
data = self._fetch("evalresp", **kwargs)
File "/private-backup/home/obspy/update-docs/src/obspy/obspy/clients/iris/client.py", line 133, in _fetch
response = urllib_request.urlopen(req, timeout=self.timeout)
File "/home/obspy/anaconda3/envs/tmp_build_docs/lib/python3.4/urllib/request.py", line 161, in urlopen
return opener.open(url, data, timeout)
File "/home/obspy/anaconda3/envs/tmp_build_docs/lib/python3.4/urllib/request.py", line 470, in open
response = meth(req, response)
File "/home/obspy/anaconda3/envs/tmp_build_docs/lib/python3.4/urllib/request.py", line 580, in http_response
'http', request, response, code, msg, hdrs)
File "/home/obspy/anaconda3/envs/tmp_build_docs/lib/python3.4/urllib/request.py", line 508, in error
return self._call_chain(*args)
File "/home/obspy/anaconda3/envs/tmp_build_docs/lib/python3.4/urllib/request.py", line 442, in _call_chain
result = func(*args)
File "/home/obspy/anaconda3/envs/tmp_build_docs/lib/python3.4/urllib/request.py", line 588, in http_error_default
raise HTTPError(req.full_url, code, msg, hdrs, fp)
urllib.error.HTTPError: HTTP Error 500: Internal Server Error
Traceback (most recent call last):
File "/private-backup/home/obspy/update-docs/src/obspy/obspy/clients/iris/client.py", line 340, in timeseries
data = self._fetch("timeseries", param_list=filter, **kwargs)
File "/private-backup/home/obspy/update-docs/src/obspy/obspy/clients/iris/client.py", line 133, in _fetch
response = urllib_request.urlopen(req, timeout=self.timeout)
File "/home/obspy/anaconda3/envs/tmp_build_docs/lib/python3.4/urllib/request.py", line 161, in urlopen
return opener.open(url, data, timeout)
File "/home/obspy/anaconda3/envs/tmp_build_docs/lib/python3.4/urllib/request.py", line 470, in open
response = meth(req, response)
File "/home/obspy/anaconda3/envs/tmp_build_docs/lib/python3.4/urllib/request.py", line 580, in http_response
'http', request, response, code, msg, hdrs)
File "/home/obspy/anaconda3/envs/tmp_build_docs/lib/python3.4/urllib/request.py", line 508, in error
return self._call_chain(*args)
File "/home/obspy/anaconda3/envs/tmp_build_docs/lib/python3.4/urllib/request.py", line 442, in _call_chain
result = func(*args)
File "/home/obspy/anaconda3/envs/tmp_build_docs/lib/python3.4/urllib/request.py", line 588, in http_error_default
raise HTTPError(req.full_url, code, msg, hdrs, fp)
urllib.error.HTTPError: HTTP Error 404: Not Found
During handling of the above exception, another exception occurred:
Traceback (most recent call last):
File "/private-backup/home/obspy/update-docs/src/obspy/obspy/clients/iris/tests/test_client.py", line 253, in test_timeseries
st1 = client.timeseries("IU", "ANMO", "00", "BHZ", t1, t2)
File "/private-backup/home/obspy/update-docs/src/obspy/obspy/clients/iris/client.py", line 344, in timeseries
raise Exception(msg)
Exception: No waveform data available (HTTPError: HTTP Error 404: Not Found)
Traceback (most recent call last):
File "/private-backup/home/obspy/update-docs/src/obspy/obspy/clients/neic/tests/test_client.py", line 71, in test_get_waveform_nscl
self.assertEqual(stats.sampling_rate, 20.0)
AssertionError: 40.0 != 20.0
Traceback (most recent call last):
File "/home/obspy/anaconda3/envs/tmp_build_docs/lib/python3.4/doctest.py", line 2187, in runTest
raise self.failureException(self.format_failure(new.getvalue()))
AssertionError: Failed doctest test for obspy.clients.neic.client.Client.get_waveforms
File "/private-backup/home/obspy/update-docs/src/obspy/obspy/clients/neic/client.py", line 73, in get_waveforms
----------------------------------------------------------------------
File "/private-backup/home/obspy/update-docs/src/obspy/obspy/clients/neic/client.py", line 113, in obspy.clients.neic.client.Client.get_waveforms
Failed example:
print(st) # doctest: +ELLIPSIS
Expected:
3 Trace(s) in Stream:
IU.ANMO.00.BH... | 20.0 Hz, 201 samples
IU.ANMO.00.BH... | 20.0 Hz, 201 samples
IU.ANMO.00.BH... | 20.0 Hz, 201 samples
Got:
3 Trace(s) in Stream:
IU.ANMO.00.BH2 | 2018-11-07T13:01:32.219539Z - 2018-11-07T13:01:42.219539Z | 40.0 Hz, 401 samples
IU.ANMO.00.BHZ | 2018-11-07T13:01:32.219538Z - 2018-11-07T13:01:42.219538Z | 40.0 Hz, 401 samples
IU.ANMO.00.BH1 | 2018-11-07T13:01:32.219538Z - 2018-11-07T13:01:42.219538Z | 40.0 Hz, 401 samples
Traceback (most recent call last):
File "/home/obspy/anaconda3/envs/tmp_build_docs/lib/python3.4/doctest.py", line 2187, in runTest
raise self.failureException(self.format_failure(new.getvalue()))
AssertionError: Failed doctest test for obspy.clients.neic.client.Client
File "/private-backup/home/obspy/update-docs/src/obspy/obspy/clients/neic/client.py", line 25, in Client
----------------------------------------------------------------------
File "/private-backup/home/obspy/update-docs/src/obspy/obspy/clients/neic/client.py", line 46, in obspy.clients.neic.client.Client
Failed example:
print(st) # doctest: +ELLIPSIS
Expected:
3 Trace(s) in Stream:
IU.ANMO.00.BH... | 20.0 Hz, 201 samples
IU.ANMO.00.BH... | 20.0 Hz, 201 samples
IU.ANMO.00.BH... | 20.0 Hz, 201 samples
Got:
3 Trace(s) in Stream:
IU.ANMO.00.BH2 | 2018-11-07T13:01:30.844539Z - 2018-11-07T13:01:40.844539Z | 40.0 Hz, 401 samples
IU.ANMO.00.BHZ | 2018-11-07T13:01:30.844538Z - 2018-11-07T13:01:40.844538Z | 40.0 Hz, 401 samples
IU.ANMO.00.BH1 | 2018-11-07T13:01:30.844538Z - 2018-11-07T13:01:40.844538Z | 40.0 Hz, 401 samples
----------------------------------------------------------------------
File "/private-backup/home/obspy/update-docs/src/obspy/obspy/clients/neic/client.py", line 52, in obspy.clients.neic.client.Client
Failed example:
print(st) # doctest: +ELLIPSIS
Expected:
3 Trace(s) in Stream:
IU.ANMO.00.BH... | 20.0 Hz, 201 samples
IU.ANMO.00.BH... | 20.0 Hz, 201 samples
IU.ANMO.00.BH... | 20.0 Hz, 201 samples
Got:
3 Trace(s) in Stream:
IU.ANMO.00.BH2 | 2018-11-07T13:01:30.844539Z - 2018-11-07T13:01:40.844539Z | 40.0 Hz, 401 samples
IU.ANMO.00.BHZ | 2018-11-07T13:01:30.844538Z - 2018-11-07T13:01:40.844538Z | 40.0 Hz, 401 samples
IU.ANMO.00.BH1 | 2018-11-07T13:01:30.844538Z - 2018-11-07T13:01:40.844538Z | 40.0 Hz, 401 samples
Traceback (most recent call last):
File "/home/obspy/anaconda3/envs/tmp_build_docs/lib/python3.4/doctest.py", line 2187, in runTest
raise self.failureException(self.format_failure(new.getvalue()))
AssertionError: Failed doctest test for obspy.clients.neic.client.Client.get_waveforms_nscl
File "/private-backup/home/obspy/update-docs/src/obspy/obspy/clients/neic/client.py", line 130, in get_waveforms_nscl
----------------------------------------------------------------------
File "/private-backup/home/obspy/update-docs/src/obspy/obspy/clients/neic/client.py", line 164, in obspy.clients.neic.client.Client.get_waveforms_nscl
Failed example:
print(st) # doctest: +ELLIPSIS
Expected:
3 Trace(s) in Stream:
IU.ANMO.00.BH... | 20.0 Hz, 201 samples
IU.ANMO.00.BH... | 20.0 Hz, 201 samples
IU.ANMO.00.BH... | 20.0 Hz, 201 samples
Got:
3 Trace(s) in Stream:
IU.ANMO.00.BH2 | 2018-11-07T13:01:32.969539Z - 2018-11-07T13:01:42.969539Z | 40.0 Hz, 401 samples
IU.ANMO.00.BHZ | 2018-11-07T13:01:32.969538Z - 2018-11-07T13:01:42.969538Z | 40.0 Hz, 401 samples
IU.ANMO.00.BH1 | 2018-11-07T13:01:32.969538Z - 2018-11-07T13:01:42.969538Z | 40.0 Hz, 401 samples
Traceback (most recent call last):
File "/home/obspy/anaconda3/envs/tmp_build_docs/lib/python3.4/doctest.py", line 2187, in runTest
raise self.failureException(self.format_failure(new.getvalue()))
AssertionError: Failed doctest test for obspy.clients.nrl.client.NRL.get_response
File "/private-backup/home/obspy/update-docs/src/obspy/obspy/clients/nrl/client.py", line 183, in get_response
----------------------------------------------------------------------
File "/private-backup/home/obspy/update-docs/src/obspy/obspy/clients/nrl/client.py", line 194, in obspy.clients.nrl.client.NRL.get_response
Failed example:
response = nrl.get_response(
sensor_keys=['Nanometrics', 'Trillium Compact', '120 s'],
datalogger_keys=['REF TEK', 'RT 130 & 130-SMA', '1', '200'])
Exception raised:
Traceback (most recent call last):
File "/home/obspy/anaconda3/envs/tmp_build_docs/lib/python3.4/doctest.py", line 1318, in __run
compileflags, 1), test.globs)
File "<doctest obspy.clients.nrl.client.NRL.get_response[1]>", line 3, in <module>
datalogger_keys=['REF TEK', 'RT 130 & 130-SMA', '1', '200'])
File "/private-backup/home/obspy/update-docs/src/obspy/obspy/clients/nrl/client.py", line 214, in get_response
sensor_resp = self.get_sensor_response(sensor_keys)
File "/private-backup/home/obspy/update-docs/src/obspy/obspy/clients/nrl/client.py", line 176, in get_sensor_response
sensor = sensor[key]
File "/private-backup/home/obspy/update-docs/src/obspy/obspy/clients/nrl/client.py", line 250, in __getitem__
value = super(NRLDict, self).__getitem__(name)
KeyError: 'Trillium Compact'
----------------------------------------------------------------------
File "/private-backup/home/obspy/update-docs/src/obspy/obspy/clients/nrl/client.py", line 197, in obspy.clients.nrl.client.NRL.get_response
Failed example:
print(response) # doctest: +NORMALIZE_WHITESPACE +ELLIPSIS
Exception raised:
Traceback (most recent call last):
File "/home/obspy/anaconda3/envs/tmp_build_docs/lib/python3.4/doctest.py", line 1318, in __run
compileflags, 1), test.globs)
File "<doctest obspy.clients.nrl.client.NRL.get_response[2]>", line 1, in <module>
print(response) # doctest: +NORMALIZE_WHITESPACE +ELLIPSIS
NameError: name 'response' is not defined
Traceback (most recent call last):
File "/private-backup/home/obspy/update-docs/src/obspy/obspy/clients/syngine/tests/test_client.py", line 264, in test_error_handling
self.assertIn("HTTP code 400 when", msg)
AssertionError: 'HTTP code 400 when' not found in 'HTTP code 404 when downloading \'http://service.iris.edu/irisws/syngine/1/query?format=miniseed&station=ANMO&eventid=GCMT%3AC201002270634A&network=IU&model=ak135f_5s&components=ABC\':\n\n<!doctype html>\n<html lang="en">\n <head>\n \n <title>\n \n IRIS: \n 404 Page Not Found Error\n\n \n </title>\n \n <meta name="keywords" content="seismology, seismological data,\n earthquakes, iris dmc" />\n <meta name="description" content="IRIS is a consortium of\n universities dedicated to the operation of science facilities\n for the acquisition, management, and distribution of seismological\n data." />\n <!-- Forces IE to render in \'latest\' compatible mode -->\n <meta http-equiv="X-UA-Compatible" content="IE=Edge"/>\n <meta charset="utf-8" />\n <meta name="viewport" content="width=device-width, initial-scale=1" />\n\n \n <link rel="stylesheet" media="all" type="text/css" href="/static/css/iris.css" />\n <link rel="stylesheet" media="print" type="text/css" href="/static/css/print.css" />\n\n <link rel="shortcut icon" href="/static/img/favicon.ico" />\n \n\n \n <script type="text/javascript" src="//ajax.googleapis.com/ajax/libs/jquery/1.11.1/jquery.js"></script>\n <script type="text/javascript" src="//netdna.bootstrapcdn.com/bootstrap/3.3.1/js/bootstrap.min.js"></script>\n\n \n <script>\n (function(i,s,o,g,r,a,m){i[\'GoogleAnalyticsObject\']=r;i[r]=i[r]||function(){\n (i[r].q=i[r].q||[]).push(arguments)},i[r].l=1*new Date();a=s.createElement(o),\n m=s.getElementsByTagName(o)[0];a.async=1;a.src=g;m.parentNode.insertBefore(a,m)\n })(window,document,\'script\',\'//www.google-analytics.com/analytics.js\',\'ga\');\n\n ga(\'create\', \'UA-1860730-1\', \'iris.edu\');\n ga(\'send\', \'pageview\');\n\n </script>\n \n\n\n \n \n \n </head>\n\n <body>\n \n <div class="container">\n <div class="container-inner">\n\n \n<header>\n <div id="header">\n <div id="header-left">\n <div id="logo">\n <a href="http://ds.iris.edu/hq/" title="IRIS">\n <img alt="IRIS" src="/static/img/layout/logos/iris_logo_shadow.png"/>\n </a>\n </div>\n <div id="logo-name">\n Incorporated Research Institutions for Seismology\n </div>\n </div>\n <!-- #header-right -->\n <div id="header-right">\n <ul id="top-menu">\n <li>\n <a href="http://ds.iris.edu/ds/nodes/dmc/" title="IRIS DMC">DMC</a>\n </li>\n <li>\n <a href="http://www.iris.edu/hq" title="IRIS HQ">Home</a>\n </li>\n </ul>\n <div id="nsf-logo">\n <a href="http://www.nsf.gov/" target="_blank" title="The National Science Foundation">\n <img alt="The National Science Foundation" src="/static/img/layout/logos/nsf.png"/>\n </a>\n </div>\n <!-- #nsf -->\n </div>\n <div class="shadow-down"></div>\n </div>\n <!-- #header -->\n <!--Iris only meny -->\n</header>\n\n\n\n <div class="wrapper">\n\n \n\n\n <div>\n \n <ul class="breadcrumb">\n \n <li>\n <a href="/">Web Services</a>\n </li>\n \n </ul>\n \n </div>\n\n \n <div id="page">\n\n \n \n\n \n \n\n <div id="page-content">\n\n \n\n \n \n\n\n \n\n \n <div class="alert alert-block alert-info">\n <h4>Maintenance Work on Wednesday 7 Nov</h4>\n <small>Posted:\n <time pubdate datetime="2018-11-06T11:58:28 PST">\n 11/06/2018 11:58 a.m.\n </time>\n </small>\n \t<p>Data Services will be performing a system upgrade on <strong>Wednesday 7 November</strong>, starting around <strong>06:30 <span class="caps">PST</span></strong>. This should have minimal impact on users, but there may be some temporary reductions in functionality throughout the day.</p>\n </div>\n \n\n\n \n\n <h1>\n \n \n 404 Page Not Found Error\n\n \n </h1>\n\n <div id="content">\n \n <p>We are sorry, but the page you are requesting does not exist.</p>\n <p>Please check the URL path you are requested and try again.</p>\n <p>If you believe the error to be ours, please\n <a href="http://www.iris.edu/hq/contact">contact</a>\n us.</p>\n\n </div>\n\n \n\n </div>\n\n \n\n\n </div>\n\n </div>\n\n \n <div id="footer">\n <div class="shadow-up"></div>\n <div id="footer-bottom">\n <ul>\n <li><span><a href="http://www.iris.edu/hq" title="IRIS"><img src="/static/img/layout/logos/URL_TXT.png" /></a></span></li>\n <li><em><a href="http://www.nsf.gov/" title="The National Science Foundation" target="_blank">Sponsored by the National Science Foundation</a></em></li>\n <li><a href="http://www.iris.edu/hq" title="IRIS">&copy; Copyright 2018 IRIS</a></li>\n <li>1200 New York Avenue NW, Suite 400, Washington, DC 20005, 202-682-2220</li>\n <li><a href="mailto:info@iris.edu">info@iris.edu</a></li>\n </ul>\n </div><!-- #footer-bottom -->\n </div><!-- #footer -->\n\n\n <div class="cachebuster" title="Click to force a refresh.">\n Page built 10:01:49 | v.65d82faf\n </div>\n <script>\n /* Cachebuster -- this is a link to the current page with a trailing query parameter, which will cause the cache to be bypassed */\n $(function() {\n // Cachebuster goes in the search attribute (eg. the query string)\n var search = window.location.search;\n // Only operate if there\'s no search or it\'s an existing cachebuster parameter\n if (!search || search.match(/^\\?\\d+$/)) {\n $(\'.cachebuster\').click(function() {\n window.location.search = \'?\' + (new Date()).getTime();\n });\n } else {\n $(\'.cachebuster\').empty();\n }\n });\n </script>\n\n\n </div>\n </div><!-- #site-container -->\n \n </body>\n</html>'
Traceback (most recent call last):
File "/private-backup/home/obspy/update-docs/src/obspy/obspy/clients/syngine/tests/test_client.py", line 447, in test_reading_saczip_files
endtime="P+10", components="Z", format="saczip")
File "/private-backup/home/obspy/update-docs/src/obspy/obspy/clients/syngine/client.py", line 371, in get_waveforms
filename=filename)
File "/private-backup/home/obspy/update-docs/src/obspy/obspy/clients/base.py", line 245, in _download
self._handle_requests_http_error(r)
File "/private-backup/home/obspy/update-docs/src/obspy/obspy/clients/syngine/client.py", line 62, in _handle_requests_http_error
raise ClientHTTPException(msg.strip())
obspy.clients.base.ClientHTTPException: HTTP code 404 when downloading 'http://service.iris.edu/irisws/syngine/1/query?endtime=P%2B10&format=saczip&station=ANMO&eventid=GCMT%3AC201002270634A&network=IU&model=test&components=Z&starttime=P-10':
<!doctype html>
<html lang="en">
<head>
<title>
IRIS:
404 Page Not Found Error
</title>
<meta name="keywords" content="seismology, seismological data,
earthquakes, iris dmc" />
<meta name="description" content="IRIS is a consortium of
universities dedicated to the operation of science facilities
for the acquisition, management, and distribution of seismological
data." />
<!-- Forces IE to render in 'latest' compatible mode -->
<meta http-equiv="X-UA-Compatible" content="IE=Edge"/>
<meta charset="utf-8" />
<meta name="viewport" content="width=device-width, initial-scale=1" />
<link rel="stylesheet" media="all" type="text/css" href="/static/css/iris.css" />
<link rel="stylesheet" media="print" type="text/css" href="/static/css/print.css" />
<link rel="shortcut icon" href="/static/img/favicon.ico" />
<script type="text/javascript" src="//ajax.googleapis.com/ajax/libs/jquery/1.11.1/jquery.js"></script>
<script type="text/javascript" src="//netdna.bootstrapcdn.com/bootstrap/3.3.1/js/bootstrap.min.js"></script>
<script>
(function(i,s,o,g,r,a,m){i['GoogleAnalyticsObject']=r;i[r]=i[r]||function(){
(i[r].q=i[r].q||[]).push(arguments)},i[r].l=1*new Date();a=s.createElement(o),
m=s.getElementsByTagName(o)[0];a.async=1;a.src=g;m.parentNode.insertBefore(a,m)
})(window,document,'script','//www.google-analytics.com/analytics.js','ga');
ga('create', 'UA-1860730-1', 'iris.edu');
ga('send', 'pageview');
</script>
</head>
<body>
<div class="container">
<div class="container-inner">
<header>
<div id="header">
<div id="header-left">
<div id="logo">
<a href="http://ds.iris.edu/hq/" title="IRIS">
<img alt="IRIS" src="/static/img/layout/logos/iris_logo_shadow.png"/>
</a>
</div>
<div id="logo-name">
Incorporated Research Institutions for Seismology
</div>
</div>
<!-- #header-right -->
<div id="header-right">
<ul id="top-menu">
<li>
<a href="http://ds.iris.edu/ds/nodes/dmc/" title="IRIS DMC">DMC</a>
</li>
<li>
<a href="http://www.iris.edu/hq" title="IRIS HQ">Home</a>
</li>
</ul>
<div id="nsf-logo">
<a href="http://www.nsf.gov/" target="_blank" title="The National Science Foundation">
<img alt="The National Science Foundation" src="/static/img/layout/logos/nsf.png"/>
</a>
</div>
<!-- #nsf -->
</div>
<div class="shadow-down"></div>
</div>
<!-- #header -->
<!--Iris only meny -->
</header>
<div class="wrapper">
<div>
<ul class="breadcrumb">
<li>
<a href="/">Web Services</a>
</li>
</ul>
</div>
<div id="page">
<div id="page-content">
<div class="alert alert-block alert-info">
<h4>Maintenance Work on Wednesday 7 Nov</h4>
<small>Posted:
<time pubdate datetime="2018-11-06T11:58:28 PST">
11/06/2018 11:58 a.m.
</time>
</small>
	<p>Data Services will be performing a system upgrade on <strong>Wednesday 7 November</strong>, starting around <strong>06:30 <span class="caps">PST</span></strong>. This should have minimal impact on users, but there may be some temporary reductions in functionality throughout the day.</p>
</div>
<h1>
404 Page Not Found Error
</h1>
<div id="content">
<p>We are sorry, but the page you are requesting does not exist.</p>
<p>Please check the URL path you are requested and try again.</p>
<p>If you believe the error to be ours, please
<a href="http://www.iris.edu/hq/contact">contact</a>
us.</p>
</div>
</div>
</div>
</div>
<div id="footer">
<div class="shadow-up"></div>
<div id="footer-bottom">
<ul>
<li><span><a href="http://www.iris.edu/hq" title="IRIS"><img src="/static/img/layout/logos/URL_TXT.png" /></a></span></li>
<li><em><a href="http://www.nsf.gov/" title="The National Science Foundation" target="_blank">Sponsored by the National Science Foundation</a></em></li>
<li><a href="http://www.iris.edu/hq" title="IRIS">&copy; Copyright 2018 IRIS</a></li>
<li>1200 New York Avenue NW, Suite 400, Washington, DC 20005, 202-682-2220</li>
<li><a href="mailto:info@iris.edu">info@iris.edu</a></li>
</ul>
</div><!-- #footer-bottom -->
</div><!-- #footer -->
<div class="cachebuster" title="Click to force a refresh.">
Page built 10:01:51 | v.65d82faf
</div>
<script>
/* Cachebuster -- this is a link to the current page with a trailing query parameter, which will cause the cache to be bypassed */
$(function() {
// Cachebuster goes in the search attribute (eg. the query string)
var search = window.location.search;
// Only operate if there's no search or it's an existing cachebuster parameter
if (!search || search.match(/^\?\d+$/)) {
$('.cachebuster').click(function() {
window.location.search = '?' + (new Date()).getTime();
});
} else {
$('.cachebuster').empty();
}
});
</script>
</div>
</div><!-- #site-container -->
</body>
</html>
Traceback (most recent call last):
File "/home/obspy/anaconda3/envs/tmp_build_docs/lib/python3.4/doctest.py", line 2187, in runTest
raise self.failureException(self.format_failure(new.getvalue()))
AssertionError: Failed doctest test for obspy.clients.syngine.client.Client.get_model_info
File "/private-backup/home/obspy/update-docs/src/obspy/obspy/clients/syngine/client.py", line 64, in get_model_info
----------------------------------------------------------------------
File "/private-backup/home/obspy/update-docs/src/obspy/obspy/clients/syngine/client.py", line 72, in obspy.clients.syngine.client.Client.get_model_info
Failed example:
db_info = c.get_model_info(model_name="ak135f_5s")
Exception raised:
Traceback (most recent call last):
File "/home/obspy/anaconda3/envs/tmp_build_docs/lib/python3.4/doctest.py", line 1318, in __run
compileflags, 1), test.globs)
File "<doctest obspy.clients.syngine.client.Client.get_model_info[2]>", line 1, in <module>
db_info = c.get_model_info(model_name="ak135f_5s")
File "/private-backup/home/obspy/update-docs/src/obspy/obspy/clients/syngine/client.py", line 83, in get_model_info
params={"model": model_name})
File "/private-backup/home/obspy/update-docs/src/obspy/obspy/clients/base.py", line 245, in _download
self._handle_requests_http_error(r)
File "/private-backup/home/obspy/update-docs/src/obspy/obspy/clients/syngine/client.py", line 62, in _handle_requests_http_error
raise ClientHTTPException(msg.strip())
obspy.clients.base.ClientHTTPException: HTTP code 404 when downloading 'http://service.iris.edu/irisws/syngine/1/info?model=ak135f_5s':
<!doctype html>
<html lang="en">
<head>
<title>
IRIS:
404 Page Not Found Error
</title>
<meta name="keywords" content="seismology, seismological data,
earthquakes, iris dmc" />
<meta name="description" content="IRIS is a consortium of
universities dedicated to the operation of science facilities
for the acquisition, management, and distribution of seismological
data." />
<!-- Forces IE to render in 'latest' compatible mode -->
<meta http-equiv="X-UA-Compatible" content="IE=Edge"/>
<meta charset="utf-8" />
<meta name="viewport" content="width=device-width, initial-scale=1" />
<link rel="stylesheet" media="all" type="text/css" href="/static/css/iris.css" />
<link rel="stylesheet" media="print" type="text/css" href="/static/css/print.css" />
<link rel="shortcut icon" href="/static/img/favicon.ico" />
<script type="text/javascript" src="//ajax.googleapis.com/ajax/libs/jquery/1.11.1/jquery.js"></script>
<script type="text/javascript" src="//netdna.bootstrapcdn.com/bootstrap/3.3.1/js/bootstrap.min.js"></script>
<script>
(function(i,s,o,g,r,a,m){i['GoogleAnalyticsObject']=r;i[r]=i[r]||function(){
(i[r].q=i[r].q||[]).push(arguments)},i[r].l=1*new Date();a=s.createElement(o),
m=s.getElementsByTagName(o)[0];a.async=1;a.src=g;m.parentNode.insertBefore(a,m)
})(window,document,'script','//www.google-analytics.com/analytics.js','ga');
ga('create', 'UA-1860730-1', 'iris.edu');
ga('send', 'pageview');
</script>
</head>
<body>
<div class="container">
<div class="container-inner">
<header>
<div id="header">
<div id="header-left">
<div id="logo">
<a href="http://ds.iris.edu/hq/" title="IRIS">
<img alt="IRIS" src="/static/img/layout/logos/iris_logo_shadow.png"/>
</a>
</div>
<div id="logo-name">
Incorporated Research Institutions for Seismology
</div>
</div>
<!-- #header-right -->
<div id="header-right">
<ul id="top-menu">
<li>
<a href="http://ds.iris.edu/ds/nodes/dmc/" title="IRIS DMC">DMC</a>
</li>
<li>
<a href="http://www.iris.edu/hq" title="IRIS HQ">Home</a>
</li>
</ul>
<div id="nsf-logo">
<a href="http://www.nsf.gov/" target="_blank" title="The National Science Foundation">
<img alt="The National Science Foundation" src="/static/img/layout/logos/nsf.png"/>
</a>
</div>
<!-- #nsf -->
</div>
<div class="shadow-down"></div>
</div>
<!-- #header -->
<!--Iris only meny -->
</header>
<div class="wrapper">
<div>
<ul class="breadcrumb">
<li>
<a href="/">Web Services</a>
</li>
</ul>
</div>
<div id="page">
<div id="page-content">
<div class="alert alert-block alert-info">
<h4>Maintenance Work on Wednesday 7 Nov</h4>
<small>Posted:
<time pubdate datetime="2018-11-06T11:58:28 PST">
11/06/2018 11:58 a.m.
</time>
</small>
	<p>Data Services will be performing a system upgrade on <strong>Wednesday 7 November</strong>, starting around <strong>06:30 <span class="caps">PST</span></strong>. This should have minimal impact on users, but there may be some temporary reductions in functionality throughout the day.</p>
</div>
<h1>
404 Page Not Found Error
</h1>
<div id="content">
<p>We are sorry, but the page you are requesting does not exist.</p>
<p>Please check the URL path you are requested and try again.</p>
<p>If you believe the error to be ours, please
<a href="http://www.iris.edu/hq/contact">contact</a>
us.</p>
</div>
</div>
</div>
</div>
<div id="footer">
<div class="shadow-up"></div>
<div id="footer-bottom">
<ul>
<li><span><a href="http://www.iris.edu/hq" title="IRIS"><img src="/static/img/layout/logos/URL_TXT.png" /></a></span></li>
<li><em><a href="http://www.nsf.gov/" title="The National Science Foundation" target="_blank">Sponsored by the National Science Foundation</a></em></li>
<li><a href="http://www.iris.edu/hq" title="IRIS">&copy; Copyright 2018 IRIS</a></li>
<li>1200 New York Avenue NW, Suite 400, Washington, DC 20005, 202-682-2220</li>
<li><a href="mailto:info@iris.edu">info@iris.edu</a></li>
</ul>
</div><!-- #footer-bottom -->
</div><!-- #footer -->
<div class="cachebuster" title="Click to force a refresh.">
Page built 10:01:44 | v.65d82faf
</div>
<script>
/* Cachebuster -- this is a link to the current page with a trailing query parameter, which will cause the cache to be bypassed */
$(function() {
// Cachebuster goes in the search attribute (eg. the query string)
var search = window.location.search;
// Only operate if there's no search or it's an existing cachebuster parameter
if (!search || search.match(/^\?\d+$/)) {
$('.cachebuster').click(function() {
window.location.search = '?' + (new Date()).getTime();
});
} else {
$('.cachebuster').empty();
}
});
</script>
</div>
</div><!-- #site-container -->
</body>
</html>
----------------------------------------------------------------------
File "/private-backup/home/obspy/update-docs/src/obspy/obspy/clients/syngine/client.py", line 73, in obspy.clients.syngine.client.Client.get_model_info
Failed example:
print(db_info.period)
Exception raised:
Traceback (most recent call last):
File "/home/obspy/anaconda3/envs/tmp_build_docs/lib/python3.4/doctest.py", line 1318, in __run
compileflags, 1), test.globs)
File "<doctest obspy.clients.syngine.client.Client.get_model_info[3]>", line 1, in <module>
print(db_info.period)
NameError: name 'db_info' is not defined
Traceback (most recent call last):
File "/private-backup/home/obspy/update-docs/src/obspy/obspy/clients/syngine/tests/test_client.py", line 353, in test_get_waveforms
components="Z")
File "/private-backup/home/obspy/update-docs/src/obspy/obspy/clients/syngine/client.py", line 371, in get_waveforms
filename=filename)
File "/private-backup/home/obspy/update-docs/src/obspy/obspy/clients/base.py", line 245, in _download
self._handle_requests_http_error(r)
File "/private-backup/home/obspy/update-docs/src/obspy/obspy/clients/syngine/client.py", line 62, in _handle_requests_http_error
raise ClientHTTPException(msg.strip())
obspy.clients.base.ClientHTTPException: HTTP code 404 when downloading 'http://service.iris.edu/irisws/syngine/1/query?format=miniseed&station=ANMO&eventid=GCMT%3AC201002270634A&network=IU&model=test&components=Z':
<!doctype html>
<html lang="en">
<head>
<title>
IRIS:
404 Page Not Found Error
</title>
<meta name="keywords" content="seismology, seismological data,
earthquakes, iris dmc" />
<meta name="description" content="IRIS is a consortium of
universities dedicated to the operation of science facilities
for the acquisition, management, and distribution of seismological
data." />
<!-- Forces IE to render in 'latest' compatible mode -->
<meta http-equiv="X-UA-Compatible" content="IE=Edge"/>
<meta charset="utf-8" />
<meta name="viewport" content="width=device-width, initial-scale=1" />
<link rel="stylesheet" media="all" type="text/css" href="/static/css/iris.css" />
<link rel="stylesheet" media="print" type="text/css" href="/static/css/print.css" />
<link rel="shortcut icon" href="/static/img/favicon.ico" />
<script type="text/javascript" src="//ajax.googleapis.com/ajax/libs/jquery/1.11.1/jquery.js"></script>
<script type="text/javascript" src="//netdna.bootstrapcdn.com/bootstrap/3.3.1/js/bootstrap.min.js"></script>
<script>
(function(i,s,o,g,r,a,m){i['GoogleAnalyticsObject']=r;i[r]=i[r]||function(){
(i[r].q=i[r].q||[]).push(arguments)},i[r].l=1*new Date();a=s.createElement(o),
m=s.getElementsByTagName(o)[0];a.async=1;a.src=g;m.parentNode.insertBefore(a,m)
})(window,document,'script','//www.google-analytics.com/analytics.js','ga');
ga('create', 'UA-1860730-1', 'iris.edu');
ga('send', 'pageview');
</script>
</head>
<body>
<div class="container">
<div class="container-inner">
<header>
<div id="header">
<div id="header-left">
<div id="logo">
<a href="http://ds.iris.edu/hq/" title="IRIS">
<img alt="IRIS" src="/static/img/layout/logos/iris_logo_shadow.png"/>
</a>
</div>
<div id="logo-name">
Incorporated Research Institutions for Seismology
</div>
</div>
<!-- #header-right -->
<div id="header-right">
<ul id="top-menu">
<li>
<a href="http://ds.iris.edu/ds/nodes/dmc/" title="IRIS DMC">DMC</a>
</li>
<li>
<a href="http://www.iris.edu/hq" title="IRIS HQ">Home</a>
</li>
</ul>
<div id="nsf-logo">
<a href="http://www.nsf.gov/" target="_blank" title="The National Science Foundation">
<img alt="The National Science Foundation" src="/static/img/layout/logos/nsf.png"/>
</a>
</div>
<!-- #nsf -->
</div>
<div class="shadow-down"></div>
</div>
<!-- #header -->
<!--Iris only meny -->
</header>
<div class="wrapper">
<div>
<ul class="breadcrumb">
<li>
<a href="/">Web Services</a>
</li>
</ul>
</div>
<div id="page">
<div id="page-content">
<div class="alert alert-block alert-info">
<h4>Maintenance Work on Wednesday 7 Nov</h4>
<small>Posted:
<time pubdate datetime="2018-11-06T11:58:28 PST">
11/06/2018 11:58 a.m.
</time>
</small>
	<p>Data Services will be performing a system upgrade on <strong>Wednesday 7 November</strong>, starting around <strong>06:30 <span class="caps">PST</span></strong>. This should have minimal impact on users, but there may be some temporary reductions in functionality throughout the day.</p>
</div>
<h1>
404 Page Not Found Error
</h1>
<div id="content">
<p>We are sorry, but the page you are requesting does not exist.</p>
<p>Please check the URL path you are requested and try again.</p>
<p>If you believe the error to be ours, please
<a href="http://www.iris.edu/hq/contact">contact</a>
us.</p>
</div>
</div>
</div>
</div>
<div id="footer">
<div class="shadow-up"></div>
<div id="footer-bottom">
<ul>
<li><span><a href="http://www.iris.edu/hq" title="IRIS"><img src="/static/img/layout/logos/URL_TXT.png" /></a></span></li>
<li><em><a href="http://www.nsf.gov/" title="The National Science Foundation" target="_blank">Sponsored by the National Science Foundation</a></em></li>
<li><a href="http://www.iris.edu/hq" title="IRIS">&copy; Copyright 2018 IRIS</a></li>
<li>1200 New York Avenue NW, Suite 400, Washington, DC 20005, 202-682-2220</li>
<li><a href="mailto:info@iris.edu">info@iris.edu</a></li>
</ul>
</div><!-- #footer-bottom -->
</div><!-- #footer -->
<div class="cachebuster" title="Click to force a refresh.">
Page built 10:01:50 | v.65d82faf
</div>
<script>
/* Cachebuster -- this is a link to the current page with a trailing query parameter, which will cause the cache to be bypassed */
$(function() {
// Cachebuster goes in the search attribute (eg. the query string)
var search = window.location.search;
// Only operate if there's no search or it's an existing cachebuster parameter
if (!search || search.match(/^\?\d+$/)) {
$('.cachebuster').click(function() {
window.location.search = '?' + (new Date()).getTime();
});
} else {
$('.cachebuster').empty();
}
});
</script>
</div>
</div><!-- #site-container -->
</body>
</html>
Traceback (most recent call last):
File "/private-backup/home/obspy/update-docs/src/obspy/obspy/clients/syngine/tests/test_client.py", line 88, in test_get_available_models
models = self.c.get_available_models()
File "/private-backup/home/obspy/update-docs/src/obspy/obspy/clients/syngine/client.py", line 95, in get_available_models
self._download(self._get_url("models")))
File "/private-backup/home/obspy/update-docs/src/obspy/obspy/clients/base.py", line 245, in _download
self._handle_requests_http_error(r)
File "/private-backup/home/obspy/update-docs/src/obspy/obspy/clients/syngine/client.py", line 62, in _handle_requests_http_error
raise ClientHTTPException(msg.strip())
obspy.clients.base.ClientHTTPException: HTTP code 404 when downloading 'http://service.iris.edu/irisws/syngine/1/models':
<!doctype html>
<html lang="en">
<head>
<title>
IRIS:
404 Page Not Found Error
</title>
<meta name="keywords" content="seismology, seismological data,
earthquakes, iris dmc" />
<meta name="description" content="IRIS is a consortium of
universities dedicated to the operation of science facilities
for the acquisition, management, and distribution of seismological
data." />
<!-- Forces IE to render in 'latest' compatible mode -->
<meta http-equiv="X-UA-Compatible" content="IE=Edge"/>
<meta charset="utf-8" />
<meta name="viewport" content="width=device-width, initial-scale=1" />
<link rel="stylesheet" media="all" type="text/css" href="/static/css/iris.css" />
<link rel="stylesheet" media="print" type="text/css" href="/static/css/print.css" />
<link rel="shortcut icon" href="/static/img/favicon.ico" />
<script type="text/javascript" src="//ajax.googleapis.com/ajax/libs/jquery/1.11.1/jquery.js"></script>
<script type="text/javascript" src="//netdna.bootstrapcdn.com/bootstrap/3.3.1/js/bootstrap.min.js"></script>
<script>
(function(i,s,o,g,r,a,m){i['GoogleAnalyticsObject']=r;i[r]=i[r]||function(){
(i[r].q=i[r].q||[]).push(arguments)},i[r].l=1*new Date();a=s.createElement(o),
m=s.getElementsByTagName(o)[0];a.async=1;a.src=g;m.parentNode.insertBefore(a,m)
})(window,document,'script','//www.google-analytics.com/analytics.js','ga');
ga('create', 'UA-1860730-1', 'iris.edu');
ga('send', 'pageview');
</script>
</head>
<body>
<div class="container">
<div class="container-inner">
<header>
<div id="header">
<div id="header-left">
<div id="logo">
<a href="http://ds.iris.edu/hq/" title="IRIS">
<img alt="IRIS" src="/static/img/layout/logos/iris_logo_shadow.png"/>
</a>
</div>
<div id="logo-name">
Incorporated Research Institutions for Seismology
</div>
</div>
<!-- #header-right -->
<div id="header-right">
<ul id="top-menu">
<li>
<a href="http://ds.iris.edu/ds/nodes/dmc/" title="IRIS DMC">DMC</a>
</li>
<li>
<a href="http://www.iris.edu/hq" title="IRIS HQ">Home</a>
</li>
</ul>
<div id="nsf-logo">
<a href="http://www.nsf.gov/" target="_blank" title="The National Science Foundation">
<img alt="The National Science Foundation" src="/static/img/layout/logos/nsf.png"/>
</a>
</div>
<!-- #nsf -->
</div>
<div class="shadow-down"></div>
</div>
<!-- #header -->
<!--Iris only meny -->
</header>
<div class="wrapper">
<div>
<ul class="breadcrumb">
<li>
<a href="/">Web Services</a>
</li>
</ul>
</div>
<div id="page">
<div id="page-content">
<div class="alert alert-block alert-info">
<h4>Maintenance Work on Wednesday 7 Nov</h4>
<small>Posted:
<time pubdate datetime="2018-11-06T11:58:28 PST">
11/06/2018 11:58 a.m.
</time>
</small>
	<p>Data Services will be performing a system upgrade on <strong>Wednesday 7 November</strong>, starting around <strong>06:30 <span class="caps">PST</span></strong>. This should have minimal impact on users, but there may be some temporary reductions in functionality throughout the day.</p>
</div>
<h1>
404 Page Not Found Error
</h1>
<div id="content">
<p>We are sorry, but the page you are requesting does not exist.</p>
<p>Please check the URL path you are requested and try again.</p>
<p>If you believe the error to be ours, please
<a href="http://www.iris.edu/hq/contact">contact</a>
us.</p>
</div>
</div>
</div>
</div>
<div id="footer">
<div class="shadow-up"></div>
<div id="footer-bottom">
<ul>
<li><span><a href="http://www.iris.edu/hq" title="IRIS"><img src="/static/img/layout/logos/URL_TXT.png" /></a></span></li>
<li><em><a href="http://www.nsf.gov/" title="The National Science Foundation" target="_blank">Sponsored by the National Science Foundation</a></em></li>
<li><a href="http://www.iris.edu/hq" title="IRIS">&copy; Copyright 2018 IRIS</a></li>
<li>1200 New York Avenue NW, Suite 400, Washington, DC 20005, 202-682-2220</li>
<li><a href="mailto:info@iris.edu">info@iris.edu</a></li>
</ul>
</div><!-- #footer-bottom -->
</div><!-- #footer -->
<div class="cachebuster" title="Click to force a refresh.">
Page built 10:01:49 | v.65d82faf
</div>
<script>
/* Cachebuster -- this is a link to the current page with a trailing query parameter, which will cause the cache to be bypassed */
$(function() {
// Cachebuster goes in the search attribute (eg. the query string)
var search = window.location.search;
// Only operate if there's no search or it's an existing cachebuster parameter
if (!search || search.match(/^\?\d+$/)) {
$('.cachebuster').click(function() {
window.location.search = '?' + (new Date()).getTime();
});
} else {
$('.cachebuster').empty();
}
});
</script>
</div>
</div><!-- #site-container -->
</body>
</html>
Traceback (most recent call last):
File "/home/obspy/anaconda3/envs/tmp_build_docs/lib/python3.4/doctest.py", line 2187, in runTest
raise self.failureException(self.format_failure(new.getvalue()))
AssertionError: Failed doctest test for obspy.clients.syngine.__init__
File "/private-backup/home/obspy/update-docs/src/obspy/obspy/clients/syngine/__init__.py", line 1, in __init__
----------------------------------------------------------------------
File "/private-backup/home/obspy/update-docs/src/obspy/obspy/clients/syngine/__init__.py", line 28, in obspy.clients.syngine.__init__
Failed example:
st = client.get_waveforms(model="ak135f_5s", network="IU", station="ANMO",
eventid="GCMT:C201002270634A")
Exception raised:
Traceback (most recent call last):
File "/home/obspy/anaconda3/envs/tmp_build_docs/lib/python3.4/doctest.py", line 1318, in __run
compileflags, 1), test.globs)
File "<doctest obspy.clients.syngine.__init__[2]>", line 2, in <module>
eventid="GCMT:C201002270634A")
File "/private-backup/home/obspy/update-docs/src/obspy/obspy/clients/syngine/client.py", line 371, in get_waveforms
filename=filename)
File "/private-backup/home/obspy/update-docs/src/obspy/obspy/clients/base.py", line 245, in _download
self._handle_requests_http_error(r)
File "/private-backup/home/obspy/update-docs/src/obspy/obspy/clients/syngine/client.py", line 62, in _handle_requests_http_error
raise ClientHTTPException(msg.strip())
obspy.clients.base.ClientHTTPException: HTTP code 404 when downloading 'http://service.iris.edu/irisws/syngine/1/query?model=ak135f_5s&format=miniseed&station=ANMO&eventid=GCMT%3AC201002270634A&network=IU':
<!doctype html>
<html lang="en">
<head>
<title>
IRIS:
404 Page Not Found Error
</title>
<meta name="keywords" content="seismology, seismological data,
earthquakes, iris dmc" />
<meta name="description" content="IRIS is a consortium of
universities dedicated to the operation of science facilities
for the acquisition, management, and distribution of seismological
data." />
<!-- Forces IE to render in 'latest' compatible mode -->
<meta http-equiv="X-UA-Compatible" content="IE=Edge"/>
<meta charset="utf-8" />
<meta name="viewport" content="width=device-width, initial-scale=1" />
<link rel="stylesheet" media="all" type="text/css" href="/static/css/iris.css" />
<link rel="stylesheet" media="print" type="text/css" href="/static/css/print.css" />
<link rel="shortcut icon" href="/static/img/favicon.ico" />
<script type="text/javascript" src="//ajax.googleapis.com/ajax/libs/jquery/1.11.1/jquery.js"></script>
<script type="text/javascript" src="//netdna.bootstrapcdn.com/bootstrap/3.3.1/js/bootstrap.min.js"></script>
<script>
(function(i,s,o,g,r,a,m){i['GoogleAnalyticsObject']=r;i[r]=i[r]||function(){
(i[r].q=i[r].q||[]).push(arguments)},i[r].l=1*new Date();a=s.createElement(o),
m=s.getElementsByTagName(o)[0];a.async=1;a.src=g;m.parentNode.insertBefore(a,m)
})(window,document,'script','//www.google-analytics.com/analytics.js','ga');
ga('create', 'UA-1860730-1', 'iris.edu');
ga('send', 'pageview');
</script>
</head>
<body>
<div class="container">
<div class="container-inner">
<header>
<div id="header">
<div id="header-left">
<div id="logo">
<a href="http://ds.iris.edu/hq/" title="IRIS">
<img alt="IRIS" src="/static/img/layout/logos/iris_logo_shadow.png"/>
</a>
</div>
<div id="logo-name">
Incorporated Research Institutions for Seismology
</div>
</div>
<!-- #header-right -->
<div id="header-right">
<ul id="top-menu">
<li>
<a href="http://ds.iris.edu/ds/nodes/dmc/" title="IRIS DMC">DMC</a>
</li>
<li>
<a href="http://www.iris.edu/hq" title="IRIS HQ">Home</a>
</li>
</ul>
<div id="nsf-logo">
<a href="http://www.nsf.gov/" target="_blank" title="The National Science Foundation">
<img alt="The National Science Foundation" src="/static/img/layout/logos/nsf.png"/>
</a>
</div>
<!-- #nsf -->
</div>
<div class="shadow-down"></div>
</div>
<!-- #header -->
<!--Iris only meny -->
</header>
<div class="wrapper">
<div>
<ul class="breadcrumb">
<li>
<a href="/">Web Services</a>
</li>
</ul>
</div>
<div id="page">
<div id="page-content">
<div class="alert alert-block alert-info">
<h4>Maintenance Work on Wednesday 7 Nov</h4>
<small>Posted:
<time pubdate datetime="2018-11-06T11:58:28 PST">
11/06/2018 11:58 a.m.
</time>
</small>
	<p>Data Services will be performing a system upgrade on <strong>Wednesday 7 November</strong>, starting around <strong>06:30 <span class="caps">PST</span></strong>. This should have minimal impact on users, but there may be some temporary reductions in functionality throughout the day.</p>
</div>
<h1>
404 Page Not Found Error
</h1>
<div id="content">
<p>We are sorry, but the page you are requesting does not exist.</p>
<p>Please check the URL path you are requested and try again.</p>
<p>If you believe the error to be ours, please
<a href="http://www.iris.edu/hq/contact">contact</a>
us.</p>
</div>
</div>
</div>
</div>
<div id="footer">
<div class="shadow-up"></div>
<div id="footer-bottom">
<ul>
<li><span><a href="http://www.iris.edu/hq" title="IRIS"><img src="/static/img/layout/logos/URL_TXT.png" /></a></span></li>
<li><em><a href="http://www.nsf.gov/" title="The National Science Foundation" target="_blank">Sponsored by the National Science Foundation</a></em></li>
<li><a href="http://www.iris.edu/hq" title="IRIS">&copy; Copyright 2018 IRIS</a></li>
<li>1200 New York Avenue NW, Suite 400, Washington, DC 20005, 202-682-2220</li>
<li><a href="mailto:info@iris.edu">info@iris.edu</a></li>
</ul>
</div><!-- #footer-bottom -->
</div><!-- #footer -->
<div class="cachebuster" title="Click to force a refresh.">
Page built 10:01:46 | v.65d82faf
</div>
<script>
/* Cachebuster -- this is a link to the current page with a trailing query parameter, which will cause the cache to be bypassed */
$(function() {
// Cachebuster goes in the search attribute (eg. the query string)
var search = window.location.search;
// Only operate if there's no search or it's an existing cachebuster parameter
if (!search || search.match(/^\?\d+$/)) {
$('.cachebuster').click(function() {
window.location.search = '?' + (new Date()).getTime();
});
} else {
$('.cachebuster').empty();
}
});
</script>
</div>
</div><!-- #site-container -->
</body>
</html>
----------------------------------------------------------------------
File "/private-backup/home/obspy/update-docs/src/obspy/obspy/clients/syngine/__init__.py", line 30, in obspy.clients.syngine.__init__
Failed example:
print(st) # doctest: +ELLIPSIS
Exception raised:
Traceback (most recent call last):
File "/home/obspy/anaconda3/envs/tmp_build_docs/lib/python3.4/doctest.py", line 1318, in __run
compileflags, 1), test.globs)
File "<doctest obspy.clients.syngine.__init__[3]>", line 1, in <module>
print(st) # doctest: +ELLIPSIS
NameError: name 'st' is not defined
----------------------------------------------------------------------
File "/private-backup/home/obspy/update-docs/src/obspy/obspy/clients/syngine/__init__.py", line 54, in obspy.clients.syngine.__init__
Failed example:
st = client.get_waveforms(model="ak135f_5s", network="IU", station="AN*",
eventid="GCMT:C201002270634A",
starttime="P-10", endtime="P+20")
Exception raised:
Traceback (most recent call last):
File "/home/obspy/anaconda3/envs/tmp_build_docs/lib/python3.4/doctest.py", line 1318, in __run
compileflags, 1), test.globs)
File "<doctest obspy.clients.syngine.__init__[5]>", line 3, in <module>
starttime="P-10", endtime="P+20")
File "/private-backup/home/obspy/update-docs/src/obspy/obspy/clients/syngine/client.py", line 371, in get_waveforms
filename=filename)
File "/private-backup/home/obspy/update-docs/src/obspy/obspy/clients/base.py", line 245, in _download
self._handle_requests_http_error(r)
File "/private-backup/home/obspy/update-docs/src/obspy/obspy/clients/syngine/client.py", line 62, in _handle_requests_http_error
raise ClientHTTPException(msg.strip())
obspy.clients.base.ClientHTTPException: HTTP code 404 when downloading 'http://service.iris.edu/irisws/syngine/1/query?endtime=P%2B20&format=miniseed&station=AN%2A&eventid=GCMT%3AC201002270634A&network=IU&model=ak135f_5s&starttime=P-10':
<!doctype html>
<html lang="en">
<head>
<title>
IRIS:
404 Page Not Found Error
</title>
<meta name="keywords" content="seismology, seismological data,
earthquakes, iris dmc" />
<meta name="description" content="IRIS is a consortium of
universities dedicated to the operation of science facilities
for the acquisition, management, and distribution of seismological
data." />
<!-- Forces IE to render in 'latest' compatible mode -->
<meta http-equiv="X-UA-Compatible" content="IE=Edge"/>
<meta charset="utf-8" />
<meta name="viewport" content="width=device-width, initial-scale=1" />
<link rel="stylesheet" media="all" type="text/css" href="/static/css/iris.css" />
<link rel="stylesheet" media="print" type="text/css" href="/static/css/print.css" />
<link rel="shortcut icon" href="/static/img/favicon.ico" />
<script type="text/javascript" src="//ajax.googleapis.com/ajax/libs/jquery/1.11.1/jquery.js"></script>
<script type="text/javascript" src="//netdna.bootstrapcdn.com/bootstrap/3.3.1/js/bootstrap.min.js"></script>
<script>
(function(i,s,o,g,r,a,m){i['GoogleAnalyticsObject']=r;i[r]=i[r]||function(){
(i[r].q=i[r].q||[]).push(arguments)},i[r].l=1*new Date();a=s.createElement(o),
m=s.getElementsByTagName(o)[0];a.async=1;a.src=g;m.parentNode.insertBefore(a,m)
})(window,document,'script','//www.google-analytics.com/analytics.js','ga');
ga('create', 'UA-1860730-1', 'iris.edu');
ga('send', 'pageview');
</script>
</head>
<body>
<div class="container">
<div class="container-inner">
<header>
<div id="header">
<div id="header-left">
<div id="logo">
<a href="http://ds.iris.edu/hq/" title="IRIS">
<img alt="IRIS" src="/static/img/layout/logos/iris_logo_shadow.png"/>
</a>
</div>
<div id="logo-name">
Incorporated Research Institutions for Seismology
</div>
</div>
<!-- #header-right -->
<div id="header-right">
<ul id="top-menu">
<li>
<a href="http://ds.iris.edu/ds/nodes/dmc/" title="IRIS DMC">DMC</a>
</li>
<li>
<a href="http://www.iris.edu/hq" title="IRIS HQ">Home</a>
</li>
</ul>
<div id="nsf-logo">
<a href="http://www.nsf.gov/" target="_blank" title="The National Science Foundation">
<img alt="The National Science Foundation" src="/static/img/layout/logos/nsf.png"/>
</a>
</div>
<!-- #nsf -->
</div>
<div class="shadow-down"></div>
</div>
<!-- #header -->
<!--Iris only meny -->
</header>
<div class="wrapper">
<div>
<ul class="breadcrumb">
<li>
<a href="/">Web Services</a>
</li>
</ul>
</div>
<div id="page">
<div id="page-content">
<div class="alert alert-block alert-info">
<h4>Maintenance Work on Wednesday 7 Nov</h4>
<small>Posted:
<time pubdate datetime="2018-11-06T11:58:28 PST">
11/06/2018 11:58 a.m.
</time>
</small>
	<p>Data Services will be performing a system upgrade on <strong>Wednesday 7 November</strong>, starting around <strong>06:30 <span class="caps">PST</span></strong>. This should have minimal impact on users, but there may be some temporary reductions in functionality throughout the day.</p>
</div>
<h1>
404 Page Not Found Error
</h1>
<div id="content">
<p>We are sorry, but the page you are requesting does not exist.</p>
<p>Please check the URL path you are requested and try again.</p>
<p>If you believe the error to be ours, please
<a href="http://www.iris.edu/hq/contact">contact</a>
us.</p>
</div>
</div>
</div>
</div>
<div id="footer">
<div class="shadow-up"></div>
<div id="footer-bottom">
<ul>
<li><span><a href="http://www.iris.edu/hq" title="IRIS"><img src="/static/img/layout/logos/URL_TXT.png" /></a></span></li>
<li><em><a href="http://www.nsf.gov/" title="The National Science Foundation" target="_blank">Sponsored by the National Science Foundation</a></em></li>
<li><a href="http://www.iris.edu/hq" title="IRIS">&copy; Copyright 2018 IRIS</a></li>
<li>1200 New York Avenue NW, Suite 400, Washington, DC 20005, 202-682-2220</li>
<li><a href="mailto:info@iris.edu">info@iris.edu</a></li>
</ul>
</div><!-- #footer-bottom -->
</div><!-- #footer -->
<div class="cachebuster" title="Click to force a refresh.">
Page built 10:01:47 | v.65d82faf
</div>
<script>
/* Cachebuster -- this is a link to the current page with a trailing query parameter, which will cause the cache to be bypassed */
$(function() {
// Cachebuster goes in the search attribute (eg. the query string)
var search = window.location.search;
// Only operate if there's no search or it's an existing cachebuster parameter
if (!search || search.match(/^\?\d+$/)) {
$('.cachebuster').click(function() {
window.location.search = '?' + (new Date()).getTime();
});
} else {
$('.cachebuster').empty();
}
});
</script>
</div>
</div><!-- #site-container -->
</body>
</html>
----------------------------------------------------------------------
File "/private-backup/home/obspy/update-docs/src/obspy/obspy/clients/syngine/__init__.py", line 79, in obspy.clients.syngine.__init__
Failed example:
st = client.get_waveforms_bulk(
model="ak135f_5s", eventid="GCMT:C201002270634A",
bulk=bulk, starttime="P-10", endtime="P+20")
Exception raised:
Traceback (most recent call last):
File "/home/obspy/anaconda3/envs/tmp_build_docs/lib/python3.4/doctest.py", line 1318, in __run
compileflags, 1), test.globs)
File "<doctest obspy.clients.syngine.__init__[8]>", line 3, in <module>
bulk=bulk, starttime="P-10", endtime="P+20")
File "/private-backup/home/obspy/update-docs/src/obspy/obspy/clients/syngine/client.py", line 608, in get_waveforms_bulk
data=buf, filename=filename)
File "/private-backup/home/obspy/update-docs/src/obspy/obspy/clients/base.py", line 245, in _download
self._handle_requests_http_error(r)
File "/private-backup/home/obspy/update-docs/src/obspy/obspy/clients/syngine/client.py", line 62, in _handle_requests_http_error
raise ClientHTTPException(msg.strip())
obspy.clients.base.ClientHTTPException: HTTP code 404 when downloading 'http://service.iris.edu/irisws/syngine/1/query':
<!doctype html>
<html lang="en">
<head>
<title>
IRIS:
404 Page Not Found Error
</title>
<meta name="keywords" content="seismology, seismological data,
earthquakes, iris dmc" />
<meta name="description" content="IRIS is a consortium of
universities dedicated to the operation of science facilities
for the acquisition, management, and distribution of seismological
data." />
<!-- Forces IE to render in 'latest' compatible mode -->
<meta http-equiv="X-UA-Compatible" content="IE=Edge"/>
<meta charset="utf-8" />
<meta name="viewport" content="width=device-width, initial-scale=1" />
<link rel="stylesheet" media="all" type="text/css" href="/static/css/iris.css" />
<link rel="stylesheet" media="print" type="text/css" href="/static/css/print.css" />
<link rel="shortcut icon" href="/static/img/favicon.ico" />
<script type="text/javascript" src="//ajax.googleapis.com/ajax/libs/jquery/1.11.1/jquery.js"></script>
<script type="text/javascript" src="//netdna.bootstrapcdn.com/bootstrap/3.3.1/js/bootstrap.min.js"></script>
<script>
(function(i,s,o,g,r,a,m){i['GoogleAnalyticsObject']=r;i[r]=i[r]||function(){
(i[r].q=i[r].q||[]).push(arguments)},i[r].l=1*new Date();a=s.createElement(o),
m=s.getElementsByTagName(o)[0];a.async=1;a.src=g;m.parentNode.insertBefore(a,m)
})(window,document,'script','//www.google-analytics.com/analytics.js','ga');
ga('create', 'UA-1860730-1', 'iris.edu');
ga('send', 'pageview');
</script>
</head>
<body>
<div class="container">
<div class="container-inner">
<header>
<div id="header">
<div id="header-left">
<div id="logo">
<a href="http://ds.iris.edu/hq/" title="IRIS">
<img alt="IRIS" src="/static/img/layout/logos/iris_logo_shadow.png"/>
</a>
</div>
<div id="logo-name">
Incorporated Research Institutions for Seismology
</div>
</div>
<!-- #header-right -->
<div id="header-right">
<ul id="top-menu">
<li>
<a href="http://ds.iris.edu/ds/nodes/dmc/" title="IRIS DMC">DMC</a>
</li>
<li>
<a href="http://www.iris.edu/hq" title="IRIS HQ">Home</a>
</li>
</ul>
<div id="nsf-logo">
<a href="http://www.nsf.gov/" target="_blank" title="The National Science Foundation">
<img alt="The National Science Foundation" src="/static/img/layout/logos/nsf.png"/>
</a>
</div>
<!-- #nsf -->
</div>
<div class="shadow-down"></div>
</div>
<!-- #header -->
<!--Iris only meny -->
</header>
<div class="wrapper">
<div>
<ul class="breadcrumb">
<li>
<a href="/">Web Services</a>
</li>
</ul>
</div>
<div id="page">
<div id="page-content">
<div class="alert alert-block alert-info">
<h4>Maintenance Work on Wednesday 7 Nov</h4>
<small>Posted:
<time pubdate datetime="2018-11-06T11:58:28 PST">
11/06/2018 11:58 a.m.
</time>
</small>
	<p>Data Services will be performing a system upgrade on <strong>Wednesday 7 November</strong>, starting around <strong>06:30 <span class="caps">PST</span></strong>. This should have minimal impact on users, but there may be some temporary reductions in functionality throughout the day.</p>
</div>
<h1>
404 Page Not Found Error
</h1>
<div id="content">
<p>We are sorry, but the page you are requesting does not exist.</p>
<p>Please check the URL path you are requested and try again.</p>
<p>If you believe the error to be ours, please
<a href="http://www.iris.edu/hq/contact">contact</a>
us.</p>
</div>
</div>
</div>
</div>
<div id="footer">
<div class="shadow-up"></div>
<div id="footer-bottom">
<ul>
<li><span><a href="http://www.iris.edu/hq" title="IRIS"><img src="/static/img/layout/logos/URL_TXT.png" /></a></span></li>
<li><em><a href="http://www.nsf.gov/" title="The National Science Foundation" target="_blank">Sponsored by the National Science Foundation</a></em></li>
<li><a href="http://www.iris.edu/hq" title="IRIS">&copy; Copyright 2018 IRIS</a></li>
<li>1200 New York Avenue NW, Suite 400, Washington, DC 20005, 202-682-2220</li>
<li><a href="mailto:info@iris.edu">info@iris.edu</a></li>
</ul>
</div><!-- #footer-bottom -->
</div><!-- #footer -->
<div class="cachebuster" title="Click to force a refresh.">
Page built 10:01:47 | v.65d82faf
</div>
<script>
/* Cachebuster -- this is a link to the current page with a trailing query parameter, which will cause the cache to be bypassed */
$(function() {
// Cachebuster goes in the search attribute (eg. the query string)
var search = window.location.search;
// Only operate if there's no search or it's an existing cachebuster parameter
if (!search || search.match(/^\?\d+$/)) {
$('.cachebuster').click(function() {
window.location.search = '?' + (new Date()).getTime();
});
} else {
$('.cachebuster').empty();
}
});
</script>
</div>
</div><!-- #site-container -->
</body>
</html>
----------------------------------------------------------------------
File "/private-backup/home/obspy/update-docs/src/obspy/obspy/clients/syngine/__init__.py", line 82, in obspy.clients.syngine.__init__
Failed example:
print(st) # doctest: +ELLIPSIS
Exception raised:
Traceback (most recent call last):
File "/home/obspy/anaconda3/envs/tmp_build_docs/lib/python3.4/doctest.py", line 1318, in __run
compileflags, 1), test.globs)
File "<doctest obspy.clients.syngine.__init__[9]>", line 1, in <module>
print(st) # doctest: +ELLIPSIS
NameError: name 'st' is not defined
----------------------------------------------------------------------
File "/private-backup/home/obspy/update-docs/src/obspy/obspy/clients/syngine/__init__.py", line 117, in obspy.clients.syngine.__init__
Failed example:
db_info = c.get_model_info(model_name="ak135f_5s")
Exception raised:
Traceback (most recent call last):
File "/home/obspy/anaconda3/envs/tmp_build_docs/lib/python3.4/doctest.py", line 1318, in __run
compileflags, 1), test.globs)
File "<doctest obspy.clients.syngine.__init__[13]>", line 1, in <module>
db_info = c.get_model_info(model_name="ak135f_5s")
File "/private-backup/home/obspy/update-docs/src/obspy/obspy/clients/syngine/client.py", line 83, in get_model_info
params={"model": model_name})
File "/private-backup/home/obspy/update-docs/src/obspy/obspy/clients/base.py", line 245, in _download
self._handle_requests_http_error(r)
File "/private-backup/home/obspy/update-docs/src/obspy/obspy/clients/syngine/client.py", line 62, in _handle_requests_http_error
raise ClientHTTPException(msg.strip())
obspy.clients.base.ClientHTTPException: HTTP code 404 when downloading 'http://service.iris.edu/irisws/syngine/1/info?model=ak135f_5s':
<!doctype html>
<html lang="en">
<head>
<title>
IRIS:
404 Page Not Found Error
</title>
<meta name="keywords" content="seismology, seismological data,
earthquakes, iris dmc" />
<meta name="description" content="IRIS is a consortium of
universities dedicated to the operation of science facilities
for the acquisition, management, and distribution of seismological
data." />
<!-- Forces IE to render in 'latest' compatible mode -->
<meta http-equiv="X-UA-Compatible" content="IE=Edge"/>
<meta charset="utf-8" />
<meta name="viewport" content="width=device-width, initial-scale=1" />
<link rel="stylesheet" media="all" type="text/css" href="/static/css/iris.css" />
<link rel="stylesheet" media="print" type="text/css" href="/static/css/print.css" />
<link rel="shortcut icon" href="/static/img/favicon.ico" />
<script type="text/javascript" src="//ajax.googleapis.com/ajax/libs/jquery/1.11.1/jquery.js"></script>
<script type="text/javascript" src="//netdna.bootstrapcdn.com/bootstrap/3.3.1/js/bootstrap.min.js"></script>
<script>
(function(i,s,o,g,r,a,m){i['GoogleAnalyticsObject']=r;i[r]=i[r]||function(){
(i[r].q=i[r].q||[]).push(arguments)},i[r].l=1*new Date();a=s.createElement(o),
m=s.getElementsByTagName(o)[0];a.async=1;a.src=g;m.parentNode.insertBefore(a,m)
})(window,document,'script','//www.google-analytics.com/analytics.js','ga');
ga('create', 'UA-1860730-1', 'iris.edu');
ga('send', 'pageview');
</script>
</head>
<body>
<div class="container">
<div class="container-inner">
<header>
<div id="header">
<div id="header-left">
<div id="logo">
<a href="http://ds.iris.edu/hq/" title="IRIS">
<img alt="IRIS" src="/static/img/layout/logos/iris_logo_shadow.png"/>
</a>
</div>
<div id="logo-name">
Incorporated Research Institutions for Seismology
</div>
</div>
<!-- #header-right -->
<div id="header-right">
<ul id="top-menu">
<li>
<a href="http://ds.iris.edu/ds/nodes/dmc/" title="IRIS DMC">DMC</a>
</li>
<li>
<a href="http://www.iris.edu/hq" title="IRIS HQ">Home</a>
</li>
</ul>
<div id="nsf-logo">
<a href="http://www.nsf.gov/" target="_blank" title="The National Science Foundation">
<img alt="The National Science Foundation" src="/static/img/layout/logos/nsf.png"/>
</a>
</div>
<!-- #nsf -->
</div>
<div class="shadow-down"></div>
</div>
<!-- #header -->
<!--Iris only meny -->
</header>
<div class="wrapper">
<div>
<ul class="breadcrumb">
<li>
<a href="/">Web Services</a>
</li>
</ul>
</div>
<div id="page">
<div id="page-content">
<div class="alert alert-block alert-info">
<h4>Maintenance Work on Wednesday 7 Nov</h4>
<small>Posted:
<time pubdate datetime="2018-11-06T11:58:28 PST">
11/06/2018 11:58 a.m.
</time>
</small>
	<p>Data Services will be performing a system upgrade on <strong>Wednesday 7 November</strong>, starting around <strong>06:30 <span class="caps">PST</span></strong>. This should have minimal impact on users, but there may be some temporary reductions in functionality throughout the day.</p>
</div>
<h1>
404 Page Not Found Error
</h1>
<div id="content">
<p>We are sorry, but the page you are requesting does not exist.</p>
<p>Please check the URL path you are requested and try again.</p>
<p>If you believe the error to be ours, please
<a href="http://www.iris.edu/hq/contact">contact</a>
us.</p>
</div>
</div>
</div>
</div>
<div id="footer">
<div class="shadow-up"></div>
<div id="footer-bottom">
<ul>
<li><span><a href="http://www.iris.edu/hq" title="IRIS"><img src="/static/img/layout/logos/URL_TXT.png" /></a></span></li>
<li><em><a href="http://www.nsf.gov/" title="The National Science Foundation" target="_blank">Sponsored by the National Science Foundation</a></em></li>
<li><a href="http://www.iris.edu/hq" title="IRIS">&copy; Copyright 2018 IRIS</a></li>
<li>1200 New York Avenue NW, Suite 400, Washington, DC 20005, 202-682-2220</li>
<li><a href="mailto:info@iris.edu">info@iris.edu</a></li>
</ul>
</div><!-- #footer-bottom -->
</div><!-- #footer -->
<div class="cachebuster" title="Click to force a refresh.">
Page built 10:01:48 | v.65d82faf
</div>
<script>
/* Cachebuster -- this is a link to the current page with a trailing query parameter, which will cause the cache to be bypassed */
$(function() {
// Cachebuster goes in the search attribute (eg. the query string)
var search = window.location.search;
// Only operate if there's no search or it's an existing cachebuster parameter
if (!search || search.match(/^\?\d+$/)) {
$('.cachebuster').click(function() {
window.location.search = '?' + (new Date()).getTime();
});
} else {
$('.cachebuster').empty();
}
});
</script>
</div>
</div><!-- #site-container -->
</body>
</html>
----------------------------------------------------------------------
File "/private-backup/home/obspy/update-docs/src/obspy/obspy/clients/syngine/__init__.py", line 118, in obspy.clients.syngine.__init__
Failed example:
print(db_info.period)
Exception raised:
Traceback (most recent call last):
File "/home/obspy/anaconda3/envs/tmp_build_docs/lib/python3.4/doctest.py", line 1318, in __run
compileflags, 1), test.globs)
File "<doctest obspy.clients.syngine.__init__[14]>", line 1, in <module>
print(db_info.period)
NameError: name 'db_info' is not defined
Traceback (most recent call last):
File "/home/obspy/anaconda3/envs/tmp_build_docs/lib/python3.4/doctest.py", line 2187, in runTest
raise self.failureException(self.format_failure(new.getvalue()))
AssertionError: Failed doctest test for obspy.clients.syngine.client.Client.get_waveforms
File "/private-backup/home/obspy/update-docs/src/obspy/obspy/clients/syngine/client.py", line 213, in get_waveforms
----------------------------------------------------------------------
File "/private-backup/home/obspy/update-docs/src/obspy/obspy/clients/syngine/client.py", line 227, in obspy.clients.syngine.client.Client.get_waveforms
Failed example:
st = client.get_waveforms(model="ak135f_5s", network="IU",
station="ANMO",
eventid="GCMT:C201002270634A")
Exception raised:
Traceback (most recent call last):
File "/home/obspy/anaconda3/envs/tmp_build_docs/lib/python3.4/doctest.py", line 1318, in __run
compileflags, 1), test.globs)
File "<doctest obspy.clients.syngine.client.Client.get_waveforms[2]>", line 3, in <module>
eventid="GCMT:C201002270634A")
File "/private-backup/home/obspy/update-docs/src/obspy/obspy/clients/syngine/client.py", line 371, in get_waveforms
filename=filename)
File "/private-backup/home/obspy/update-docs/src/obspy/obspy/clients/base.py", line 245, in _download
self._handle_requests_http_error(r)
File "/private-backup/home/obspy/update-docs/src/obspy/obspy/clients/syngine/client.py", line 62, in _handle_requests_http_error
raise ClientHTTPException(msg.strip())
obspy.clients.base.ClientHTTPException: HTTP code 404 when downloading 'http://service.iris.edu/irisws/syngine/1/query?model=ak135f_5s&format=miniseed&station=ANMO&eventid=GCMT%3AC201002270634A&network=IU':
<!doctype html>
<html lang="en">
<head>
<title>
IRIS:
404 Page Not Found Error
</title>
<meta name="keywords" content="seismology, seismological data,
earthquakes, iris dmc" />
<meta name="description" content="IRIS is a consortium of
universities dedicated to the operation of science facilities
for the acquisition, management, and distribution of seismological
data." />
<!-- Forces IE to render in 'latest' compatible mode -->
<meta http-equiv="X-UA-Compatible" content="IE=Edge"/>
<meta charset="utf-8" />
<meta name="viewport" content="width=device-width, initial-scale=1" />
<link rel="stylesheet" media="all" type="text/css" href="/static/css/iris.css" />
<link rel="stylesheet" media="print" type="text/css" href="/static/css/print.css" />
<link rel="shortcut icon" href="/static/img/favicon.ico" />
<script type="text/javascript" src="//ajax.googleapis.com/ajax/libs/jquery/1.11.1/jquery.js"></script>
<script type="text/javascript" src="//netdna.bootstrapcdn.com/bootstrap/3.3.1/js/bootstrap.min.js"></script>
<script>
(function(i,s,o,g,r,a,m){i['GoogleAnalyticsObject']=r;i[r]=i[r]||function(){
(i[r].q=i[r].q||[]).push(arguments)},i[r].l=1*new Date();a=s.createElement(o),
m=s.getElementsByTagName(o)[0];a.async=1;a.src=g;m.parentNode.insertBefore(a,m)
})(window,document,'script','//www.google-analytics.com/analytics.js','ga');
ga('create', 'UA-1860730-1', 'iris.edu');
ga('send', 'pageview');
</script>
</head>
<body>
<div class="container">
<div class="container-inner">
<header>
<div id="header">
<div id="header-left">
<div id="logo">
<a href="http://ds.iris.edu/hq/" title="IRIS">
<img alt="IRIS" src="/static/img/layout/logos/iris_logo_shadow.png"/>
</a>
</div>
<div id="logo-name">
Incorporated Research Institutions for Seismology
</div>
</div>
<!-- #header-right -->
<div id="header-right">
<ul id="top-menu">
<li>
<a href="http://ds.iris.edu/ds/nodes/dmc/" title="IRIS DMC">DMC</a>
</li>
<li>
<a href="http://www.iris.edu/hq" title="IRIS HQ">Home</a>
</li>
</ul>
<div id="nsf-logo">
<a href="http://www.nsf.gov/" target="_blank" title="The National Science Foundation">
<img alt="The National Science Foundation" src="/static/img/layout/logos/nsf.png"/>
</a>
</div>
<!-- #nsf -->
</div>
<div class="shadow-down"></div>
</div>
<!-- #header -->
<!--Iris only meny -->
</header>
<div class="wrapper">
<div>
<ul class="breadcrumb">
<li>
<a href="/">Web Services</a>
</li>
</ul>
</div>
<div id="page">
<div id="page-content">
<div class="alert alert-block alert-info">
<h4>Maintenance Work on Wednesday 7 Nov</h4>
<small>Posted:
<time pubdate datetime="2018-11-06T11:58:28 PST">
11/06/2018 11:58 a.m.
</time>
</small>
	<p>Data Services will be performing a system upgrade on <strong>Wednesday 7 November</strong>, starting around <strong>06:30 <span class="caps">PST</span></strong>. This should have minimal impact on users, but there may be some temporary reductions in functionality throughout the day.</p>
</div>
<h1>
404 Page Not Found Error
</h1>
<div id="content">
<p>We are sorry, but the page you are requesting does not exist.</p>
<p>Please check the URL path you are requested and try again.</p>
<p>If you believe the error to be ours, please
<a href="http://www.iris.edu/hq/contact">contact</a>
us.</p>
</div>
</div>
</div>
</div>
<div id="footer">
<div class="shadow-up"></div>
<div id="footer-bottom">
<ul>
<li><span><a href="http://www.iris.edu/hq" title="IRIS"><img src="/static/img/layout/logos/URL_TXT.png" /></a></span></li>
<li><em><a href="http://www.nsf.gov/" title="The National Science Foundation" target="_blank">Sponsored by the National Science Foundation</a></em></li>
<li><a href="http://www.iris.edu/hq" title="IRIS">&copy; Copyright 2018 IRIS</a></li>
<li>1200 New York Avenue NW, Suite 400, Washington, DC 20005, 202-682-2220</li>
<li><a href="mailto:info@iris.edu">info@iris.edu</a></li>
</ul>
</div><!-- #footer-bottom -->
</div><!-- #footer -->
<div class="cachebuster" title="Click to force a refresh.">
Page built 10:01:45 | v.65d82faf
</div>
<script>
/* Cachebuster -- this is a link to the current page with a trailing query parameter, which will cause the cache to be bypassed */
$(function() {
// Cachebuster goes in the search attribute (eg. the query string)
var search = window.location.search;
// Only operate if there's no search or it's an existing cachebuster parameter
if (!search || search.match(/^\?\d+$/)) {
$('.cachebuster').click(function() {
window.location.search = '?' + (new Date()).getTime();
});
} else {
$('.cachebuster').empty();
}
});
</script>
</div>
</div><!-- #site-container -->
</body>
</html>
----------------------------------------------------------------------
File "/private-backup/home/obspy/update-docs/src/obspy/obspy/clients/syngine/client.py", line 230, in obspy.clients.syngine.client.Client.get_waveforms
Failed example:
print(st) # doctest: +ELLIPSIS
Exception raised:
Traceback (most recent call last):
File "/home/obspy/anaconda3/envs/tmp_build_docs/lib/python3.4/doctest.py", line 1318, in __run
compileflags, 1), test.globs)
File "<doctest obspy.clients.syngine.client.Client.get_waveforms[3]>", line 1, in <module>
print(st) # doctest: +ELLIPSIS
NameError: name 'st' is not defined
Traceback (most recent call last):
File "/home/obspy/anaconda3/envs/tmp_build_docs/lib/python3.4/doctest.py", line 2187, in runTest
raise self.failureException(self.format_failure(new.getvalue()))
AssertionError: Failed doctest test for obspy.clients.syngine.client.Client.get_waveforms_bulk
File "/private-backup/home/obspy/update-docs/src/obspy/obspy/clients/syngine/client.py", line 386, in get_waveforms_bulk
----------------------------------------------------------------------
File "/private-backup/home/obspy/update-docs/src/obspy/obspy/clients/syngine/client.py", line 419, in obspy.clients.syngine.client.Client.get_waveforms_bulk
Failed example:
st = c.get_waveforms_bulk(
model="ak135f_5s", bulk=bulk, sourcelatitude=12.3,
sourcelongitude=75.3, sourcedepthinmeters=54321,
sourcemomenttensor=[1E19, 1E19, 1E19, 0, 0, 0],
components="Z")
Exception raised:
Traceback (most recent call last):
File "/home/obspy/anaconda3/envs/tmp_build_docs/lib/python3.4/doctest.py", line 1318, in __run
compileflags, 1), test.globs)
File "<doctest obspy.clients.syngine.client.Client.get_waveforms_bulk[3]>", line 5, in <module>
components="Z")
File "/private-backup/home/obspy/update-docs/src/obspy/obspy/clients/syngine/client.py", line 608, in get_waveforms_bulk
data=buf, filename=filename)
File "/private-backup/home/obspy/update-docs/src/obspy/obspy/clients/base.py", line 245, in _download
self._handle_requests_http_error(r)
File "/private-backup/home/obspy/update-docs/src/obspy/obspy/clients/syngine/client.py", line 62, in _handle_requests_http_error
raise ClientHTTPException(msg.strip())
obspy.clients.base.ClientHTTPException: HTTP code 404 when downloading 'http://service.iris.edu/irisws/syngine/1/query':
<!doctype html>
<html lang="en">
<head>
<title>
IRIS:
404 Page Not Found Error
</title>
<meta name="keywords" content="seismology, seismological data,
earthquakes, iris dmc" />
<meta name="description" content="IRIS is a consortium of
universities dedicated to the operation of science facilities
for the acquisition, management, and distribution of seismological
data." />
<!-- Forces IE to render in 'latest' compatible mode -->
<meta http-equiv="X-UA-Compatible" content="IE=Edge"/>
<meta charset="utf-8" />
<meta name="viewport" content="width=device-width, initial-scale=1" />
<link rel="stylesheet" media="all" type="text/css" href="/static/css/iris.css" />
<link rel="stylesheet" media="print" type="text/css" href="/static/css/print.css" />
<link rel="shortcut icon" href="/static/img/favicon.ico" />
<script type="text/javascript" src="//ajax.googleapis.com/ajax/libs/jquery/1.11.1/jquery.js"></script>
<script type="text/javascript" src="//netdna.bootstrapcdn.com/bootstrap/3.3.1/js/bootstrap.min.js"></script>
<script>
(function(i,s,o,g,r,a,m){i['GoogleAnalyticsObject']=r;i[r]=i[r]||function(){
(i[r].q=i[r].q||[]).push(arguments)},i[r].l=1*new Date();a=s.createElement(o),
m=s.getElementsByTagName(o)[0];a.async=1;a.src=g;m.parentNode.insertBefore(a,m)
})(window,document,'script','//www.google-analytics.com/analytics.js','ga');
ga('create', 'UA-1860730-1', 'iris.edu');
ga('send', 'pageview');
</script>
</head>
<body>
<div class="container">
<div class="container-inner">
<header>
<div id="header">
<div id="header-left">
<div id="logo">
<a href="http://ds.iris.edu/hq/" title="IRIS">
<img alt="IRIS" src="/static/img/layout/logos/iris_logo_shadow.png"/>
</a>
</div>
<div id="logo-name">
Incorporated Research Institutions for Seismology
</div>
</div>
<!-- #header-right -->
<div id="header-right">
<ul id="top-menu">
<li>
<a href="http://ds.iris.edu/ds/nodes/dmc/" title="IRIS DMC">DMC</a>
</li>
<li>
<a href="http://www.iris.edu/hq" title="IRIS HQ">Home</a>
</li>
</ul>
<div id="nsf-logo">
<a href="http://www.nsf.gov/" target="_blank" title="The National Science Foundation">
<img alt="The National Science Foundation" src="/static/img/layout/logos/nsf.png"/>
</a>
</div>
<!-- #nsf -->
</div>
<div class="shadow-down"></div>
</div>
<!-- #header -->
<!--Iris only meny -->
</header>
<div class="wrapper">
<div>
<ul class="breadcrumb">
<li>
<a href="/">Web Services</a>
</li>
</ul>
</div>
<div id="page">
<div id="page-content">
<div class="alert alert-block alert-info">
<h4>Maintenance Work on Wednesday 7 Nov</h4>
<small>Posted:
<time pubdate datetime="2018-11-06T11:58:28 PST">
11/06/2018 11:58 a.m.
</time>
</small>
	<p>Data Services will be performing a system upgrade on <strong>Wednesday 7 November</strong>, starting around <strong>06:30 <span class="caps">PST</span></strong>. This should have minimal impact on users, but there may be some temporary reductions in functionality throughout the day.</p>
</div>
<h1>
404 Page Not Found Error
</h1>
<div id="content">
<p>We are sorry, but the page you are requesting does not exist.</p>
<p>Please check the URL path you are requested and try again.</p>
<p>If you believe the error to be ours, please
<a href="http://www.iris.edu/hq/contact">contact</a>
us.</p>
</div>
</div>
</div>
</div>
<div id="footer">
<div class="shadow-up"></div>
<div id="footer-bottom">
<ul>
<li><span><a href="http://www.iris.edu/hq" title="IRIS"><img src="/static/img/layout/logos/URL_TXT.png" /></a></span></li>
<li><em><a href="http://www.nsf.gov/" title="The National Science Foundation" target="_blank">Sponsored by the National Science Foundation</a></em></li>
<li><a href="http://www.iris.edu/hq" title="IRIS">&copy; Copyright 2018 IRIS</a></li>
<li>1200 New York Avenue NW, Suite 400, Washington, DC 20005, 202-682-2220</li>
<li><a href="mailto:info@iris.edu">info@iris.edu</a></li>
</ul>
</div><!-- #footer-bottom -->
</div><!-- #footer -->
<div class="cachebuster" title="Click to force a refresh.">
Page built 10:01:46 | v.65d82faf
</div>
<script>
/* Cachebuster -- this is a link to the current page with a trailing query parameter, which will cause the cache to be bypassed */
$(function() {
// Cachebuster goes in the search attribute (eg. the query string)
var search = window.location.search;
// Only operate if there's no search or it's an existing cachebuster parameter
if (!search || search.match(/^\?\d+$/)) {
$('.cachebuster').click(function() {
window.location.search = '?' + (new Date()).getTime();
});
} else {
$('.cachebuster').empty();
}
});
</script>
</div>
</div><!-- #site-container -->
</body>
</html>
----------------------------------------------------------------------
File "/private-backup/home/obspy/update-docs/src/obspy/obspy/clients/syngine/client.py", line 424, in obspy.clients.syngine.client.Client.get_waveforms_bulk
Failed example:
print(st.sort()) # doctest: +ELLIPSIS
Exception raised:
Traceback (most recent call last):
File "/home/obspy/anaconda3/envs/tmp_build_docs/lib/python3.4/doctest.py", line 1318, in __run
compileflags, 1), test.globs)
File "<doctest obspy.clients.syngine.client.Client.get_waveforms_bulk[4]>", line 1, in <module>
print(st.sort()) # doctest: +ELLIPSIS
NameError: name 'st' is not defined
Traceback (most recent call last):
File "/private-backup/home/obspy/update-docs/src/obspy/obspy/clients/syngine/tests/test_client.py", line 423, in test_saving_directly_to_file
endtime="P+10", components="Z", filename=tf)
File "/private-backup/home/obspy/update-docs/src/obspy/obspy/clients/syngine/client.py", line 371, in get_waveforms
filename=filename)
File "/private-backup/home/obspy/update-docs/src/obspy/obspy/clients/base.py", line 245, in _download
self._handle_requests_http_error(r)
File "/private-backup/home/obspy/update-docs/src/obspy/obspy/clients/syngine/client.py", line 62, in _handle_requests_http_error
raise ClientHTTPException(msg.strip())
obspy.clients.base.ClientHTTPException: HTTP code 404 when downloading 'http://service.iris.edu/irisws/syngine/1/query?endtime=P%2B10&format=miniseed&station=ANMO&eventid=GCMT%3AC201002270634A&network=IU&model=test&components=Z&starttime=P-10':
<!doctype html>
<html lang="en">
<head>
<title>
IRIS:
404 Page Not Found Error
</title>
<meta name="keywords" content="seismology, seismological data,
earthquakes, iris dmc" />
<meta name="description" content="IRIS is a consortium of
universities dedicated to the operation of science facilities
for the acquisition, management, and distribution of seismological
data." />
<!-- Forces IE to render in 'latest' compatible mode -->
<meta http-equiv="X-UA-Compatible" content="IE=Edge"/>
<meta charset="utf-8" />
<meta name="viewport" content="width=device-width, initial-scale=1" />
<link rel="stylesheet" media="all" type="text/css" href="/static/css/iris.css" />
<link rel="stylesheet" media="print" type="text/css" href="/static/css/print.css" />
<link rel="shortcut icon" href="/static/img/favicon.ico" />
<script type="text/javascript" src="//ajax.googleapis.com/ajax/libs/jquery/1.11.1/jquery.js"></script>
<script type="text/javascript" src="//netdna.bootstrapcdn.com/bootstrap/3.3.1/js/bootstrap.min.js"></script>
<script>
(function(i,s,o,g,r,a,m){i['GoogleAnalyticsObject']=r;i[r]=i[r]||function(){
(i[r].q=i[r].q||[]).push(arguments)},i[r].l=1*new Date();a=s.createElement(o),
m=s.getElementsByTagName(o)[0];a.async=1;a.src=g;m.parentNode.insertBefore(a,m)
})(window,document,'script','//www.google-analytics.com/analytics.js','ga');
ga('create', 'UA-1860730-1', 'iris.edu');
ga('send', 'pageview');
</script>
</head>
<body>
<div class="container">
<div class="container-inner">
<header>
<div id="header">
<div id="header-left">
<div id="logo">
<a href="http://ds.iris.edu/hq/" title="IRIS">
<img alt="IRIS" src="/static/img/layout/logos/iris_logo_shadow.png"/>
</a>
</div>
<div id="logo-name">
Incorporated Research Institutions for Seismology
</div>
</div>
<!-- #header-right -->
<div id="header-right">
<ul id="top-menu">
<li>
<a href="http://ds.iris.edu/ds/nodes/dmc/" title="IRIS DMC">DMC</a>
</li>
<li>
<a href="http://www.iris.edu/hq" title="IRIS HQ">Home</a>
</li>
</ul>
<div id="nsf-logo">
<a href="http://www.nsf.gov/" target="_blank" title="The National Science Foundation">
<img alt="The National Science Foundation" src="/static/img/layout/logos/nsf.png"/>
</a>
</div>
<!-- #nsf -->
</div>
<div class="shadow-down"></div>
</div>
<!-- #header -->
<!--Iris only meny -->
</header>
<div class="wrapper">
<div>
<ul class="breadcrumb">
<li>
<a href="/">Web Services</a>
</li>
</ul>
</div>
<div id="page">
<div id="page-content">
<div class="alert alert-block alert-info">
<h4>Maintenance Work on Wednesday 7 Nov</h4>
<small>Posted:
<time pubdate datetime="2018-11-06T11:58:28 PST">
11/06/2018 11:58 a.m.
</time>
</small>
	<p>Data Services will be performing a system upgrade on <strong>Wednesday 7 November</strong>, starting around <strong>06:30 <span class="caps">PST</span></strong>. This should have minimal impact on users, but there may be some temporary reductions in functionality throughout the day.</p>
</div>
<h1>
404 Page Not Found Error
</h1>
<div id="content">
<p>We are sorry, but the page you are requesting does not exist.</p>
<p>Please check the URL path you are requested and try again.</p>
<p>If you believe the error to be ours, please
<a href="http://www.iris.edu/hq/contact">contact</a>
us.</p>
</div>
</div>
</div>
</div>
<div id="footer">
<div class="shadow-up"></div>
<div id="footer-bottom">
<ul>
<li><span><a href="http://www.iris.edu/hq" title="IRIS"><img src="/static/img/layout/logos/URL_TXT.png" /></a></span></li>
<li><em><a href="http://www.nsf.gov/" title="The National Science Foundation" target="_blank">Sponsored by the National Science Foundation</a></em></li>
<li><a href="http://www.iris.edu/hq" title="IRIS">&copy; Copyright 2018 IRIS</a></li>
<li>1200 New York Avenue NW, Suite 400, Washington, DC 20005, 202-682-2220</li>
<li><a href="mailto:info@iris.edu">info@iris.edu</a></li>
</ul>
</div><!-- #footer-bottom -->
</div><!-- #footer -->
<div class="cachebuster" title="Click to force a refresh.">
Page built 10:01:51 | v.65d82faf
</div>
<script>
/* Cachebuster -- this is a link to the current page with a trailing query parameter, which will cause the cache to be bypassed */
$(function() {
// Cachebuster goes in the search attribute (eg. the query string)
var search = window.location.search;
// Only operate if there's no search or it's an existing cachebuster parameter
if (!search || search.match(/^\?\d+$/)) {
$('.cachebuster').click(function() {
window.location.search = '?' + (new Date()).getTime();
});
} else {
$('.cachebuster').empty();
}
});
</script>
</div>
</div><!-- #site-container -->
</body>
</html>
Traceback (most recent call last):
File "/private-backup/home/obspy/update-docs/src/obspy/obspy/clients/syngine/tests/test_client.py", line 65, in test_get_model_info
info = self.c.get_model_info("test")
File "/private-backup/home/obspy/update-docs/src/obspy/obspy/clients/syngine/client.py", line 83, in get_model_info
params={"model": model_name})
File "/private-backup/home/obspy/update-docs/src/obspy/obspy/clients/base.py", line 245, in _download
self._handle_requests_http_error(r)
File "/private-backup/home/obspy/update-docs/src/obspy/obspy/clients/syngine/client.py", line 62, in _handle_requests_http_error
raise ClientHTTPException(msg.strip())
obspy.clients.base.ClientHTTPException: HTTP code 404 when downloading 'http://service.iris.edu/irisws/syngine/1/info?model=test':
<!doctype html>
<html lang="en">
<head>
<title>
IRIS:
404 Page Not Found Error
</title>
<meta name="keywords" content="seismology, seismological data,
earthquakes, iris dmc" />
<meta name="description" content="IRIS is a consortium of
universities dedicated to the operation of science facilities
for the acquisition, management, and distribution of seismological
data." />
<!-- Forces IE to render in 'latest' compatible mode -->
<meta http-equiv="X-UA-Compatible" content="IE=Edge"/>
<meta charset="utf-8" />
<meta name="viewport" content="width=device-width, initial-scale=1" />
<link rel="stylesheet" media="all" type="text/css" href="/static/css/iris.css" />
<link rel="stylesheet" media="print" type="text/css" href="/static/css/print.css" />
<link rel="shortcut icon" href="/static/img/favicon.ico" />
<script type="text/javascript" src="//ajax.googleapis.com/ajax/libs/jquery/1.11.1/jquery.js"></script>
<script type="text/javascript" src="//netdna.bootstrapcdn.com/bootstrap/3.3.1/js/bootstrap.min.js"></script>
<script>
(function(i,s,o,g,r,a,m){i['GoogleAnalyticsObject']=r;i[r]=i[r]||function(){
(i[r].q=i[r].q||[]).push(arguments)},i[r].l=1*new Date();a=s.createElement(o),
m=s.getElementsByTagName(o)[0];a.async=1;a.src=g;m.parentNode.insertBefore(a,m)
})(window,document,'script','//www.google-analytics.com/analytics.js','ga');
ga('create', 'UA-1860730-1', 'iris.edu');
ga('send', 'pageview');
</script>
</head>
<body>
<div class="container">
<div class="container-inner">
<header>
<div id="header">
<div id="header-left">
<div id="logo">
<a href="http://ds.iris.edu/hq/" title="IRIS">
<img alt="IRIS" src="/static/img/layout/logos/iris_logo_shadow.png"/>
</a>
</div>
<div id="logo-name">
Incorporated Research Institutions for Seismology
</div>
</div>
<!-- #header-right -->
<div id="header-right">
<ul id="top-menu">
<li>
<a href="http://ds.iris.edu/ds/nodes/dmc/" title="IRIS DMC">DMC</a>
</li>
<li>
<a href="http://www.iris.edu/hq" title="IRIS HQ">Home</a>
</li>
</ul>
<div id="nsf-logo">
<a href="http://www.nsf.gov/" target="_blank" title="The National Science Foundation">
<img alt="The National Science Foundation" src="/static/img/layout/logos/nsf.png"/>
</a>
</div>
<!-- #nsf -->
</div>
<div class="shadow-down"></div>
</div>
<!-- #header -->
<!--Iris only meny -->
</header>
<div class="wrapper">
<div>
<ul class="breadcrumb">
<li>
<a href="/">Web Services</a>
</li>
</ul>
</div>
<div id="page">
<div id="page-content">
<div class="alert alert-block alert-info">
<h4>Maintenance Work on Wednesday 7 Nov</h4>
<small>Posted:
<time pubdate datetime="2018-11-06T11:58:28 PST">
11/06/2018 11:58 a.m.
</time>
</small>
	<p>Data Services will be performing a system upgrade on <strong>Wednesday 7 November</strong>, starting around <strong>06:30 <span class="caps">PST</span></strong>. This should have minimal impact on users, but there may be some temporary reductions in functionality throughout the day.</p>
</div>
<h1>
404 Page Not Found Error
</h1>
<div id="content">
<p>We are sorry, but the page you are requesting does not exist.</p>
<p>Please check the URL path you are requested and try again.</p>
<p>If you believe the error to be ours, please
<a href="http://www.iris.edu/hq/contact">contact</a>
us.</p>
</div>
</div>
</div>
</div>
<div id="footer">
<div class="shadow-up"></div>
<div id="footer-bottom">
<ul>
<li><span><a href="http://www.iris.edu/hq" title="IRIS"><img src="/static/img/layout/logos/URL_TXT.png" /></a></span></li>
<li><em><a href="http://www.nsf.gov/" title="The National Science Foundation" target="_blank">Sponsored by the National Science Foundation</a></em></li>
<li><a href="http://www.iris.edu/hq" title="IRIS">&copy; Copyright 2018 IRIS</a></li>
<li>1200 New York Avenue NW, Suite 400, Washington, DC 20005, 202-682-2220</li>
<li><a href="mailto:info@iris.edu">info@iris.edu</a></li>
</ul>
</div><!-- #footer-bottom -->
</div><!-- #footer -->
<div class="cachebuster" title="Click to force a refresh.">
Page built 10:01:50 | v.65d82faf
</div>
<script>
/* Cachebuster -- this is a link to the current page with a trailing query parameter, which will cause the cache to be bypassed */
$(function() {
// Cachebuster goes in the search attribute (eg. the query string)
var search = window.location.search;
// Only operate if there's no search or it's an existing cachebuster parameter
if (!search || search.match(/^\?\d+$/)) {
$('.cachebuster').click(function() {
window.location.search = '?' + (new Date()).getTime();
});
} else {
$('.cachebuster').empty();
}
});
</script>
</div>
</div><!-- #site-container -->
</body>
</html>

Skipped Tests (43)

Submodule Test Skip Message
clients.arclink test_get_waveform_with_default_dcid_key_file (obspy.clients.arclink.tests.test_decrypt.ClientTestCase) $HOME/dcidpasswords.txt already exists
clients.arclink test_m2crypto (obspy.clients.arclink.tests.test_decrypt.ClientTestCase) M2Crypto is not installed
core test_flake8 (obspy.core.tests.test_code_formatting.CodeFormattingTestCase) Formatting tests require at least flake8 3.0.
core test_location_plot_global (obspy.core.tests.test_network.NetworkCartopyTestCase) cartopy not installed
core test_location_plot_local (obspy.core.tests.test_network.NetworkCartopyTestCase) cartopy not installed
core test_location_plot_ortho (obspy.core.tests.test_network.NetworkCartopyTestCase) cartopy not installed
core test_location_plot_global (obspy.core.tests.test_inventory.InventoryCartopyTestCase) cartopy not installed
core test_location_plot_local (obspy.core.tests.test_inventory.InventoryCartopyTestCase) cartopy not installed
core test_location_plot_ortho (obspy.core.tests.test_inventory.InventoryCartopyTestCase) cartopy not installed
core test_catalog_plot_global (obspy.core.tests.test_event.CatalogCartopyTestCase) Cartopy not installed or too old
core test_catalog_plot_local (obspy.core.tests.test_event.CatalogCartopyTestCase) Cartopy not installed or too old
core test_catalog_plot_ortho (obspy.core.tests.test_event.CatalogCartopyTestCase) Cartopy not installed or too old
core test_catalog_plot_ortho_longitude_wrap (obspy.core.tests.test_event.CatalogCartopyTestCase) Cartopy not installed or too old
clients.seedlink test_info (obspy.clients.seedlink.tests.test_slclient.SLClientTestCase) test must be started manually
clients.seedlink test_issue708 (obspy.clients.seedlink.tests.test_slclient.SLClientTestCase) test must be started manually
clients.seedlink test_time_window (obspy.clients.seedlink.tests.test_slclient.SLClientTestCase) test must be started manually
imaging test_script_plot (obspy.imaging.tests.test_mopad_script.MopadTestCase) Currently broken until further review.
taup test_compute_ray_paths (obspy.taup.tests.test_ray_paths.RayPathCalculationsTestCase) test needs geographiclib >= 1.34
taup test_path_geo (obspy.taup.tests.test_taup_geo.TaupGeoTestCase) Module geographiclib is not installed or too old.
taup test_path_resampling (obspy.taup.tests.test_taup_geo.TaupGeoTestCase) Module geographiclib is not installed or too old.
taup test_p_iasp91_geo_manual (obspy.taup.tests.test_tau.TauPyModelTestCase) Module geographiclib is not installed
taup test_pierce_p_iasp91_geo (obspy.taup.tests.test_tau.TauPyModelTestCase) test needs geographiclib >= 1.34
taup test_single_path_geo_iasp91 (obspy.taup.tests.test_tau.TauPyModelTestCase) test needs geographiclib >= 1.34
geodetics test_gps_2_dist_azimuth_with_geographiclib (obspy.geodetics.tests.test_util_geodetics.UtilGeodeticsTestCase) Module geographiclib is not installed
geodetics test_issue_375 (obspy.geodetics.tests.test_util_geodetics.UtilGeodeticsTestCase) Module geographiclib is not installed
clients.seishub test_get_channel_ids (obspy.clients.seishub.tests.test_client.ClientTestCase) Seishub test server not reachable.
clients.seishub test_get_coordinates (obspy.clients.seishub.tests.test_client.ClientTestCase) Seishub test server not reachable.
clients.seishub test_get_event_list (obspy.clients.seishub.tests.test_client.ClientTestCase) Seishub test server not reachable.
clients.seishub test_get_location_ids (obspy.clients.seishub.tests.test_client.ClientTestCase) Seishub test server not reachable.
clients.seishub test_get_network_ids (obspy.clients.seishub.tests.test_client.ClientTestCase) Seishub test server not reachable.
clients.seishub test_get_paz (obspy.clients.seishub.tests.test_client.ClientTestCase) Seishub test server not reachable.
clients.seishub test_get_preview (obspy.clients.seishub.tests.test_client.ClientTestCase) Seishub test server not reachable.
clients.seishub test_get_preview_by_ids (obspy.clients.seishub.tests.test_client.ClientTestCase) Seishub test server not reachable.
clients.seishub test_get_station_ids (obspy.clients.seishub.tests.test_client.ClientTestCase) Seishub test server not reachable.
clients.seishub test_get_waveform_with_metadata (obspy.clients.seishub.tests.test_client.ClientTestCase) Seishub test server not reachable.
clients.seishub test_get_waveforms (obspy.clients.seishub.tests.test_client.ClientTestCase) Seishub test server not reachable.
clients.seishub test_localcache (obspy.clients.seishub.tests.test_client.ClientTestCase) Seishub test server not reachable.
clients.seishub test_ping (obspy.clients.seishub.tests.test_client.ClientTestCase) Seishub test server not reachable.
io.shapefile test_write_catalog_shapefile (obspy.io.shapefile.tests.test_core.ShapefileTestCase) pyshp not installed
io.shapefile test_write_catalog_shapefile_via_plugin (obspy.io.shapefile.tests.test_core.ShapefileTestCase) pyshp not installed
io.shapefile test_write_catalog_shapefile_with_extra_field (obspy.io.shapefile.tests.test_core.ShapefileTestCase) pyshp not installed
io.shapefile test_write_inventory_shapefile (obspy.io.shapefile.tests.test_core.ShapefileTestCase) pyshp not installed
io.shapefile test_write_inventory_shapefile_via_plugin (obspy.io.shapefile.tests.test_core.ShapefileTestCase) pyshp not installed

Slowest Tests (20)

Runtime Test
27.128s test_plot_farfield_without_quiver_with_maps (obspy.core.tests.test_event.EventTestCase)
24.171s test_get_networks (obspy.clients.arclink.tests.test_client.ClientTestCase)
15.256s test_response_calculation_from_seed_and_xseed (obspy.io.xseed.tests.test_core.CoreTestCase)
15.251s __init__ (obspy.taup)
12.654s test_plot_multiple_traces (obspy.imaging.tests.test_waveform.WaveformTestCase)
10.737s test_plot_colored_section (obspy.imaging.tests.test_waveform.WaveformTestCase)
10.344s test_plot_horizontal_section (obspy.imaging.tests.test_waveform.WaveformTestCase)
10.191s test_ppsd_restricted_stacks (obspy.signal.tests.test_spectral_estimation.PsdTestCase)
9.996s test_get_waveform_instrument_change (obspy.clients.arclink.tests.test_client.ClientTestCase)
9.984s test_shoot_existing_ray_param (obspy.taup.tests.test_seismic_phase.TauPySeismicPhaseTestCase)
9.848s test_plot_wiggles_horizontal_section (obspy.imaging.tests.test_waveform.WaveformTestCase)
9.466s test_plot_ref_time_section (obspy.imaging.tests.test_waveform.WaveformTestCase)
9.030s test_get_waveform_with_metadata (obspy.clients.arclink.tests.test_client.ClientTestCase)
9.023s test_plot_wiggles_vertical_section (obspy.imaging.tests.test_waveform.WaveformTestCase)
8.940s test_plot_wiggles_negative_section (obspy.imaging.tests.test_waveform.WaveformTestCase)
8.871s test_plot_default_section (obspy.imaging.tests.test_waveform.WaveformTestCase)
8.741s test_plot_wiggles_positive_section (obspy.imaging.tests.test_waveform.WaveformTestCase)
8.639s test_plot_azim_section (obspy.imaging.tests.test_waveform.WaveformTestCase)
7.523s test_relcal_different_overlaps (obspy.signal.tests.test_calibration.CalibrationTestCase)
7.522s test_issue_311 (obspy.clients.arclink.tests.test_client.ClientTestCase)

Chuck Norris Fact

Chuck Norris can write multi-threaded applications with a single thread.