#110713 Report by node travis-ci covering 2097 tests from 49 modules resulted into 4 errors

Report

ObsPy version
1.2.1.post0+6.ge100422e36
Continuous Integration
https://travis-ci.org/obspy/obspy/jobs/683863440
GitHub Pull Request
https://github.com/obspy/obspy/pull/2610
Report file
XML document
Total runtime
250.2 sec
Report date/time
2020-05-06 09:43:42

System / Python

Architecture
64bit
Machine
x86_64
Node
travis-ci
Processor
x86_64
Python Compiler
GCC 7.3.0
Python Implementation
CPython
Python Version
3.8.2
Release
4.15.0-1028-gcp
System
Linux
Version
#29~16.04.1-Ubuntu SMP Tue Feb 12 16:31:10 UTC 2019

Dependencies

cartopy
---
decorator
4.4.2
flake8
---
future
0.18.2
geographiclib
1.50
lxml.etree
4.5.0
m2crypto
---
matplotlib
3.2.1
mock
4.0.2
mpl_toolkits.basemap
1.2.1
numpy
1.18.4
pep8-naming
---
pyflakes
---
pyimgur
0.5.2
pyproj
1.9.6
requests
2.23.0
scipy
1.4.1
setuptools
46.1.3.post20200325
shapefile
2.1.0
sqlalchemy
1.3.16

Modules (49)

Module Errors / Failures Tracebacks
obspy.clients.arclink Not tested -
obspy.clients.earthworm Not tested -
obspy.clients.fdsn 4 1 2 3 4
obspy.clients.filesystem - -
obspy.clients.iris Not tested -
obspy.clients.neic Not tested -
obspy.clients.nrl Not tested -
obspy.clients.seedlink Not tested -
obspy.clients.seishub Not tested -
obspy.clients.syngine Not tested -
obspy.core - -
obspy.db - -
obspy.geodetics - -
obspy.imaging - -
obspy.io.ah - -
obspy.io.arclink - -
obspy.io.ascii - -
obspy.io.cmtsolution - -
obspy.io.cnv - -
obspy.io.css - -
obspy.io.dmx - -
obspy.io.focmec - -
obspy.io.gcf - -
obspy.io.gse2 - -
obspy.io.iaspei - -
obspy.io.json - -
obspy.io.kinemetrics - -
obspy.io.kml - -
obspy.io.mseed - -
obspy.io.ndk - -
obspy.io.nied - -
obspy.io.nlloc - -
obspy.io.nordic - -
obspy.io.pdas - -
obspy.io.pde - -
obspy.io.quakeml - -
obspy.io.reftek - -
obspy.io.rg16 - -
obspy.io.sac - -
obspy.io.scardec - -
obspy.io.seg2 - -
obspy.io.segy - -
obspy.io.seisan - -
obspy.io.seiscomp - -
obspy.io.sh - -
obspy.io.shapefile - -
obspy.io.stationtxt - -
obspy.io.stationxml - -
obspy.io.wav - -
obspy.io.win - -
obspy.io.xseed - -
obspy.io.y - -
obspy.io.zmap - -
obspy.realtime - -
obspy.scripts - -
obspy.signal - -
obspy.taup - -
Summary 4 4

Tracebacks (4)

Traceback (most recent call last):
File "/home/travis/miniconda/envs/test-environment/lib/python3.8/site-packages/obspy/clients/fdsn/tests/test_client.py", line 948, in test_dataselect_bulk
got = client.get_waveforms_bulk(bulk)
File "/home/travis/miniconda/envs/test-environment/lib/python3.8/site-packages/obspy/clients/fdsn/client.py", line 1023, in get_waveforms_bulk
data_stream = self._download(url,
File "/home/travis/miniconda/envs/test-environment/lib/python3.8/site-packages/obspy/clients/fdsn/client.py", line 1397, in _download
raise_on_error(code, data)
File "/home/travis/miniconda/envs/test-environment/lib/python3.8/site-packages/obspy/clients/fdsn/client.py", line 1727, in raise_on_error
raise FDSNException("Unauthorized, authentication required.",
obspy.clients.fdsn.header.FDSNException: Unauthorized, authentication required.
Traceback (most recent call last):
File "/home/travis/miniconda/envs/test-environment/lib/python3.8/site-packages/obspy/clients/fdsn/tests/test_client.py", line 1498, in test_eida_token_resolution
user, password = client._resolve_eida_token(token=token)
File "/home/travis/miniconda/envs/test-environment/lib/python3.8/site-packages/obspy/clients/fdsn/client.py", line 386, in _resolve_eida_token
response = self._download(url=url, data=token.encode(),
File "/home/travis/miniconda/envs/test-environment/lib/python3.8/site-packages/obspy/clients/fdsn/client.py", line 1397, in _download
raise_on_error(code, data)
File "/home/travis/miniconda/envs/test-environment/lib/python3.8/site-packages/obspy/clients/fdsn/client.py", line 1725, in raise_on_error
raise FDSNException(msg, server_info)
obspy.clients.fdsn.header.FDSNException: Bad request. If you think your request was valid please contact the developers.
Detailed response of server:
Error 400: Bad Request
token is expired
Usage details are available from /fdsnws/dataselect/1/
Request:
/fdsnws/dataselect/1/auth
Request Submitted:
2020-05-06T14:39:56.517642
Service Version:
1.1.0
Traceback (most recent call last):
File "/home/travis/miniconda/envs/test-environment/lib/python3.8/site-packages/obspy/clients/fdsn/tests/test_client.py", line 1375, in test_redirection_auth
st = c_auth.get_waveforms(
File "/home/travis/miniconda/envs/test-environment/lib/python3.8/site-packages/obspy/clients/fdsn/client.py", line 844, in get_waveforms
data_stream = self._download(url, use_gzip=False)
File "/home/travis/miniconda/envs/test-environment/lib/python3.8/site-packages/obspy/clients/fdsn/client.py", line 1397, in _download
raise_on_error(code, data)
File "/home/travis/miniconda/envs/test-environment/lib/python3.8/site-packages/obspy/clients/fdsn/client.py", line 1727, in raise_on_error
raise FDSNException("Unauthorized, authentication required.",
obspy.clients.fdsn.header.FDSNException: Unauthorized, authentication required.
Traceback (most recent call last):
File "/home/travis/miniconda/envs/test-environment/lib/python3.8/doctest.py", line 2197, in runTest
raise self.failureException(self.format_failure(new.getvalue()))
AssertionError: Failed doctest test for obspy.clients.fdsn.client.Client.get_stations_bulk
File "/home/travis/miniconda/envs/test-environment/lib/python3.8/site-packages/obspy/clients/fdsn/client.py", line 1038, in get_stations_bulk
----------------------------------------------------------------------
File "/home/travis/miniconda/envs/test-environment/lib/python3.8/site-packages/obspy/clients/fdsn/client.py", line 1070, in obspy.clients.fdsn.client.Client.get_stations_bulk
Failed example:
print(inv) # doctest: +ELLIPSIS +NORMALIZE_WHITESPACE
Expected:
Inventory created at ...
Created by: IRIS WEB SERVICE: fdsnws-station | version: ...
...
Sending institution: IRIS-DMC (IRIS-DMC)
Contains:
Networks (2):
GR, IU
Stations (2):
GR.GRA1 (GRAFENBERG ARRAY, BAYERN)
IU.ANMO (Albuquerque, New Mexico, USA)
Channels (0):
Got:
Inventory created at 2020-05-06T14:39:28.000000Z
	Created by: IRIS WEB SERVICE: fdsnws-station | version: 1.1.45
		
	Sending institution: IRIS-DMC (IRIS-DMC)
	Contains:
		Networks (2):
			GR, IU
		Stations (2):
			GR.GRA1 (GRAFENBERG ARRAY, BAYERN)
			IU.ANMO (Albuquerque, New Mexico, USA)
		Channels (0):
<BLANKLINE>
----------------------------------------------------------------------
File "/home/travis/miniconda/envs/test-environment/lib/python3.8/site-packages/obspy/clients/fdsn/client.py", line 1100, in obspy.clients.fdsn.client.Client.get_stations_bulk
Failed example:
print(inv) # doctest: +ELLIPSIS +NORMALIZE_WHITESPACE
Expected:
Inventory created at ...
Created by: IRIS WEB SERVICE: fdsnws-station | version: ...
...
Sending institution: IRIS-DMC (IRIS-DMC)
Contains:
Networks (2):
GR, IU
Stations (2):
GR.GRA1 (GRAFENBERG ARRAY, BAYERN)
IU.ANMO (Albuquerque, New Mexico, USA)
Channels (5):
GR.GRA1..BHZ, GR.GRA1..BHN, GR.GRA1..BHE, IU.ANMO.00.BHZ,
IU.ANMO.10.BHZ
Got:
Inventory created at 2020-05-06T14:39:28.000000Z
	Created by: IRIS WEB SERVICE: fdsnws-station | version: 1.1.45
		
	Sending institution: IRIS-DMC (IRIS-DMC)
	Contains:
		Networks (2):
			GR, IU
		Stations (2):
			GR.GRA1 (GRAFENBERG ARRAY, BAYERN)
			IU.ANMO (Albuquerque, New Mexico, USA)
		Channels (5):
			GR.GRA1..BHZ, GR.GRA1..BHN, GR.GRA1..BHE, IU.ANMO.00.BHZ,
			IU.ANMO.10.BHZ

Skipped tests (25)

Submodule Test Skip message
core test_flake8 (obspy.core.tests.test_code_formatting.CodeFormattingTestCase) Formatting tests require at least flake8 3.0.
core test_location_plot_global (obspy.core.tests.test_network.NetworkBasemapTestCase) unsupported proj4 library
core test_location_plot_global (obspy.core.tests.test_network.NetworkCartopyTestCase) cartopy not installed
core test_location_plot_local (obspy.core.tests.test_network.NetworkCartopyTestCase) cartopy not installed
core test_location_plot_ortho (obspy.core.tests.test_network.NetworkCartopyTestCase) cartopy not installed
core test_combined_station_event_plot (obspy.core.tests.test_inventory.InventoryBasemapTestCase) matplotlib 3.0.1 is not compatible with basemap
core test_location_plot_global (obspy.core.tests.test_inventory.InventoryBasemapTestCase) matplotlib 3.0.1 is not compatible with basemap
core test_location_plot_local (obspy.core.tests.test_inventory.InventoryBasemapTestCase) matplotlib 3.0.1 is not compatible with basemap
core test_location_plot_ortho (obspy.core.tests.test_inventory.InventoryBasemapTestCase) matplotlib 3.0.1 is not compatible with basemap
core test_location_plot_global (obspy.core.tests.test_inventory.InventoryCartopyTestCase) cartopy not installed
core test_location_plot_local (obspy.core.tests.test_inventory.InventoryCartopyTestCase) cartopy not installed
core test_location_plot_ortho (obspy.core.tests.test_inventory.InventoryCartopyTestCase) cartopy not installed
core test_catalog_plot_global (obspy.core.tests.test_event.CatalogBasemapTestCase) matplotlib 3.0.1 is not compatible with basemap
core test_catalog_plot_local (obspy.core.tests.test_event.CatalogBasemapTestCase) matplotlib 3.0.1 is not compatible with basemap
core test_catalog_plot_ortho (obspy.core.tests.test_event.CatalogBasemapTestCase) matplotlib 3.0.1 is not compatible with basemap
core test_catalog_plot_ortho_longitude_wrap (obspy.core.tests.test_event.CatalogBasemapTestCase) matplotlib 3.0.1 is not compatible with basemap
core test_plot_catalog_before_1900 (obspy.core.tests.test_event.CatalogBasemapTestCase) matplotlib 3.0.1 is not compatible with basemap
core test_catalog_plot_global (obspy.core.tests.test_event.CatalogCartopyTestCase) Cartopy not installed or too old
core test_catalog_plot_local (obspy.core.tests.test_event.CatalogCartopyTestCase) Cartopy not installed or too old
core test_catalog_plot_ortho (obspy.core.tests.test_event.CatalogCartopyTestCase) Cartopy not installed or too old
core test_catalog_plot_ortho_longitude_wrap (obspy.core.tests.test_event.CatalogCartopyTestCase) Cartopy not installed or too old
core test_plot_farfield_without_quiver_with_maps (obspy.core.tests.test_event.EventTestCase) matplotlib 3.0.1 is not compatible with basemap
geodetics test_gps_2_dist_azimuth_bug150 (obspy.geodetics.tests.test_util_geodetics.UtilGeodeticsTestCase) Module geographiclib is installed, not using calc_vincenty_inverse
imaging test_script_plot (obspy.imaging.tests.test_mopad_script.MopadTestCase) Currently broken until further review.
signal test_ppsd_spectrogram_plot (obspy.signal.tests.test_spectral_estimation.PsdTestCase) matplotlib >= 3 shifts labels

Slowest tests (20)

Runtime Test
9.627s test_response_calculation_from_seed_and_xseed (obspy.io.xseed.tests.test_core.CoreTestCase)
8.433s test_get_waveforms_integration_test (obspy.clients.fdsn.tests.test_eidaws_routing_client.EIDAWSRoutingClientTestCase)
8.194s __init__ (obspy.taup)
6.310s test_dataselect_bulk (obspy.clients.fdsn.tests.test_client.ClientTestCase)
6.296s test_shoot_existing_ray_param (obspy.taup.tests.test_seismic_phase.TauPySeismicPhaseTestCase)
6.142s test_ppsd_restricted_stacks (obspy.signal.tests.test_spectral_estimation.PsdTestCase)
5.074s test_plot_multiple_traces (obspy.imaging.tests.test_waveform.WaveformTestCase)
4.737s test_relcal_different_overlaps (obspy.signal.tests.test_calibration.CalibrationTestCase)
3.773s plot_travel_times (obspy.taup.tau)
3.442s test_polarization_vidale (obspy.signal.tests.test_polarization.PolarizationTestCase)
3.289s test_regional_models (obspy.taup.tests.test_tau.TauPyModelTestCase)
3.226s test_vs_java_iasp91 (obspy.taup.tests.test_tau.TauPyModelTestCase)
3.044s test_iris_example_queries_dataselect_discover_services_false (obspy.clients.fdsn.tests.test_client.ClientTestCase)
2.897s test_iris_example_queries_dataselect (obspy.clients.fdsn.tests.test_client.ClientTestCase)
2.843s test_remove_response_plot (obspy.core.tests.test_trace.TraceTestCase)
2.685s test_rotate2zne_against_lqt_different_combinations (obspy.signal.tests.test_rotate.RotateTestCase)
2.628s test_correlate_stream_template_and_correlation_detector (obspy.signal.tests.test_cross_correlation.CrossCorrelationTestCase)
2.621s test_many_identically_named_phases (obspy.taup.tests.test_seismic_phase.TauPySeismicPhaseTestCase)
2.582s test_auto_read_arclink_xml (obspy.io.arclink.tests.test_inventory_xml.ArclinkInventoryTestCase)
2.473s read (obspy.core.stream)

Chuck Norris fact

Chuck Norris breaks RSA 128-bit encrypted codes in milliseconds.