#111254 Report by node conda-forge covering 1968 tests from 49 modules resulted into 8 errors

Report

ObsPy version
1.2.2rc1
Continuous Integration
-
GitHub Pull Request
-
Report file
XML document
Total runtime
372.4 sec
Report date/time
2020-06-29 07:21:41

System / Python

Architecture
64bit
Machine
AMD64
Node
conda-forge
Processor
Intel64 Family 6 Model 85 Stepping 4, GenuineIntel
Python Compiler
MSC v.1500 64 bit (AMD64)
Python Implementation
CPython
Python Version
2.7.15
Release
10
System
Windows
Version
10.0.14393

Dependencies

cartopy
0.17.0
decorator
4.4.2
flake8
3.8.3
future
0.18.2
geographiclib
---
lxml.etree
4.5.0
m2crypto
---
matplotlib
2.2.5
mock
3.0.5
mpl_toolkits.basemap
---
numpy
1.16.5
pep8-naming
---
pyflakes
2.2.0
pyimgur
---
pyproj
1.9.6
requests
2.24.0
scipy
1.2.1
setuptools
44.0.0.post20200102
shapefile
2.1.0
sqlalchemy
1.3.15

Modules (49)

Module Errors / Failures Tracebacks
obspy.clients.arclink Not tested -
obspy.clients.earthworm Not tested -
obspy.clients.fdsn Not tested -
obspy.clients.filesystem - -
obspy.clients.iris Not tested -
obspy.clients.neic Not tested -
obspy.clients.nrl Not tested -
obspy.clients.seedlink Not tested -
obspy.clients.seishub Not tested -
obspy.clients.syngine Not tested -
obspy.core - -
obspy.db - -
obspy.geodetics - -
obspy.imaging - -
obspy.io.ah - -
obspy.io.arclink - -
obspy.io.ascii - -
obspy.io.cmtsolution - -
obspy.io.cnv - -
obspy.io.css - -
obspy.io.dmx - -
obspy.io.focmec - -
obspy.io.gcf - -
obspy.io.gse2 - -
obspy.io.hypodd - -
obspy.io.iaspei - -
obspy.io.json - -
obspy.io.kinemetrics - -
obspy.io.kml - -
obspy.io.mseed - -
obspy.io.ndk - -
obspy.io.nied - -
obspy.io.nlloc - -
obspy.io.nordic 8 1 2 3 4 5 6 7 8
obspy.io.pdas - -
obspy.io.pde - -
obspy.io.quakeml - -
obspy.io.reftek - -
obspy.io.rg16 - -
obspy.io.sac - -
obspy.io.scardec - -
obspy.io.seg2 - -
obspy.io.segy - -
obspy.io.seisan - -
obspy.io.seiscomp - -
obspy.io.sh - -
obspy.io.shapefile - -
obspy.io.stationtxt - -
obspy.io.stationxml - -
obspy.io.wav - -
obspy.io.win - -
obspy.io.xseed - -
obspy.io.y - -
obspy.io.zmap - -
obspy.realtime - -
obspy.scripts - -
obspy.signal - -
obspy.taup - -
Summary 8 8

Tracebacks (8)

Traceback (most recent call last):
File "D:\bld\obspy_1593432125817\_test_env\lib\site-packages\obspy\io\nordic\tests\test_nordic.py", line 232, in test_fail_writing
self.assertTrue(os.path.isfile(tf.name))
File "D:\bld\obspy_1593432125817\_test_env\lib\site-packages\obspy\core\util\base.py", line 133, in __exit__
os.remove(self.name)
WindowsError: [Error 32] The process cannot access the file because it is being used by another process: u'c:\\users\\vssadm~1\\appdata\\local\\temp\\obspy-bjjj28.tmp'
Traceback (most recent call last):
File "D:\bld\obspy_1593432125817\_test_env\lib\site-packages\obspy\io\nordic\tests\test_nordic.py", line 677, in test_large_negative_longitude
event.write(tf.name, format="NORDIC")
File "D:\bld\obspy_1593432125817\_test_env\lib\site-packages\obspy\core\event\event.py", line 320, in write
Catalog(events=[self]).write(filename, format, **kwargs)
File "D:\bld\obspy_1593432125817\_test_env\lib\site-packages\obspy\core\event\catalog.py", line 509, in write
return write_format(self, filename, **kwargs)
File "D:\bld\obspy_1593432125817\_test_env\lib\site-packages\obspy\io\nordic\core.py", line 940, in write_select
string_io=select, high_accuracy=high_accuracy)
File "D:\bld\obspy_1593432125817\_test_env\lib\site-packages\obspy\io\nordic\core.py", line 1149, in _write_nordic
sfile.write(_write_hyp_error_line(origin) + '\n')
File "D:\bld\obspy_1593432125817\_test_env\lib\site-packages\obspy\io\nordic\core.py", line 1310, in _write_hyp_error_line
cov = Ellipse.from_origin_uncertainty(origin.origin_uncertainty).\
File "D:\bld\obspy_1593432125817\_test_env\lib\site-packages\obspy\io\nordic\ellipse.py", line 209, in to_cov
sin_theta = np.sin(np.radians(self.theta))
AttributeError: 'NoneType' object has no attribute 'radians'
Traceback (most recent call last):
File "D:\bld\obspy_1593432125817\_test_env\lib\site-packages\obspy\io\nordic\tests\test_nordic.py", line 543, in test_more_than_three_mags
cat.write(tf.name, format='nordic')
File "D:\bld\obspy_1593432125817\_test_env\lib\site-packages\obspy\core\event\catalog.py", line 509, in write
return write_format(self, filename, **kwargs)
File "D:\bld\obspy_1593432125817\_test_env\lib\site-packages\obspy\io\nordic\core.py", line 940, in write_select
string_io=select, high_accuracy=high_accuracy)
File "D:\bld\obspy_1593432125817\_test_env\lib\site-packages\obspy\io\nordic\core.py", line 1149, in _write_nordic
sfile.write(_write_hyp_error_line(origin) + '\n')
File "D:\bld\obspy_1593432125817\_test_env\lib\site-packages\obspy\io\nordic\core.py", line 1310, in _write_hyp_error_line
cov = Ellipse.from_origin_uncertainty(origin.origin_uncertainty).\
File "D:\bld\obspy_1593432125817\_test_env\lib\site-packages\obspy\io\nordic\ellipse.py", line 209, in to_cov
sin_theta = np.sin(np.radians(self.theta))
AttributeError: 'NoneType' object has no attribute 'radians'
Traceback (most recent call last):
File "D:\bld\obspy_1593432125817\_test_env\lib\site-packages\obspy\io\nordic\tests\test_nordic.py", line 398, in test_multi_writing
overwrite=False))
File "D:\bld\obspy_1593432125817\_test_env\lib\site-packages\obspy\io\nordic\core.py", line 1149, in _write_nordic
sfile.write(_write_hyp_error_line(origin) + '\n')
File "D:\bld\obspy_1593432125817\_test_env\lib\site-packages\obspy\io\nordic\core.py", line 1310, in _write_hyp_error_line
cov = Ellipse.from_origin_uncertainty(origin.origin_uncertainty).\
File "D:\bld\obspy_1593432125817\_test_env\lib\site-packages\obspy\io\nordic\ellipse.py", line 209, in to_cov
sin_theta = np.sin(np.radians(self.theta))
AttributeError: 'NoneType' object has no attribute 'radians'
Traceback (most recent call last):
File "D:\bld\obspy_1593432125817\_test_env\lib\site-packages\obspy\io\nordic\tests\test_nordic.py", line 449, in test_read_wavename
overwrite=True)
File "D:\bld\obspy_1593432125817\_test_env\lib\site-packages\obspy\io\nordic\core.py", line 1149, in _write_nordic
sfile.write(_write_hyp_error_line(origin) + '\n')
File "D:\bld\obspy_1593432125817\_test_env\lib\site-packages\obspy\io\nordic\core.py", line 1310, in _write_hyp_error_line
cov = Ellipse.from_origin_uncertainty(origin.origin_uncertainty).\
File "D:\bld\obspy_1593432125817\_test_env\lib\site-packages\obspy\io\nordic\ellipse.py", line 209, in to_cov
sin_theta = np.sin(np.radians(self.theta))
AttributeError: 'NoneType' object has no attribute 'radians'
Traceback (most recent call last):
File "D:\bld\obspy_1593432125817\_test_env\lib\site-packages\obspy\io\nordic\tests\test_nordic.py", line 67, in test_read_write
overwrite=True)
File "D:\bld\obspy_1593432125817\_test_env\lib\site-packages\obspy\io\nordic\core.py", line 1149, in _write_nordic
sfile.write(_write_hyp_error_line(origin) + '\n')
File "D:\bld\obspy_1593432125817\_test_env\lib\site-packages\obspy\io\nordic\core.py", line 1310, in _write_hyp_error_line
cov = Ellipse.from_origin_uncertainty(origin.origin_uncertainty).\
File "D:\bld\obspy_1593432125817\_test_env\lib\site-packages\obspy\io\nordic\ellipse.py", line 209, in to_cov
sin_theta = np.sin(np.radians(self.theta))
AttributeError: 'NoneType' object has no attribute 'radians'
Traceback (most recent call last):
File "D:\bld\obspy_1593432125817\_test_env\lib\site-packages\obspy\io\nordic\tests\test_nordic.py", line 811, in test_read_write_over_day
write_select(Catalog([event]), filename=tf.name)
File "D:\bld\obspy_1593432125817\_test_env\lib\site-packages\obspy\io\nordic\core.py", line 940, in write_select
string_io=select, high_accuracy=high_accuracy)
File "D:\bld\obspy_1593432125817\_test_env\lib\site-packages\obspy\io\nordic\core.py", line 1149, in _write_nordic
sfile.write(_write_hyp_error_line(origin) + '\n')
File "D:\bld\obspy_1593432125817\_test_env\lib\site-packages\obspy\io\nordic\core.py", line 1310, in _write_hyp_error_line
cov = Ellipse.from_origin_uncertainty(origin.origin_uncertainty).\
File "D:\bld\obspy_1593432125817\_test_env\lib\site-packages\obspy\io\nordic\ellipse.py", line 209, in to_cov
sin_theta = np.sin(np.radians(self.theta))
AttributeError: 'NoneType' object has no attribute 'radians'
Traceback (most recent call last):
File "D:\bld\obspy_1593432125817\_test_env\lib\site-packages\obspy\io\nordic\tests\test_nordic.py", line 525, in test_write_plugin
cat.write(tf.name, format='nordic')
File "D:\bld\obspy_1593432125817\_test_env\lib\site-packages\obspy\core\event\catalog.py", line 509, in write
return write_format(self, filename, **kwargs)
File "D:\bld\obspy_1593432125817\_test_env\lib\site-packages\obspy\io\nordic\core.py", line 940, in write_select
string_io=select, high_accuracy=high_accuracy)
File "D:\bld\obspy_1593432125817\_test_env\lib\site-packages\obspy\io\nordic\core.py", line 1149, in _write_nordic
sfile.write(_write_hyp_error_line(origin) + '\n')
File "D:\bld\obspy_1593432125817\_test_env\lib\site-packages\obspy\io\nordic\core.py", line 1310, in _write_hyp_error_line
cov = Ellipse.from_origin_uncertainty(origin.origin_uncertainty).\
File "D:\bld\obspy_1593432125817\_test_env\lib\site-packages\obspy\io\nordic\ellipse.py", line 209, in to_cov
sin_theta = np.sin(np.radians(self.theta))
AttributeError: 'NoneType' object has no attribute 'radians'

Skipped tests (26)

Submodule Test Skip message
geodetics test_gps_2_dist_azimuth_with_geographiclib (obspy.geodetics.tests.test_util_geodetics.UtilGeodeticsTestCase) Module geographiclib is not installed
geodetics test_issue_375 (obspy.geodetics.tests.test_util_geodetics.UtilGeodeticsTestCase) Module geographiclib is not installed
core test_flake8 (obspy.core.tests.test_code_formatting.CodeFormattingTestCase) flake8 check disabled
core test_catalog_plot_global (obspy.core.tests.test_event.CatalogBasemapTestCase) basemap not installed
core test_catalog_plot_local (obspy.core.tests.test_event.CatalogBasemapTestCase) basemap not installed
core test_catalog_plot_ortho (obspy.core.tests.test_event.CatalogBasemapTestCase) basemap not installed
core test_catalog_plot_ortho_longitude_wrap (obspy.core.tests.test_event.CatalogBasemapTestCase) basemap not installed
core test_plot_catalog_before_1900 (obspy.core.tests.test_event.CatalogBasemapTestCase) basemap not installed
core test_plot_farfield_without_quiver_with_maps (obspy.core.tests.test_event.EventTestCase) basemap not installed
core test_combined_station_event_plot (obspy.core.tests.test_inventory.InventoryBasemapTestCase) basemap not installed
core test_location_plot_global (obspy.core.tests.test_inventory.InventoryBasemapTestCase) basemap not installed
core test_location_plot_local (obspy.core.tests.test_inventory.InventoryBasemapTestCase) basemap not installed
core test_location_plot_ortho (obspy.core.tests.test_inventory.InventoryBasemapTestCase) basemap not installed
core test_location_plot_global (obspy.core.tests.test_network.NetworkBasemapTestCase) basemap not installed
core test_location_plot_local (obspy.core.tests.test_network.NetworkBasemapTestCase) basemap not installed
core test_location_plot_ortho (obspy.core.tests.test_network.NetworkBasemapTestCase) basemap not installed
imaging test_script_plot (obspy.imaging.tests.test_mopad_script.MopadTestCase) Currently broken until further review.
io.mseed test_infinite_loop (obspy.io.mseed.tests.test_mseed_special_issues.MSEEDSpecialIssueTestCase) Test is known to fail when building conda package in Appveyor.
signal test_evalresp_file_like_object (obspy.signal.tests.test_invsim.InvSimTestCase) unreproducible test fail encountered on Appveyor sometimes.
signal test_schema_validation (obspy.signal.tests.test_quality_control.QualityControlTestCase) Test requires the jsonschema module
taup test_compute_ray_paths (obspy.taup.tests.test_ray_paths.RayPathCalculationsTestCase) test needs geographiclib >= 1.34
taup test_p_iasp91_geo_manual (obspy.taup.tests.test_tau.TauPyModelTestCase) Module geographiclib is not installed
taup test_pierce_p_iasp91_geo (obspy.taup.tests.test_tau.TauPyModelTestCase) test needs geographiclib >= 1.34
taup test_single_path_geo_iasp91 (obspy.taup.tests.test_tau.TauPyModelTestCase) test needs geographiclib >= 1.34
taup test_path_geo (obspy.taup.tests.test_taup_geo.TaupGeoTestCase) Module geographiclib is not installed or too old.
taup test_path_resampling (obspy.taup.tests.test_taup_geo.TaupGeoTestCase) Module geographiclib is not installed or too old.

Slowest tests (20)

Runtime Test
22.747s test_is_format (obspy.core.tests.test_waveform_plugins.WaveformPluginsTestCase)
18.999s test_response_calculation_from_seed_and_xseed (obspy.io.xseed.tests.test_core.CoreTestCase)
16.958s test_catalog_plot_local (obspy.core.tests.test_event.CatalogCartopyTestCase)
10.987s __init__ (obspy.taup)
8.957s test_shoot_existing_ray_param (obspy.taup.tests.test_seismic_phase.TauPySeismicPhaseTestCase)
6.433s test_ppsd_restricted_stacks (obspy.signal.tests.test_spectral_estimation.PsdTestCase)
5.884s test_relcal_different_overlaps (obspy.signal.tests.test_calibration.CalibrationTestCase)
5.726s test_plot_multiple_traces (obspy.imaging.tests.test_waveform.WaveformTestCase)
5.350s test_correlate_stream_template_and_correlation_detector (obspy.signal.tests.test_cross_correlation.CrossCorrelationTestCase)
5.057s plot_travel_times (obspy.taup.tau)
4.881s test_vs_java_iasp91 (obspy.taup.tests.test_tau.TauPyModelTestCase)
4.877s test_polarization_vidale (obspy.signal.tests.test_polarization.PolarizationTestCase)
4.835s test_auto_read_arclink_xml (obspy.io.arclink.tests.test_inventory_xml.ArclinkInventoryTestCase)
4.414s test_plot_wiggles_vertical_section (obspy.imaging.tests.test_waveform.WaveformTestCase)
4.319s test_regional_models (obspy.taup.tests.test_tau.TauPyModelTestCase)
4.193s test_plot_wiggles_horizontal_section (obspy.imaging.tests.test_waveform.WaveformTestCase)
4.121s test_plot_wiggles_negative_section (obspy.imaging.tests.test_waveform.WaveformTestCase)
4.115s test_plot_wiggles_positive_section (obspy.imaging.tests.test_waveform.WaveformTestCase)
4.077s test_plot_horizontal_section (obspy.imaging.tests.test_waveform.WaveformTestCase)
4.073s test_plot_ref_time_section (obspy.imaging.tests.test_waveform.WaveformTestCase)

Chuck Norris fact

Chuck Norris doesn't use reflection, reflection asks politely for his help.