#137365 Report by node gh-actions covering 200 tests from 61 modules resulted into 18 errors

Report

ObsPy version
1.4.0.post0+332.ga357b34364.o…
GitHub Pull Request
-
Report file
JSON document
Total runtime
148.4 sec
Report date/time
Feb. 23, 2024, 6:55 a.m.

System / Python

Architecture
64bit
Machine
x86_64
Node
gh-actions
Processor
i386
Python Compiler
Clang 16.0.6
Python Implementation
CPython
Python Version
3.12.2
Release
21.6.0
System
Darwin
Version
Darwin Kernel Version 21.6.0: Sun Dec 17 22:55:27 PST 2023; root:xnu-8020.240.18.706.2~1/RELEASE_X86_64

Dependencies

cartopy
0.22.0
decorator
5.1.1
flake8
---
geographiclib
2.0
lxml
5.1.0
matplotlib
3.8.3
numpy
1.26.4
obspy
1.4.0.post0+332.ga357b34364.obspy.master
pyproj
3.6.1
pytest
8.0.1
pytest-json-report
1.5.0
requests
2.31.0
scipy
1.12.0
setuptools
69.1.0
shapefile
---
sqlalchemy
1.4.49

Modules (61)

Module Errors / Failures Tracebacks
obspy.clients.earthworm 1 1
obspy.clients.fdsn 14 2 3 4 5 6 7 8 9 10 11 12 13 14 15
obspy.clients.filesystem Not tested -
obspy.clients.iris 1 16
obspy.clients.neic - -
obspy.clients.nrl - -
obspy.clients.seedlink 2 17 18
obspy.clients.syngine - -
obspy.core - -
obspy.core.event Not tested -
obspy.core.inventory Not tested -
obspy.core.util Not tested -
obspy.geodetics Not tested -
obspy.imaging Not tested -
obspy.io.ah Not tested -
obspy.io.alsep Not tested -
obspy.io.arclink Not tested -
obspy.io.ascii Not tested -
obspy.io.cmtsolution Not tested -
obspy.io.cnv Not tested -
obspy.io.css Not tested -
obspy.io.csv Not tested -
obspy.io.cybershake Not tested -
obspy.io.dmx Not tested -
obspy.io.focmec Not tested -
obspy.io.gcf Not tested -
obspy.io.gse2 Not tested -
obspy.io.hypodd Not tested -
obspy.io.iaspei Not tested -
obspy.io.json Not tested -
obspy.io.kinemetrics Not tested -
obspy.io.kml Not tested -
obspy.io.mseed Not tested -
obspy.io.ndk Not tested -
obspy.io.nied Not tested -
obspy.io.nlloc Not tested -
obspy.io.nordic Not tested -
obspy.io.pdas Not tested -
obspy.io.pde Not tested -
obspy.io.quakeml Not tested -
obspy.io.reftek Not tested -
obspy.io.rg16 Not tested -
obspy.io.sac Not tested -
obspy.io.scardec Not tested -
obspy.io.seg2 Not tested -
obspy.io.segy Not tested -
obspy.io.seisan Not tested -
obspy.io.seiscomp Not tested -
obspy.io.sh Not tested -
obspy.io.shapefile Not tested -
obspy.io.stationtxt Not tested -
obspy.io.stationxml Not tested -
obspy.io.wav Not tested -
obspy.io.win Not tested -
obspy.io.xseed Not tested -
obspy.io.y Not tested -
obspy.io.zmap Not tested -
obspy.realtime Not tested -
obspy.scripts Not tested -
obspy.signal Not tested -
obspy.taup Not tested -
Summary 18 18

Tracebacks (18)

Traceback (most recent call last):
File "/Users/runner/miniconda3/envs/test/lib/python3.12/site-packages/_pytest/runner.py", line 346, in from_call
result: Optional[TResult] = func()
^^^^^^
File "/Users/runner/miniconda3/envs/test/lib/python3.12/site-packages/_pytest/runner.py", line 267, in <lambda>
lambda: ihook(item=item, **kwds), when=when, reraise=reraise
^^^^^^^^^^^^^^^^^^^^^^^^
File "/Users/runner/miniconda3/envs/test/lib/python3.12/site-packages/pluggy/_hooks.py", line 501, in __call__
return self._hookexec(self.name, self._hookimpls.copy(), kwargs, firstresult)
^^^^^^^^^^^^^^^^^^^^^^^^^^^^^^^^^^^^^^^^^^^^^^^^^^^^^^^^^^^^^^^^^^^^^^
File "/Users/runner/miniconda3/envs/test/lib/python3.12/site-packages/pluggy/_manager.py", line 119, in _hookexec
return self._inner_hookexec(hook_name, methods, kwargs, firstresult)
^^^^^^^^^^^^^^^^^^^^^^^^^^^^^^^^^^^^^^^^^^^^^^^^^^^^^^^^^^^^^
File "/Users/runner/miniconda3/envs/test/lib/python3.12/site-packages/pluggy/_callers.py", line 181, in _multicall
return outcome.get_result()
^^^^^^^^^^^^^^^^^^^^
File "/Users/runner/miniconda3/envs/test/lib/python3.12/site-packages/pluggy/_result.py", line 99, in get_result
raise exc.with_traceback(exc.__traceback__)
File "/Users/runner/miniconda3/envs/test/lib/python3.12/site-packages/pluggy/_callers.py", line 166, in _multicall
teardown.throw(outcome._exception)
File "/Users/runner/miniconda3/envs/test/lib/python3.12/site-packages/_pytest/threadexception.py", line 87, in pytest_runtest_call
yield from thread_exception_runtest_hook()
File "/Users/runner/miniconda3/envs/test/lib/python3.12/site-packages/_pytest/threadexception.py", line 63, in thread_exception_runtest_hook
yield
File "/Users/runner/miniconda3/envs/test/lib/python3.12/site-packages/pluggy/_callers.py", line 166, in _multicall
teardown.throw(outcome._exception)
File "/Users/runner/miniconda3/envs/test/lib/python3.12/site-packages/_pytest/unraisableexception.py", line 90, in pytest_runtest_call
yield from unraisable_exception_runtest_hook()
File "/Users/runner/miniconda3/envs/test/lib/python3.12/site-packages/_pytest/unraisableexception.py", line 65, in unraisable_exception_runtest_hook
yield
File "/Users/runner/miniconda3/envs/test/lib/python3.12/site-packages/pluggy/_callers.py", line 166, in _multicall
teardown.throw(outcome._exception)
File "/Users/runner/miniconda3/envs/test/lib/python3.12/site-packages/_pytest/logging.py", line 839, in pytest_runtest_call
yield from self._runtest_for(item, "call")
File "/Users/runner/miniconda3/envs/test/lib/python3.12/site-packages/_pytest/logging.py", line 822, in _runtest_for
yield
File "/Users/runner/miniconda3/envs/test/lib/python3.12/site-packages/pluggy/_callers.py", line 166, in _multicall
teardown.throw(outcome._exception)
File "/Users/runner/miniconda3/envs/test/lib/python3.12/site-packages/_pytest/capture.py", line 882, in pytest_runtest_call
return (yield)
^^^^^
File "/Users/runner/miniconda3/envs/test/lib/python3.12/site-packages/pluggy/_callers.py", line 166, in _multicall
teardown.throw(outcome._exception)
File "/Users/runner/miniconda3/envs/test/lib/python3.12/site-packages/_pytest/skipping.py", line 256, in pytest_runtest_call
return (yield)
^^^^^
File "/Users/runner/miniconda3/envs/test/lib/python3.12/site-packages/pluggy/_callers.py", line 102, in _multicall
res = hook_impl.function(*args)
^^^^^^^^^^^^^^^^^^^^^^^^^
File "/Users/runner/miniconda3/envs/test/lib/python3.12/site-packages/_pytest/runner.py", line 182, in pytest_runtest_call
raise e
File "/Users/runner/miniconda3/envs/test/lib/python3.12/site-packages/_pytest/runner.py", line 174, in pytest_runtest_call
item.runtest()
File "/Users/runner/miniconda3/envs/test/lib/python3.12/site-packages/_pytest/python.py", line 1831, in runtest
self.ihook.pytest_pyfunc_call(pyfuncitem=self)
File "/Users/runner/miniconda3/envs/test/lib/python3.12/site-packages/pluggy/_hooks.py", line 501, in __call__
return self._hookexec(self.name, self._hookimpls.copy(), kwargs, firstresult)
^^^^^^^^^^^^^^^^^^^^^^^^^^^^^^^^^^^^^^^^^^^^^^^^^^^^^^^^^^^^^^^^^^^^^^
File "/Users/runner/miniconda3/envs/test/lib/python3.12/site-packages/pluggy/_manager.py", line 119, in _hookexec
return self._inner_hookexec(hook_name, methods, kwargs, firstresult)
^^^^^^^^^^^^^^^^^^^^^^^^^^^^^^^^^^^^^^^^^^^^^^^^^^^^^^^^^^^^^
File "/Users/runner/miniconda3/envs/test/lib/python3.12/site-packages/pluggy/_callers.py", line 138, in _multicall
raise exception.with_traceback(exception.__traceback__)
File "/Users/runner/miniconda3/envs/test/lib/python3.12/site-packages/pluggy/_callers.py", line 102, in _multicall
res = hook_impl.function(*args)
^^^^^^^^^^^^^^^^^^^^^^^^^
File "/Users/runner/miniconda3/envs/test/lib/python3.12/site-packages/_pytest/python.py", line 194, in pytest_pyfunc_call
result = testfunction(**testargs)
^^^^^^^^^^^^^^^^^^^^^^^^
File "/Users/runner/miniconda3/envs/test/lib/python3.12/site-packages/decorator.py", line 232, in fun
return caller(func, *(extras + args), **kw)
^^^^^^^^^^^^^^^^^^^^^^^^^^^^^^^^^^^^
File "/Users/runner/miniconda3/envs/test/lib/python3.12/site-packages/obspy/core/util/decorator.py", line 119, in skip_on_network_error
return func(*args, **kwargs)
^^^^^^^^^^^^^^^^^^^^^
File "/Users/runner/miniconda3/envs/test/lib/python3.12/site-packages/obspy/clients/earthworm/tests/test_client.py", line 111, in test_get_waveform_no_cleanup
assert len(ew_stream) >= 2
AssertionError: assert 1 >= 2
+ where 1 = len(<obspy.core.stream.Stream object at 0x1107041a0>)
Traceback (most recent call last):
File "/Users/runner/miniconda3/envs/test/lib/python3.12/site-packages/_pytest/runner.py", line 346, in from_call
result: Optional[TResult] = func()
^^^^^^
File "/Users/runner/miniconda3/envs/test/lib/python3.12/site-packages/_pytest/runner.py", line 267, in <lambda>
lambda: ihook(item=item, **kwds), when=when, reraise=reraise
^^^^^^^^^^^^^^^^^^^^^^^^
File "/Users/runner/miniconda3/envs/test/lib/python3.12/site-packages/pluggy/_hooks.py", line 501, in __call__
return self._hookexec(self.name, self._hookimpls.copy(), kwargs, firstresult)
^^^^^^^^^^^^^^^^^^^^^^^^^^^^^^^^^^^^^^^^^^^^^^^^^^^^^^^^^^^^^^^^^^^^^^
File "/Users/runner/miniconda3/envs/test/lib/python3.12/site-packages/pluggy/_manager.py", line 119, in _hookexec
return self._inner_hookexec(hook_name, methods, kwargs, firstresult)
^^^^^^^^^^^^^^^^^^^^^^^^^^^^^^^^^^^^^^^^^^^^^^^^^^^^^^^^^^^^^
File "/Users/runner/miniconda3/envs/test/lib/python3.12/site-packages/pluggy/_callers.py", line 181, in _multicall
return outcome.get_result()
^^^^^^^^^^^^^^^^^^^^
File "/Users/runner/miniconda3/envs/test/lib/python3.12/site-packages/pluggy/_result.py", line 99, in get_result
raise exc.with_traceback(exc.__traceback__)
File "/Users/runner/miniconda3/envs/test/lib/python3.12/site-packages/pluggy/_callers.py", line 166, in _multicall
teardown.throw(outcome._exception)
File "/Users/runner/miniconda3/envs/test/lib/python3.12/site-packages/_pytest/threadexception.py", line 87, in pytest_runtest_call
yield from thread_exception_runtest_hook()
File "/Users/runner/miniconda3/envs/test/lib/python3.12/site-packages/_pytest/threadexception.py", line 63, in thread_exception_runtest_hook
yield
File "/Users/runner/miniconda3/envs/test/lib/python3.12/site-packages/pluggy/_callers.py", line 166, in _multicall
teardown.throw(outcome._exception)
File "/Users/runner/miniconda3/envs/test/lib/python3.12/site-packages/_pytest/unraisableexception.py", line 90, in pytest_runtest_call
yield from unraisable_exception_runtest_hook()
File "/Users/runner/miniconda3/envs/test/lib/python3.12/site-packages/_pytest/unraisableexception.py", line 65, in unraisable_exception_runtest_hook
yield
File "/Users/runner/miniconda3/envs/test/lib/python3.12/site-packages/pluggy/_callers.py", line 166, in _multicall
teardown.throw(outcome._exception)
File "/Users/runner/miniconda3/envs/test/lib/python3.12/site-packages/_pytest/logging.py", line 839, in pytest_runtest_call
yield from self._runtest_for(item, "call")
File "/Users/runner/miniconda3/envs/test/lib/python3.12/site-packages/_pytest/logging.py", line 822, in _runtest_for
yield
File "/Users/runner/miniconda3/envs/test/lib/python3.12/site-packages/pluggy/_callers.py", line 166, in _multicall
teardown.throw(outcome._exception)
File "/Users/runner/miniconda3/envs/test/lib/python3.12/site-packages/_pytest/capture.py", line 882, in pytest_runtest_call
return (yield)
^^^^^
File "/Users/runner/miniconda3/envs/test/lib/python3.12/site-packages/pluggy/_callers.py", line 166, in _multicall
teardown.throw(outcome._exception)
File "/Users/runner/miniconda3/envs/test/lib/python3.12/site-packages/_pytest/skipping.py", line 256, in pytest_runtest_call
return (yield)
^^^^^
File "/Users/runner/miniconda3/envs/test/lib/python3.12/site-packages/pluggy/_callers.py", line 102, in _multicall
res = hook_impl.function(*args)
^^^^^^^^^^^^^^^^^^^^^^^^^
File "/Users/runner/miniconda3/envs/test/lib/python3.12/site-packages/_pytest/runner.py", line 182, in pytest_runtest_call
raise e
File "/Users/runner/miniconda3/envs/test/lib/python3.12/site-packages/_pytest/runner.py", line 174, in pytest_runtest_call
item.runtest()
File "/Users/runner/miniconda3/envs/test/lib/python3.12/site-packages/_pytest/python.py", line 1831, in runtest
self.ihook.pytest_pyfunc_call(pyfuncitem=self)
File "/Users/runner/miniconda3/envs/test/lib/python3.12/site-packages/pluggy/_hooks.py", line 501, in __call__
return self._hookexec(self.name, self._hookimpls.copy(), kwargs, firstresult)
^^^^^^^^^^^^^^^^^^^^^^^^^^^^^^^^^^^^^^^^^^^^^^^^^^^^^^^^^^^^^^^^^^^^^^
File "/Users/runner/miniconda3/envs/test/lib/python3.12/site-packages/pluggy/_manager.py", line 119, in _hookexec
return self._inner_hookexec(hook_name, methods, kwargs, firstresult)
^^^^^^^^^^^^^^^^^^^^^^^^^^^^^^^^^^^^^^^^^^^^^^^^^^^^^^^^^^^^^
File "/Users/runner/miniconda3/envs/test/lib/python3.12/site-packages/pluggy/_callers.py", line 138, in _multicall
raise exception.with_traceback(exception.__traceback__)
File "/Users/runner/miniconda3/envs/test/lib/python3.12/site-packages/pluggy/_callers.py", line 102, in _multicall
res = hook_impl.function(*args)
^^^^^^^^^^^^^^^^^^^^^^^^^
File "/Users/runner/miniconda3/envs/test/lib/python3.12/site-packages/_pytest/python.py", line 194, in pytest_pyfunc_call
result = testfunction(**testargs)
^^^^^^^^^^^^^^^^^^^^^^^^
File "/Users/runner/miniconda3/envs/test/lib/python3.12/site-packages/obspy/clients/fdsn/tests/test_client.py", line 382, in test_iris_event_catalog_availability
assert {*self.client.services["available_event_catalogs"]} == \
AssertionError: assert {'GCMT\n ', '...'NEIC PDE\n '} == {'GCMT', 'ISC', 'NEIC PDE'}
Extra items in the left set:
'GCMT\n '
'NEIC PDE\n '
'ISC\n '
Extra items in the right set:
'GCMT'
'ISC'
'NEIC PDE'
Full diff:
{
- 'GCMT',
? -
+ 'GCMT\n'
? ++
+ ' ',
- 'ISC',
? -
+ 'ISC\n'
? ++
+ ' ',
- 'NEIC PDE',
? -
+ 'NEIC PDE\n'
? ++
+ ' ',
}
Traceback (most recent call last):
File "/Users/runner/miniconda3/envs/test/lib/python3.12/site-packages/_pytest/runner.py", line 346, in from_call
result: Optional[TResult] = func()
^^^^^^
File "/Users/runner/miniconda3/envs/test/lib/python3.12/site-packages/_pytest/runner.py", line 267, in <lambda>
lambda: ihook(item=item, **kwds), when=when, reraise=reraise
^^^^^^^^^^^^^^^^^^^^^^^^
File "/Users/runner/miniconda3/envs/test/lib/python3.12/site-packages/pluggy/_hooks.py", line 501, in __call__
return self._hookexec(self.name, self._hookimpls.copy(), kwargs, firstresult)
^^^^^^^^^^^^^^^^^^^^^^^^^^^^^^^^^^^^^^^^^^^^^^^^^^^^^^^^^^^^^^^^^^^^^^
File "/Users/runner/miniconda3/envs/test/lib/python3.12/site-packages/pluggy/_manager.py", line 119, in _hookexec
return self._inner_hookexec(hook_name, methods, kwargs, firstresult)
^^^^^^^^^^^^^^^^^^^^^^^^^^^^^^^^^^^^^^^^^^^^^^^^^^^^^^^^^^^^^
File "/Users/runner/miniconda3/envs/test/lib/python3.12/site-packages/pluggy/_callers.py", line 181, in _multicall
return outcome.get_result()
^^^^^^^^^^^^^^^^^^^^
File "/Users/runner/miniconda3/envs/test/lib/python3.12/site-packages/pluggy/_result.py", line 99, in get_result
raise exc.with_traceback(exc.__traceback__)
File "/Users/runner/miniconda3/envs/test/lib/python3.12/site-packages/pluggy/_callers.py", line 166, in _multicall
teardown.throw(outcome._exception)
File "/Users/runner/miniconda3/envs/test/lib/python3.12/site-packages/_pytest/threadexception.py", line 87, in pytest_runtest_call
yield from thread_exception_runtest_hook()
File "/Users/runner/miniconda3/envs/test/lib/python3.12/site-packages/_pytest/threadexception.py", line 63, in thread_exception_runtest_hook
yield
File "/Users/runner/miniconda3/envs/test/lib/python3.12/site-packages/pluggy/_callers.py", line 166, in _multicall
teardown.throw(outcome._exception)
File "/Users/runner/miniconda3/envs/test/lib/python3.12/site-packages/_pytest/unraisableexception.py", line 90, in pytest_runtest_call
yield from unraisable_exception_runtest_hook()
File "/Users/runner/miniconda3/envs/test/lib/python3.12/site-packages/_pytest/unraisableexception.py", line 65, in unraisable_exception_runtest_hook
yield
File "/Users/runner/miniconda3/envs/test/lib/python3.12/site-packages/pluggy/_callers.py", line 166, in _multicall
teardown.throw(outcome._exception)
File "/Users/runner/miniconda3/envs/test/lib/python3.12/site-packages/_pytest/logging.py", line 839, in pytest_runtest_call
yield from self._runtest_for(item, "call")
File "/Users/runner/miniconda3/envs/test/lib/python3.12/site-packages/_pytest/logging.py", line 822, in _runtest_for
yield
File "/Users/runner/miniconda3/envs/test/lib/python3.12/site-packages/pluggy/_callers.py", line 166, in _multicall
teardown.throw(outcome._exception)
File "/Users/runner/miniconda3/envs/test/lib/python3.12/site-packages/_pytest/capture.py", line 882, in pytest_runtest_call
return (yield)
^^^^^
File "/Users/runner/miniconda3/envs/test/lib/python3.12/site-packages/pluggy/_callers.py", line 166, in _multicall
teardown.throw(outcome._exception)
File "/Users/runner/miniconda3/envs/test/lib/python3.12/site-packages/_pytest/skipping.py", line 256, in pytest_runtest_call
return (yield)
^^^^^
File "/Users/runner/miniconda3/envs/test/lib/python3.12/site-packages/pluggy/_callers.py", line 102, in _multicall
res = hook_impl.function(*args)
^^^^^^^^^^^^^^^^^^^^^^^^^
File "/Users/runner/miniconda3/envs/test/lib/python3.12/site-packages/_pytest/runner.py", line 182, in pytest_runtest_call
raise e
File "/Users/runner/miniconda3/envs/test/lib/python3.12/site-packages/_pytest/runner.py", line 174, in pytest_runtest_call
item.runtest()
File "/Users/runner/miniconda3/envs/test/lib/python3.12/site-packages/_pytest/python.py", line 1831, in runtest
self.ihook.pytest_pyfunc_call(pyfuncitem=self)
File "/Users/runner/miniconda3/envs/test/lib/python3.12/site-packages/pluggy/_hooks.py", line 501, in __call__
return self._hookexec(self.name, self._hookimpls.copy(), kwargs, firstresult)
^^^^^^^^^^^^^^^^^^^^^^^^^^^^^^^^^^^^^^^^^^^^^^^^^^^^^^^^^^^^^^^^^^^^^^
File "/Users/runner/miniconda3/envs/test/lib/python3.12/site-packages/pluggy/_manager.py", line 119, in _hookexec
return self._inner_hookexec(hook_name, methods, kwargs, firstresult)
^^^^^^^^^^^^^^^^^^^^^^^^^^^^^^^^^^^^^^^^^^^^^^^^^^^^^^^^^^^^^
File "/Users/runner/miniconda3/envs/test/lib/python3.12/site-packages/pluggy/_callers.py", line 138, in _multicall
raise exception.with_traceback(exception.__traceback__)
File "/Users/runner/miniconda3/envs/test/lib/python3.12/site-packages/pluggy/_callers.py", line 102, in _multicall
res = hook_impl.function(*args)
^^^^^^^^^^^^^^^^^^^^^^^^^
File "/Users/runner/miniconda3/envs/test/lib/python3.12/site-packages/_pytest/python.py", line 194, in pytest_pyfunc_call
result = testfunction(**testargs)
^^^^^^^^^^^^^^^^^^^^^^^^
File "/Users/runner/miniconda3/envs/test/lib/python3.12/site-packages/obspy/clients/fdsn/tests/test_client.py", line 814, in test_help_function_with_iris
assert got[-2].startswith('Available catalogs:')
AssertionError: assert False
+ where False = <built-in method startswith of str object at 0x148c3d680>('Available catalogs:')
+ where <built-in method startswith of str object at 0x148c3d680> = 'RYD'.startswith
Traceback (most recent call last):
File "/Users/runner/miniconda3/envs/test/lib/python3.12/site-packages/_pytest/runner.py", line 346, in from_call
result: Optional[TResult] = func()
^^^^^^
File "/Users/runner/miniconda3/envs/test/lib/python3.12/site-packages/_pytest/runner.py", line 267, in <lambda>
lambda: ihook(item=item, **kwds), when=when, reraise=reraise
^^^^^^^^^^^^^^^^^^^^^^^^
File "/Users/runner/miniconda3/envs/test/lib/python3.12/site-packages/pluggy/_hooks.py", line 501, in __call__
return self._hookexec(self.name, self._hookimpls.copy(), kwargs, firstresult)
^^^^^^^^^^^^^^^^^^^^^^^^^^^^^^^^^^^^^^^^^^^^^^^^^^^^^^^^^^^^^^^^^^^^^^
File "/Users/runner/miniconda3/envs/test/lib/python3.12/site-packages/pluggy/_manager.py", line 119, in _hookexec
return self._inner_hookexec(hook_name, methods, kwargs, firstresult)
^^^^^^^^^^^^^^^^^^^^^^^^^^^^^^^^^^^^^^^^^^^^^^^^^^^^^^^^^^^^^
File "/Users/runner/miniconda3/envs/test/lib/python3.12/site-packages/pluggy/_callers.py", line 181, in _multicall
return outcome.get_result()
^^^^^^^^^^^^^^^^^^^^
File "/Users/runner/miniconda3/envs/test/lib/python3.12/site-packages/pluggy/_result.py", line 99, in get_result
raise exc.with_traceback(exc.__traceback__)
File "/Users/runner/miniconda3/envs/test/lib/python3.12/site-packages/pluggy/_callers.py", line 166, in _multicall
teardown.throw(outcome._exception)
File "/Users/runner/miniconda3/envs/test/lib/python3.12/site-packages/_pytest/threadexception.py", line 87, in pytest_runtest_call
yield from thread_exception_runtest_hook()
File "/Users/runner/miniconda3/envs/test/lib/python3.12/site-packages/_pytest/threadexception.py", line 63, in thread_exception_runtest_hook
yield
File "/Users/runner/miniconda3/envs/test/lib/python3.12/site-packages/pluggy/_callers.py", line 166, in _multicall
teardown.throw(outcome._exception)
File "/Users/runner/miniconda3/envs/test/lib/python3.12/site-packages/_pytest/unraisableexception.py", line 90, in pytest_runtest_call
yield from unraisable_exception_runtest_hook()
File "/Users/runner/miniconda3/envs/test/lib/python3.12/site-packages/_pytest/unraisableexception.py", line 65, in unraisable_exception_runtest_hook
yield
File "/Users/runner/miniconda3/envs/test/lib/python3.12/site-packages/pluggy/_callers.py", line 166, in _multicall
teardown.throw(outcome._exception)
File "/Users/runner/miniconda3/envs/test/lib/python3.12/site-packages/_pytest/logging.py", line 839, in pytest_runtest_call
yield from self._runtest_for(item, "call")
File "/Users/runner/miniconda3/envs/test/lib/python3.12/site-packages/_pytest/logging.py", line 822, in _runtest_for
yield
File "/Users/runner/miniconda3/envs/test/lib/python3.12/site-packages/pluggy/_callers.py", line 166, in _multicall
teardown.throw(outcome._exception)
File "/Users/runner/miniconda3/envs/test/lib/python3.12/site-packages/_pytest/capture.py", line 882, in pytest_runtest_call
return (yield)
^^^^^
File "/Users/runner/miniconda3/envs/test/lib/python3.12/site-packages/pluggy/_callers.py", line 166, in _multicall
teardown.throw(outcome._exception)
File "/Users/runner/miniconda3/envs/test/lib/python3.12/site-packages/_pytest/skipping.py", line 256, in pytest_runtest_call
return (yield)
^^^^^
File "/Users/runner/miniconda3/envs/test/lib/python3.12/site-packages/pluggy/_callers.py", line 102, in _multicall
res = hook_impl.function(*args)
^^^^^^^^^^^^^^^^^^^^^^^^^
File "/Users/runner/miniconda3/envs/test/lib/python3.12/site-packages/_pytest/runner.py", line 182, in pytest_runtest_call
raise e
File "/Users/runner/miniconda3/envs/test/lib/python3.12/site-packages/_pytest/runner.py", line 174, in pytest_runtest_call
item.runtest()
File "/Users/runner/miniconda3/envs/test/lib/python3.12/site-packages/_pytest/python.py", line 1831, in runtest
self.ihook.pytest_pyfunc_call(pyfuncitem=self)
File "/Users/runner/miniconda3/envs/test/lib/python3.12/site-packages/pluggy/_hooks.py", line 501, in __call__
return self._hookexec(self.name, self._hookimpls.copy(), kwargs, firstresult)
^^^^^^^^^^^^^^^^^^^^^^^^^^^^^^^^^^^^^^^^^^^^^^^^^^^^^^^^^^^^^^^^^^^^^^
File "/Users/runner/miniconda3/envs/test/lib/python3.12/site-packages/pluggy/_manager.py", line 119, in _hookexec
return self._inner_hookexec(hook_name, methods, kwargs, firstresult)
^^^^^^^^^^^^^^^^^^^^^^^^^^^^^^^^^^^^^^^^^^^^^^^^^^^^^^^^^^^^^
File "/Users/runner/miniconda3/envs/test/lib/python3.12/site-packages/pluggy/_callers.py", line 138, in _multicall
raise exception.with_traceback(exception.__traceback__)
File "/Users/runner/miniconda3/envs/test/lib/python3.12/site-packages/pluggy/_callers.py", line 102, in _multicall
res = hook_impl.function(*args)
^^^^^^^^^^^^^^^^^^^^^^^^^
File "/Users/runner/miniconda3/envs/test/lib/python3.12/site-packages/_pytest/python.py", line 194, in pytest_pyfunc_call
result = testfunction(**testargs)
^^^^^^^^^^^^^^^^^^^^^^^^
File "/Users/runner/miniconda3/envs/test/lib/python3.12/unittest/mock.py", line 1387, in patched
return func(*newargs, **newkeywargs)
^^^^^^^^^^^^^^^^^^^^^^^^^^^^^
File "/Users/runner/miniconda3/envs/test/lib/python3.12/site-packages/obspy/clients/fdsn/tests/test_client.py", line 1428, in test_no_data_exception
self.client.get_stations()
File "/Users/runner/miniconda3/envs/test/lib/python3.12/site-packages/obspy/clients/fdsn/client.py", line 748, in get_stations
data_stream = self._download(url)
^^^^^^^^^^^^^^^^^^^
File "/Users/runner/miniconda3/envs/test/lib/python3.12/site-packages/obspy/clients/fdsn/client.py", line 1486, in _download
raise_on_error(code, data)
File "/Users/runner/miniconda3/envs/test/lib/python3.12/site-packages/obspy/clients/fdsn/client.py", line 1802, in raise_on_error
server_info = data.decode('ASCII', errors='ignore')
^^^^^^^^^^^
AttributeError: 'NoneType' object has no attribute 'decode'
Traceback (most recent call last):
File "/Users/runner/miniconda3/envs/test/lib/python3.12/site-packages/_pytest/runner.py", line 346, in from_call
result: Optional[TResult] = func()
^^^^^^
File "/Users/runner/miniconda3/envs/test/lib/python3.12/site-packages/_pytest/runner.py", line 267, in <lambda>
lambda: ihook(item=item, **kwds), when=when, reraise=reraise
^^^^^^^^^^^^^^^^^^^^^^^^
File "/Users/runner/miniconda3/envs/test/lib/python3.12/site-packages/pluggy/_hooks.py", line 501, in __call__
return self._hookexec(self.name, self._hookimpls.copy(), kwargs, firstresult)
^^^^^^^^^^^^^^^^^^^^^^^^^^^^^^^^^^^^^^^^^^^^^^^^^^^^^^^^^^^^^^^^^^^^^^
File "/Users/runner/miniconda3/envs/test/lib/python3.12/site-packages/pluggy/_manager.py", line 119, in _hookexec
return self._inner_hookexec(hook_name, methods, kwargs, firstresult)
^^^^^^^^^^^^^^^^^^^^^^^^^^^^^^^^^^^^^^^^^^^^^^^^^^^^^^^^^^^^^
File "/Users/runner/miniconda3/envs/test/lib/python3.12/site-packages/pluggy/_callers.py", line 181, in _multicall
return outcome.get_result()
^^^^^^^^^^^^^^^^^^^^
File "/Users/runner/miniconda3/envs/test/lib/python3.12/site-packages/pluggy/_result.py", line 99, in get_result
raise exc.with_traceback(exc.__traceback__)
File "/Users/runner/miniconda3/envs/test/lib/python3.12/site-packages/pluggy/_callers.py", line 166, in _multicall
teardown.throw(outcome._exception)
File "/Users/runner/miniconda3/envs/test/lib/python3.12/site-packages/_pytest/threadexception.py", line 87, in pytest_runtest_call
yield from thread_exception_runtest_hook()
File "/Users/runner/miniconda3/envs/test/lib/python3.12/site-packages/_pytest/threadexception.py", line 63, in thread_exception_runtest_hook
yield
File "/Users/runner/miniconda3/envs/test/lib/python3.12/site-packages/pluggy/_callers.py", line 166, in _multicall
teardown.throw(outcome._exception)
File "/Users/runner/miniconda3/envs/test/lib/python3.12/site-packages/_pytest/unraisableexception.py", line 90, in pytest_runtest_call
yield from unraisable_exception_runtest_hook()
File "/Users/runner/miniconda3/envs/test/lib/python3.12/site-packages/_pytest/unraisableexception.py", line 65, in unraisable_exception_runtest_hook
yield
File "/Users/runner/miniconda3/envs/test/lib/python3.12/site-packages/pluggy/_callers.py", line 166, in _multicall
teardown.throw(outcome._exception)
File "/Users/runner/miniconda3/envs/test/lib/python3.12/site-packages/_pytest/logging.py", line 839, in pytest_runtest_call
yield from self._runtest_for(item, "call")
File "/Users/runner/miniconda3/envs/test/lib/python3.12/site-packages/_pytest/logging.py", line 822, in _runtest_for
yield
File "/Users/runner/miniconda3/envs/test/lib/python3.12/site-packages/pluggy/_callers.py", line 166, in _multicall
teardown.throw(outcome._exception)
File "/Users/runner/miniconda3/envs/test/lib/python3.12/site-packages/_pytest/capture.py", line 882, in pytest_runtest_call
return (yield)
^^^^^
File "/Users/runner/miniconda3/envs/test/lib/python3.12/site-packages/pluggy/_callers.py", line 166, in _multicall
teardown.throw(outcome._exception)
File "/Users/runner/miniconda3/envs/test/lib/python3.12/site-packages/_pytest/skipping.py", line 256, in pytest_runtest_call
return (yield)
^^^^^
File "/Users/runner/miniconda3/envs/test/lib/python3.12/site-packages/pluggy/_callers.py", line 102, in _multicall
res = hook_impl.function(*args)
^^^^^^^^^^^^^^^^^^^^^^^^^
File "/Users/runner/miniconda3/envs/test/lib/python3.12/site-packages/_pytest/runner.py", line 182, in pytest_runtest_call
raise e
File "/Users/runner/miniconda3/envs/test/lib/python3.12/site-packages/_pytest/runner.py", line 174, in pytest_runtest_call
item.runtest()
File "/Users/runner/miniconda3/envs/test/lib/python3.12/site-packages/_pytest/python.py", line 1831, in runtest
self.ihook.pytest_pyfunc_call(pyfuncitem=self)
File "/Users/runner/miniconda3/envs/test/lib/python3.12/site-packages/pluggy/_hooks.py", line 501, in __call__
return self._hookexec(self.name, self._hookimpls.copy(), kwargs, firstresult)
^^^^^^^^^^^^^^^^^^^^^^^^^^^^^^^^^^^^^^^^^^^^^^^^^^^^^^^^^^^^^^^^^^^^^^
File "/Users/runner/miniconda3/envs/test/lib/python3.12/site-packages/pluggy/_manager.py", line 119, in _hookexec
return self._inner_hookexec(hook_name, methods, kwargs, firstresult)
^^^^^^^^^^^^^^^^^^^^^^^^^^^^^^^^^^^^^^^^^^^^^^^^^^^^^^^^^^^^^
File "/Users/runner/miniconda3/envs/test/lib/python3.12/site-packages/pluggy/_callers.py", line 138, in _multicall
raise exception.with_traceback(exception.__traceback__)
File "/Users/runner/miniconda3/envs/test/lib/python3.12/site-packages/pluggy/_callers.py", line 102, in _multicall
res = hook_impl.function(*args)
^^^^^^^^^^^^^^^^^^^^^^^^^
File "/Users/runner/miniconda3/envs/test/lib/python3.12/site-packages/_pytest/python.py", line 194, in pytest_pyfunc_call
result = testfunction(**testargs)
^^^^^^^^^^^^^^^^^^^^^^^^
File "/Users/runner/miniconda3/envs/test/lib/python3.12/unittest/mock.py", line 1387, in patched
return func(*newargs, **newkeywargs)
^^^^^^^^^^^^^^^^^^^^^^^^^^^^^
File "/Users/runner/miniconda3/envs/test/lib/python3.12/site-packages/obspy/clients/fdsn/tests/test_client.py", line 1438, in test_request_too_large_exception
self.client.get_stations()
File "/Users/runner/miniconda3/envs/test/lib/python3.12/site-packages/obspy/clients/fdsn/client.py", line 748, in get_stations
data_stream = self._download(url)
^^^^^^^^^^^^^^^^^^^
File "/Users/runner/miniconda3/envs/test/lib/python3.12/site-packages/obspy/clients/fdsn/client.py", line 1486, in _download
raise_on_error(code, data)
File "/Users/runner/miniconda3/envs/test/lib/python3.12/site-packages/obspy/clients/fdsn/client.py", line 1802, in raise_on_error
server_info = data.decode('ASCII', errors='ignore')
^^^^^^^^^^^
AttributeError: 'NoneType' object has no attribute 'decode'
Traceback (most recent call last):
File "/Users/runner/miniconda3/envs/test/lib/python3.12/site-packages/_pytest/runner.py", line 346, in from_call
result: Optional[TResult] = func()
^^^^^^
File "/Users/runner/miniconda3/envs/test/lib/python3.12/site-packages/_pytest/runner.py", line 267, in <lambda>
lambda: ihook(item=item, **kwds), when=when, reraise=reraise
^^^^^^^^^^^^^^^^^^^^^^^^
File "/Users/runner/miniconda3/envs/test/lib/python3.12/site-packages/pluggy/_hooks.py", line 501, in __call__
return self._hookexec(self.name, self._hookimpls.copy(), kwargs, firstresult)
^^^^^^^^^^^^^^^^^^^^^^^^^^^^^^^^^^^^^^^^^^^^^^^^^^^^^^^^^^^^^^^^^^^^^^
File "/Users/runner/miniconda3/envs/test/lib/python3.12/site-packages/pluggy/_manager.py", line 119, in _hookexec
return self._inner_hookexec(hook_name, methods, kwargs, firstresult)
^^^^^^^^^^^^^^^^^^^^^^^^^^^^^^^^^^^^^^^^^^^^^^^^^^^^^^^^^^^^^
File "/Users/runner/miniconda3/envs/test/lib/python3.12/site-packages/pluggy/_callers.py", line 181, in _multicall
return outcome.get_result()
^^^^^^^^^^^^^^^^^^^^
File "/Users/runner/miniconda3/envs/test/lib/python3.12/site-packages/pluggy/_result.py", line 99, in get_result
raise exc.with_traceback(exc.__traceback__)
File "/Users/runner/miniconda3/envs/test/lib/python3.12/site-packages/pluggy/_callers.py", line 166, in _multicall
teardown.throw(outcome._exception)
File "/Users/runner/miniconda3/envs/test/lib/python3.12/site-packages/_pytest/threadexception.py", line 87, in pytest_runtest_call
yield from thread_exception_runtest_hook()
File "/Users/runner/miniconda3/envs/test/lib/python3.12/site-packages/_pytest/threadexception.py", line 63, in thread_exception_runtest_hook
yield
File "/Users/runner/miniconda3/envs/test/lib/python3.12/site-packages/pluggy/_callers.py", line 166, in _multicall
teardown.throw(outcome._exception)
File "/Users/runner/miniconda3/envs/test/lib/python3.12/site-packages/_pytest/unraisableexception.py", line 90, in pytest_runtest_call
yield from unraisable_exception_runtest_hook()
File "/Users/runner/miniconda3/envs/test/lib/python3.12/site-packages/_pytest/unraisableexception.py", line 65, in unraisable_exception_runtest_hook
yield
File "/Users/runner/miniconda3/envs/test/lib/python3.12/site-packages/pluggy/_callers.py", line 166, in _multicall
teardown.throw(outcome._exception)
File "/Users/runner/miniconda3/envs/test/lib/python3.12/site-packages/_pytest/logging.py", line 839, in pytest_runtest_call
yield from self._runtest_for(item, "call")
File "/Users/runner/miniconda3/envs/test/lib/python3.12/site-packages/_pytest/logging.py", line 822, in _runtest_for
yield
File "/Users/runner/miniconda3/envs/test/lib/python3.12/site-packages/pluggy/_callers.py", line 166, in _multicall
teardown.throw(outcome._exception)
File "/Users/runner/miniconda3/envs/test/lib/python3.12/site-packages/_pytest/capture.py", line 882, in pytest_runtest_call
return (yield)
^^^^^
File "/Users/runner/miniconda3/envs/test/lib/python3.12/site-packages/pluggy/_callers.py", line 166, in _multicall
teardown.throw(outcome._exception)
File "/Users/runner/miniconda3/envs/test/lib/python3.12/site-packages/_pytest/skipping.py", line 256, in pytest_runtest_call
return (yield)
^^^^^
File "/Users/runner/miniconda3/envs/test/lib/python3.12/site-packages/pluggy/_callers.py", line 102, in _multicall
res = hook_impl.function(*args)
^^^^^^^^^^^^^^^^^^^^^^^^^
File "/Users/runner/miniconda3/envs/test/lib/python3.12/site-packages/_pytest/runner.py", line 182, in pytest_runtest_call
raise e
File "/Users/runner/miniconda3/envs/test/lib/python3.12/site-packages/_pytest/runner.py", line 174, in pytest_runtest_call
item.runtest()
File "/Users/runner/miniconda3/envs/test/lib/python3.12/site-packages/_pytest/python.py", line 1831, in runtest
self.ihook.pytest_pyfunc_call(pyfuncitem=self)
File "/Users/runner/miniconda3/envs/test/lib/python3.12/site-packages/pluggy/_hooks.py", line 501, in __call__
return self._hookexec(self.name, self._hookimpls.copy(), kwargs, firstresult)
^^^^^^^^^^^^^^^^^^^^^^^^^^^^^^^^^^^^^^^^^^^^^^^^^^^^^^^^^^^^^^^^^^^^^^
File "/Users/runner/miniconda3/envs/test/lib/python3.12/site-packages/pluggy/_manager.py", line 119, in _hookexec
return self._inner_hookexec(hook_name, methods, kwargs, firstresult)
^^^^^^^^^^^^^^^^^^^^^^^^^^^^^^^^^^^^^^^^^^^^^^^^^^^^^^^^^^^^^
File "/Users/runner/miniconda3/envs/test/lib/python3.12/site-packages/pluggy/_callers.py", line 138, in _multicall
raise exception.with_traceback(exception.__traceback__)
File "/Users/runner/miniconda3/envs/test/lib/python3.12/site-packages/pluggy/_callers.py", line 102, in _multicall
res = hook_impl.function(*args)
^^^^^^^^^^^^^^^^^^^^^^^^^
File "/Users/runner/miniconda3/envs/test/lib/python3.12/site-packages/_pytest/python.py", line 194, in pytest_pyfunc_call
result = testfunction(**testargs)
^^^^^^^^^^^^^^^^^^^^^^^^
File "/Users/runner/miniconda3/envs/test/lib/python3.12/unittest/mock.py", line 1387, in patched
return func(*newargs, **newkeywargs)
^^^^^^^^^^^^^^^^^^^^^^^^^^^^^
File "/Users/runner/miniconda3/envs/test/lib/python3.12/site-packages/obspy/clients/fdsn/tests/test_client.py", line 1450, in test_authentication_exceptions
Client(eida_token="TEST")
File "/Users/runner/miniconda3/envs/test/lib/python3.12/site-packages/obspy/clients/fdsn/client.py", line 277, in __init__
self._discover_services()
File "/Users/runner/miniconda3/envs/test/lib/python3.12/site-packages/obspy/clients/fdsn/client.py", line 1638, in _discover_services
raise FDSNNoServiceException(msg)
obspy.clients.fdsn.header.FDSNNoServiceException: No FDSN services could be discovered at 'http://service.iris.edu'. This could be due to a temporary service outage or an invalid FDSN service address.
Traceback (most recent call last):
File "/Users/runner/miniconda3/envs/test/lib/python3.12/site-packages/_pytest/runner.py", line 346, in from_call
result: Optional[TResult] = func()
^^^^^^
File "/Users/runner/miniconda3/envs/test/lib/python3.12/site-packages/_pytest/runner.py", line 267, in <lambda>
lambda: ihook(item=item, **kwds), when=when, reraise=reraise
^^^^^^^^^^^^^^^^^^^^^^^^
File "/Users/runner/miniconda3/envs/test/lib/python3.12/site-packages/pluggy/_hooks.py", line 501, in __call__
return self._hookexec(self.name, self._hookimpls.copy(), kwargs, firstresult)
^^^^^^^^^^^^^^^^^^^^^^^^^^^^^^^^^^^^^^^^^^^^^^^^^^^^^^^^^^^^^^^^^^^^^^
File "/Users/runner/miniconda3/envs/test/lib/python3.12/site-packages/pluggy/_manager.py", line 119, in _hookexec
return self._inner_hookexec(hook_name, methods, kwargs, firstresult)
^^^^^^^^^^^^^^^^^^^^^^^^^^^^^^^^^^^^^^^^^^^^^^^^^^^^^^^^^^^^^
File "/Users/runner/miniconda3/envs/test/lib/python3.12/site-packages/pluggy/_callers.py", line 181, in _multicall
return outcome.get_result()
^^^^^^^^^^^^^^^^^^^^
File "/Users/runner/miniconda3/envs/test/lib/python3.12/site-packages/pluggy/_result.py", line 99, in get_result
raise exc.with_traceback(exc.__traceback__)
File "/Users/runner/miniconda3/envs/test/lib/python3.12/site-packages/pluggy/_callers.py", line 166, in _multicall
teardown.throw(outcome._exception)
File "/Users/runner/miniconda3/envs/test/lib/python3.12/site-packages/_pytest/threadexception.py", line 87, in pytest_runtest_call
yield from thread_exception_runtest_hook()
File "/Users/runner/miniconda3/envs/test/lib/python3.12/site-packages/_pytest/threadexception.py", line 63, in thread_exception_runtest_hook
yield
File "/Users/runner/miniconda3/envs/test/lib/python3.12/site-packages/pluggy/_callers.py", line 166, in _multicall
teardown.throw(outcome._exception)
File "/Users/runner/miniconda3/envs/test/lib/python3.12/site-packages/_pytest/unraisableexception.py", line 90, in pytest_runtest_call
yield from unraisable_exception_runtest_hook()
File "/Users/runner/miniconda3/envs/test/lib/python3.12/site-packages/_pytest/unraisableexception.py", line 65, in unraisable_exception_runtest_hook
yield
File "/Users/runner/miniconda3/envs/test/lib/python3.12/site-packages/pluggy/_callers.py", line 166, in _multicall
teardown.throw(outcome._exception)
File "/Users/runner/miniconda3/envs/test/lib/python3.12/site-packages/_pytest/logging.py", line 839, in pytest_runtest_call
yield from self._runtest_for(item, "call")
File "/Users/runner/miniconda3/envs/test/lib/python3.12/site-packages/_pytest/logging.py", line 822, in _runtest_for
yield
File "/Users/runner/miniconda3/envs/test/lib/python3.12/site-packages/pluggy/_callers.py", line 166, in _multicall
teardown.throw(outcome._exception)
File "/Users/runner/miniconda3/envs/test/lib/python3.12/site-packages/_pytest/capture.py", line 882, in pytest_runtest_call
return (yield)
^^^^^
File "/Users/runner/miniconda3/envs/test/lib/python3.12/site-packages/pluggy/_callers.py", line 166, in _multicall
teardown.throw(outcome._exception)
File "/Users/runner/miniconda3/envs/test/lib/python3.12/site-packages/_pytest/skipping.py", line 256, in pytest_runtest_call
return (yield)
^^^^^
File "/Users/runner/miniconda3/envs/test/lib/python3.12/site-packages/pluggy/_callers.py", line 102, in _multicall
res = hook_impl.function(*args)
^^^^^^^^^^^^^^^^^^^^^^^^^
File "/Users/runner/miniconda3/envs/test/lib/python3.12/site-packages/_pytest/runner.py", line 182, in pytest_runtest_call
raise e
File "/Users/runner/miniconda3/envs/test/lib/python3.12/site-packages/_pytest/runner.py", line 174, in pytest_runtest_call
item.runtest()
File "/Users/runner/miniconda3/envs/test/lib/python3.12/site-packages/_pytest/python.py", line 1831, in runtest
self.ihook.pytest_pyfunc_call(pyfuncitem=self)
File "/Users/runner/miniconda3/envs/test/lib/python3.12/site-packages/pluggy/_hooks.py", line 501, in __call__
return self._hookexec(self.name, self._hookimpls.copy(), kwargs, firstresult)
^^^^^^^^^^^^^^^^^^^^^^^^^^^^^^^^^^^^^^^^^^^^^^^^^^^^^^^^^^^^^^^^^^^^^^
File "/Users/runner/miniconda3/envs/test/lib/python3.12/site-packages/pluggy/_manager.py", line 119, in _hookexec
return self._inner_hookexec(hook_name, methods, kwargs, firstresult)
^^^^^^^^^^^^^^^^^^^^^^^^^^^^^^^^^^^^^^^^^^^^^^^^^^^^^^^^^^^^^
File "/Users/runner/miniconda3/envs/test/lib/python3.12/site-packages/pluggy/_callers.py", line 138, in _multicall
raise exception.with_traceback(exception.__traceback__)
File "/Users/runner/miniconda3/envs/test/lib/python3.12/site-packages/pluggy/_callers.py", line 102, in _multicall
res = hook_impl.function(*args)
^^^^^^^^^^^^^^^^^^^^^^^^^
File "/Users/runner/miniconda3/envs/test/lib/python3.12/site-packages/_pytest/python.py", line 194, in pytest_pyfunc_call
result = testfunction(**testargs)
^^^^^^^^^^^^^^^^^^^^^^^^
File "/Users/runner/miniconda3/envs/test/lib/python3.12/unittest/mock.py", line 1387, in patched
return func(*newargs, **newkeywargs)
^^^^^^^^^^^^^^^^^^^^^^^^^^^^^
File "/Users/runner/miniconda3/envs/test/lib/python3.12/site-packages/obspy/clients/fdsn/tests/test_client.py", line 1470, in test_timeout_exception
self.client.get_stations()
File "/Users/runner/miniconda3/envs/test/lib/python3.12/site-packages/obspy/clients/fdsn/client.py", line 748, in get_stations
data_stream = self._download(url)
^^^^^^^^^^^^^^^^^^^
File "/Users/runner/miniconda3/envs/test/lib/python3.12/site-packages/obspy/clients/fdsn/client.py", line 1486, in _download
raise_on_error(code, data)
File "/Users/runner/miniconda3/envs/test/lib/python3.12/site-packages/obspy/clients/fdsn/client.py", line 1802, in raise_on_error
server_info = data.decode('ASCII', errors='ignore')
^^^^^^^^^^^
AttributeError: 'str' object has no attribute 'decode'. Did you mean: 'encode'?
Traceback (most recent call last):
File "/Users/runner/miniconda3/envs/test/lib/python3.12/site-packages/_pytest/runner.py", line 346, in from_call
result: Optional[TResult] = func()
^^^^^^
File "/Users/runner/miniconda3/envs/test/lib/python3.12/site-packages/_pytest/runner.py", line 267, in <lambda>
lambda: ihook(item=item, **kwds), when=when, reraise=reraise
^^^^^^^^^^^^^^^^^^^^^^^^
File "/Users/runner/miniconda3/envs/test/lib/python3.12/site-packages/pluggy/_hooks.py", line 501, in __call__
return self._hookexec(self.name, self._hookimpls.copy(), kwargs, firstresult)
^^^^^^^^^^^^^^^^^^^^^^^^^^^^^^^^^^^^^^^^^^^^^^^^^^^^^^^^^^^^^^^^^^^^^^
File "/Users/runner/miniconda3/envs/test/lib/python3.12/site-packages/pluggy/_manager.py", line 119, in _hookexec
return self._inner_hookexec(hook_name, methods, kwargs, firstresult)
^^^^^^^^^^^^^^^^^^^^^^^^^^^^^^^^^^^^^^^^^^^^^^^^^^^^^^^^^^^^^
File "/Users/runner/miniconda3/envs/test/lib/python3.12/site-packages/pluggy/_callers.py", line 181, in _multicall
return outcome.get_result()
^^^^^^^^^^^^^^^^^^^^
File "/Users/runner/miniconda3/envs/test/lib/python3.12/site-packages/pluggy/_result.py", line 99, in get_result
raise exc.with_traceback(exc.__traceback__)
File "/Users/runner/miniconda3/envs/test/lib/python3.12/site-packages/pluggy/_callers.py", line 166, in _multicall
teardown.throw(outcome._exception)
File "/Users/runner/miniconda3/envs/test/lib/python3.12/site-packages/_pytest/threadexception.py", line 87, in pytest_runtest_call
yield from thread_exception_runtest_hook()
File "/Users/runner/miniconda3/envs/test/lib/python3.12/site-packages/_pytest/threadexception.py", line 63, in thread_exception_runtest_hook
yield
File "/Users/runner/miniconda3/envs/test/lib/python3.12/site-packages/pluggy/_callers.py", line 166, in _multicall
teardown.throw(outcome._exception)
File "/Users/runner/miniconda3/envs/test/lib/python3.12/site-packages/_pytest/unraisableexception.py", line 90, in pytest_runtest_call
yield from unraisable_exception_runtest_hook()
File "/Users/runner/miniconda3/envs/test/lib/python3.12/site-packages/_pytest/unraisableexception.py", line 65, in unraisable_exception_runtest_hook
yield
File "/Users/runner/miniconda3/envs/test/lib/python3.12/site-packages/pluggy/_callers.py", line 166, in _multicall
teardown.throw(outcome._exception)
File "/Users/runner/miniconda3/envs/test/lib/python3.12/site-packages/_pytest/logging.py", line 839, in pytest_runtest_call
yield from self._runtest_for(item, "call")
File "/Users/runner/miniconda3/envs/test/lib/python3.12/site-packages/_pytest/logging.py", line 822, in _runtest_for
yield
File "/Users/runner/miniconda3/envs/test/lib/python3.12/site-packages/pluggy/_callers.py", line 166, in _multicall
teardown.throw(outcome._exception)
File "/Users/runner/miniconda3/envs/test/lib/python3.12/site-packages/_pytest/capture.py", line 882, in pytest_runtest_call
return (yield)
^^^^^
File "/Users/runner/miniconda3/envs/test/lib/python3.12/site-packages/pluggy/_callers.py", line 166, in _multicall
teardown.throw(outcome._exception)
File "/Users/runner/miniconda3/envs/test/lib/python3.12/site-packages/_pytest/skipping.py", line 256, in pytest_runtest_call
return (yield)
^^^^^
File "/Users/runner/miniconda3/envs/test/lib/python3.12/site-packages/pluggy/_callers.py", line 102, in _multicall
res = hook_impl.function(*args)
^^^^^^^^^^^^^^^^^^^^^^^^^
File "/Users/runner/miniconda3/envs/test/lib/python3.12/site-packages/_pytest/runner.py", line 182, in pytest_runtest_call
raise e
File "/Users/runner/miniconda3/envs/test/lib/python3.12/site-packages/_pytest/runner.py", line 174, in pytest_runtest_call
item.runtest()
File "/Users/runner/miniconda3/envs/test/lib/python3.12/site-packages/_pytest/python.py", line 1831, in runtest
self.ihook.pytest_pyfunc_call(pyfuncitem=self)
File "/Users/runner/miniconda3/envs/test/lib/python3.12/site-packages/pluggy/_hooks.py", line 501, in __call__
return self._hookexec(self.name, self._hookimpls.copy(), kwargs, firstresult)
^^^^^^^^^^^^^^^^^^^^^^^^^^^^^^^^^^^^^^^^^^^^^^^^^^^^^^^^^^^^^^^^^^^^^^
File "/Users/runner/miniconda3/envs/test/lib/python3.12/site-packages/pluggy/_manager.py", line 119, in _hookexec
return self._inner_hookexec(hook_name, methods, kwargs, firstresult)
^^^^^^^^^^^^^^^^^^^^^^^^^^^^^^^^^^^^^^^^^^^^^^^^^^^^^^^^^^^^^
File "/Users/runner/miniconda3/envs/test/lib/python3.12/site-packages/pluggy/_callers.py", line 138, in _multicall
raise exception.with_traceback(exception.__traceback__)
File "/Users/runner/miniconda3/envs/test/lib/python3.12/site-packages/pluggy/_callers.py", line 102, in _multicall
res = hook_impl.function(*args)
^^^^^^^^^^^^^^^^^^^^^^^^^
File "/Users/runner/miniconda3/envs/test/lib/python3.12/site-packages/_pytest/python.py", line 194, in pytest_pyfunc_call
result = testfunction(**testargs)
^^^^^^^^^^^^^^^^^^^^^^^^
File "/Users/runner/miniconda3/envs/test/lib/python3.12/unittest/mock.py", line 1387, in patched
return func(*newargs, **newkeywargs)
^^^^^^^^^^^^^^^^^^^^^^^^^^^^^
File "/Users/runner/miniconda3/envs/test/lib/python3.12/site-packages/obspy/clients/fdsn/tests/test_client.py", line 1488, in test_not_implemented_exception
self.client.get_stations()
File "/Users/runner/miniconda3/envs/test/lib/python3.12/site-packages/obspy/clients/fdsn/client.py", line 748, in get_stations
data_stream = self._download(url)
^^^^^^^^^^^^^^^^^^^
File "/Users/runner/miniconda3/envs/test/lib/python3.12/site-packages/obspy/clients/fdsn/client.py", line 1486, in _download
raise_on_error(code, data)
File "/Users/runner/miniconda3/envs/test/lib/python3.12/site-packages/obspy/clients/fdsn/client.py", line 1802, in raise_on_error
server_info = data.decode('ASCII', errors='ignore')
^^^^^^^^^^^
AttributeError: 'NoneType' object has no attribute 'decode'
Traceback (most recent call last):
File "/Users/runner/miniconda3/envs/test/lib/python3.12/site-packages/_pytest/runner.py", line 346, in from_call
result: Optional[TResult] = func()
^^^^^^
File "/Users/runner/miniconda3/envs/test/lib/python3.12/site-packages/_pytest/runner.py", line 267, in <lambda>
lambda: ihook(item=item, **kwds), when=when, reraise=reraise
^^^^^^^^^^^^^^^^^^^^^^^^
File "/Users/runner/miniconda3/envs/test/lib/python3.12/site-packages/pluggy/_hooks.py", line 501, in __call__
return self._hookexec(self.name, self._hookimpls.copy(), kwargs, firstresult)
^^^^^^^^^^^^^^^^^^^^^^^^^^^^^^^^^^^^^^^^^^^^^^^^^^^^^^^^^^^^^^^^^^^^^^
File "/Users/runner/miniconda3/envs/test/lib/python3.12/site-packages/pluggy/_manager.py", line 119, in _hookexec
return self._inner_hookexec(hook_name, methods, kwargs, firstresult)
^^^^^^^^^^^^^^^^^^^^^^^^^^^^^^^^^^^^^^^^^^^^^^^^^^^^^^^^^^^^^
File "/Users/runner/miniconda3/envs/test/lib/python3.12/site-packages/pluggy/_callers.py", line 181, in _multicall
return outcome.get_result()
^^^^^^^^^^^^^^^^^^^^
File "/Users/runner/miniconda3/envs/test/lib/python3.12/site-packages/pluggy/_result.py", line 99, in get_result
raise exc.with_traceback(exc.__traceback__)
File "/Users/runner/miniconda3/envs/test/lib/python3.12/site-packages/pluggy/_callers.py", line 166, in _multicall
teardown.throw(outcome._exception)
File "/Users/runner/miniconda3/envs/test/lib/python3.12/site-packages/_pytest/threadexception.py", line 87, in pytest_runtest_call
yield from thread_exception_runtest_hook()
File "/Users/runner/miniconda3/envs/test/lib/python3.12/site-packages/_pytest/threadexception.py", line 63, in thread_exception_runtest_hook
yield
File "/Users/runner/miniconda3/envs/test/lib/python3.12/site-packages/pluggy/_callers.py", line 166, in _multicall
teardown.throw(outcome._exception)
File "/Users/runner/miniconda3/envs/test/lib/python3.12/site-packages/_pytest/unraisableexception.py", line 90, in pytest_runtest_call
yield from unraisable_exception_runtest_hook()
File "/Users/runner/miniconda3/envs/test/lib/python3.12/site-packages/_pytest/unraisableexception.py", line 65, in unraisable_exception_runtest_hook
yield
File "/Users/runner/miniconda3/envs/test/lib/python3.12/site-packages/pluggy/_callers.py", line 166, in _multicall
teardown.throw(outcome._exception)
File "/Users/runner/miniconda3/envs/test/lib/python3.12/site-packages/_pytest/logging.py", line 839, in pytest_runtest_call
yield from self._runtest_for(item, "call")
File "/Users/runner/miniconda3/envs/test/lib/python3.12/site-packages/_pytest/logging.py", line 822, in _runtest_for
yield
File "/Users/runner/miniconda3/envs/test/lib/python3.12/site-packages/pluggy/_callers.py", line 166, in _multicall
teardown.throw(outcome._exception)
File "/Users/runner/miniconda3/envs/test/lib/python3.12/site-packages/_pytest/capture.py", line 882, in pytest_runtest_call
return (yield)
^^^^^
File "/Users/runner/miniconda3/envs/test/lib/python3.12/site-packages/pluggy/_callers.py", line 166, in _multicall
teardown.throw(outcome._exception)
File "/Users/runner/miniconda3/envs/test/lib/python3.12/site-packages/_pytest/skipping.py", line 256, in pytest_runtest_call
return (yield)
^^^^^
File "/Users/runner/miniconda3/envs/test/lib/python3.12/site-packages/pluggy/_callers.py", line 102, in _multicall
res = hook_impl.function(*args)
^^^^^^^^^^^^^^^^^^^^^^^^^
File "/Users/runner/miniconda3/envs/test/lib/python3.12/site-packages/_pytest/runner.py", line 182, in pytest_runtest_call
raise e
File "/Users/runner/miniconda3/envs/test/lib/python3.12/site-packages/_pytest/runner.py", line 174, in pytest_runtest_call
item.runtest()
File "/Users/runner/miniconda3/envs/test/lib/python3.12/site-packages/_pytest/python.py", line 1831, in runtest
self.ihook.pytest_pyfunc_call(pyfuncitem=self)
File "/Users/runner/miniconda3/envs/test/lib/python3.12/site-packages/pluggy/_hooks.py", line 501, in __call__
return self._hookexec(self.name, self._hookimpls.copy(), kwargs, firstresult)
^^^^^^^^^^^^^^^^^^^^^^^^^^^^^^^^^^^^^^^^^^^^^^^^^^^^^^^^^^^^^^^^^^^^^^
File "/Users/runner/miniconda3/envs/test/lib/python3.12/site-packages/pluggy/_manager.py", line 119, in _hookexec
return self._inner_hookexec(hook_name, methods, kwargs, firstresult)
^^^^^^^^^^^^^^^^^^^^^^^^^^^^^^^^^^^^^^^^^^^^^^^^^^^^^^^^^^^^^
File "/Users/runner/miniconda3/envs/test/lib/python3.12/site-packages/pluggy/_callers.py", line 138, in _multicall
raise exception.with_traceback(exception.__traceback__)
File "/Users/runner/miniconda3/envs/test/lib/python3.12/site-packages/pluggy/_callers.py", line 102, in _multicall
res = hook_impl.function(*args)
^^^^^^^^^^^^^^^^^^^^^^^^^
File "/Users/runner/miniconda3/envs/test/lib/python3.12/site-packages/_pytest/python.py", line 194, in pytest_pyfunc_call
result = testfunction(**testargs)
^^^^^^^^^^^^^^^^^^^^^^^^
File "/Users/runner/miniconda3/envs/test/lib/python3.12/unittest/mock.py", line 1387, in patched
return func(*newargs, **newkeywargs)
^^^^^^^^^^^^^^^^^^^^^^^^^^^^^
File "/Users/runner/miniconda3/envs/test/lib/python3.12/site-packages/obspy/clients/fdsn/tests/test_client.py", line 1498, in test_bad_gateway_exception
self.client.get_stations()
File "/Users/runner/miniconda3/envs/test/lib/python3.12/site-packages/obspy/clients/fdsn/client.py", line 748, in get_stations
data_stream = self._download(url)
^^^^^^^^^^^^^^^^^^^
File "/Users/runner/miniconda3/envs/test/lib/python3.12/site-packages/obspy/clients/fdsn/client.py", line 1486, in _download
raise_on_error(code, data)
File "/Users/runner/miniconda3/envs/test/lib/python3.12/site-packages/obspy/clients/fdsn/client.py", line 1802, in raise_on_error
server_info = data.decode('ASCII', errors='ignore')
^^^^^^^^^^^
AttributeError: 'NoneType' object has no attribute 'decode'
Traceback (most recent call last):
File "/Users/runner/miniconda3/envs/test/lib/python3.12/site-packages/_pytest/runner.py", line 346, in from_call
result: Optional[TResult] = func()
^^^^^^
File "/Users/runner/miniconda3/envs/test/lib/python3.12/site-packages/_pytest/runner.py", line 267, in <lambda>
lambda: ihook(item=item, **kwds), when=when, reraise=reraise
^^^^^^^^^^^^^^^^^^^^^^^^
File "/Users/runner/miniconda3/envs/test/lib/python3.12/site-packages/pluggy/_hooks.py", line 501, in __call__
return self._hookexec(self.name, self._hookimpls.copy(), kwargs, firstresult)
^^^^^^^^^^^^^^^^^^^^^^^^^^^^^^^^^^^^^^^^^^^^^^^^^^^^^^^^^^^^^^^^^^^^^^
File "/Users/runner/miniconda3/envs/test/lib/python3.12/site-packages/pluggy/_manager.py", line 119, in _hookexec
return self._inner_hookexec(hook_name, methods, kwargs, firstresult)
^^^^^^^^^^^^^^^^^^^^^^^^^^^^^^^^^^^^^^^^^^^^^^^^^^^^^^^^^^^^^
File "/Users/runner/miniconda3/envs/test/lib/python3.12/site-packages/pluggy/_callers.py", line 181, in _multicall
return outcome.get_result()
^^^^^^^^^^^^^^^^^^^^
File "/Users/runner/miniconda3/envs/test/lib/python3.12/site-packages/pluggy/_result.py", line 99, in get_result
raise exc.with_traceback(exc.__traceback__)
File "/Users/runner/miniconda3/envs/test/lib/python3.12/site-packages/pluggy/_callers.py", line 166, in _multicall
teardown.throw(outcome._exception)
File "/Users/runner/miniconda3/envs/test/lib/python3.12/site-packages/_pytest/threadexception.py", line 87, in pytest_runtest_call
yield from thread_exception_runtest_hook()
File "/Users/runner/miniconda3/envs/test/lib/python3.12/site-packages/_pytest/threadexception.py", line 63, in thread_exception_runtest_hook
yield
File "/Users/runner/miniconda3/envs/test/lib/python3.12/site-packages/pluggy/_callers.py", line 166, in _multicall
teardown.throw(outcome._exception)
File "/Users/runner/miniconda3/envs/test/lib/python3.12/site-packages/_pytest/unraisableexception.py", line 90, in pytest_runtest_call
yield from unraisable_exception_runtest_hook()
File "/Users/runner/miniconda3/envs/test/lib/python3.12/site-packages/_pytest/unraisableexception.py", line 65, in unraisable_exception_runtest_hook
yield
File "/Users/runner/miniconda3/envs/test/lib/python3.12/site-packages/pluggy/_callers.py", line 166, in _multicall
teardown.throw(outcome._exception)
File "/Users/runner/miniconda3/envs/test/lib/python3.12/site-packages/_pytest/logging.py", line 839, in pytest_runtest_call
yield from self._runtest_for(item, "call")
File "/Users/runner/miniconda3/envs/test/lib/python3.12/site-packages/_pytest/logging.py", line 822, in _runtest_for
yield
File "/Users/runner/miniconda3/envs/test/lib/python3.12/site-packages/pluggy/_callers.py", line 166, in _multicall
teardown.throw(outcome._exception)
File "/Users/runner/miniconda3/envs/test/lib/python3.12/site-packages/_pytest/capture.py", line 882, in pytest_runtest_call
return (yield)
^^^^^
File "/Users/runner/miniconda3/envs/test/lib/python3.12/site-packages/pluggy/_callers.py", line 166, in _multicall
teardown.throw(outcome._exception)
File "/Users/runner/miniconda3/envs/test/lib/python3.12/site-packages/_pytest/skipping.py", line 256, in pytest_runtest_call
return (yield)
^^^^^
File "/Users/runner/miniconda3/envs/test/lib/python3.12/site-packages/pluggy/_callers.py", line 102, in _multicall
res = hook_impl.function(*args)
^^^^^^^^^^^^^^^^^^^^^^^^^
File "/Users/runner/miniconda3/envs/test/lib/python3.12/site-packages/_pytest/runner.py", line 182, in pytest_runtest_call
raise e
File "/Users/runner/miniconda3/envs/test/lib/python3.12/site-packages/_pytest/runner.py", line 174, in pytest_runtest_call
item.runtest()
File "/Users/runner/miniconda3/envs/test/lib/python3.12/site-packages/_pytest/python.py", line 1831, in runtest
self.ihook.pytest_pyfunc_call(pyfuncitem=self)
File "/Users/runner/miniconda3/envs/test/lib/python3.12/site-packages/pluggy/_hooks.py", line 501, in __call__
return self._hookexec(self.name, self._hookimpls.copy(), kwargs, firstresult)
^^^^^^^^^^^^^^^^^^^^^^^^^^^^^^^^^^^^^^^^^^^^^^^^^^^^^^^^^^^^^^^^^^^^^^
File "/Users/runner/miniconda3/envs/test/lib/python3.12/site-packages/pluggy/_manager.py", line 119, in _hookexec
return self._inner_hookexec(hook_name, methods, kwargs, firstresult)
^^^^^^^^^^^^^^^^^^^^^^^^^^^^^^^^^^^^^^^^^^^^^^^^^^^^^^^^^^^^^
File "/Users/runner/miniconda3/envs/test/lib/python3.12/site-packages/pluggy/_callers.py", line 138, in _multicall
raise exception.with_traceback(exception.__traceback__)
File "/Users/runner/miniconda3/envs/test/lib/python3.12/site-packages/pluggy/_callers.py", line 102, in _multicall
res = hook_impl.function(*args)
^^^^^^^^^^^^^^^^^^^^^^^^^
File "/Users/runner/miniconda3/envs/test/lib/python3.12/site-packages/_pytest/python.py", line 194, in pytest_pyfunc_call
result = testfunction(**testargs)
^^^^^^^^^^^^^^^^^^^^^^^^
File "/Users/runner/miniconda3/envs/test/lib/python3.12/unittest/mock.py", line 1387, in patched
return func(*newargs, **newkeywargs)
^^^^^^^^^^^^^^^^^^^^^^^^^^^^^
File "/Users/runner/miniconda3/envs/test/lib/python3.12/site-packages/obspy/clients/fdsn/tests/test_client.py", line 1508, in test_service_unavailable_exception
self.client.get_stations()
File "/Users/runner/miniconda3/envs/test/lib/python3.12/site-packages/obspy/clients/fdsn/client.py", line 748, in get_stations
data_stream = self._download(url)
^^^^^^^^^^^^^^^^^^^
File "/Users/runner/miniconda3/envs/test/lib/python3.12/site-packages/obspy/clients/fdsn/client.py", line 1486, in _download
raise_on_error(code, data)
File "/Users/runner/miniconda3/envs/test/lib/python3.12/site-packages/obspy/clients/fdsn/client.py", line 1802, in raise_on_error
server_info = data.decode('ASCII', errors='ignore')
^^^^^^^^^^^
AttributeError: 'NoneType' object has no attribute 'decode'
Traceback (most recent call last):
File "/Users/runner/miniconda3/envs/test/lib/python3.12/site-packages/_pytest/runner.py", line 346, in from_call
result: Optional[TResult] = func()
^^^^^^
File "/Users/runner/miniconda3/envs/test/lib/python3.12/site-packages/_pytest/runner.py", line 267, in <lambda>
lambda: ihook(item=item, **kwds), when=when, reraise=reraise
^^^^^^^^^^^^^^^^^^^^^^^^
File "/Users/runner/miniconda3/envs/test/lib/python3.12/site-packages/pluggy/_hooks.py", line 501, in __call__
return self._hookexec(self.name, self._hookimpls.copy(), kwargs, firstresult)
^^^^^^^^^^^^^^^^^^^^^^^^^^^^^^^^^^^^^^^^^^^^^^^^^^^^^^^^^^^^^^^^^^^^^^
File "/Users/runner/miniconda3/envs/test/lib/python3.12/site-packages/pluggy/_manager.py", line 119, in _hookexec
return self._inner_hookexec(hook_name, methods, kwargs, firstresult)
^^^^^^^^^^^^^^^^^^^^^^^^^^^^^^^^^^^^^^^^^^^^^^^^^^^^^^^^^^^^^
File "/Users/runner/miniconda3/envs/test/lib/python3.12/site-packages/pluggy/_callers.py", line 181, in _multicall
return outcome.get_result()
^^^^^^^^^^^^^^^^^^^^
File "/Users/runner/miniconda3/envs/test/lib/python3.12/site-packages/pluggy/_result.py", line 99, in get_result
raise exc.with_traceback(exc.__traceback__)
File "/Users/runner/miniconda3/envs/test/lib/python3.12/site-packages/pluggy/_callers.py", line 166, in _multicall
teardown.throw(outcome._exception)
File "/Users/runner/miniconda3/envs/test/lib/python3.12/site-packages/_pytest/threadexception.py", line 87, in pytest_runtest_call
yield from thread_exception_runtest_hook()
File "/Users/runner/miniconda3/envs/test/lib/python3.12/site-packages/_pytest/threadexception.py", line 63, in thread_exception_runtest_hook
yield
File "/Users/runner/miniconda3/envs/test/lib/python3.12/site-packages/pluggy/_callers.py", line 166, in _multicall
teardown.throw(outcome._exception)
File "/Users/runner/miniconda3/envs/test/lib/python3.12/site-packages/_pytest/unraisableexception.py", line 90, in pytest_runtest_call
yield from unraisable_exception_runtest_hook()
File "/Users/runner/miniconda3/envs/test/lib/python3.12/site-packages/_pytest/unraisableexception.py", line 65, in unraisable_exception_runtest_hook
yield
File "/Users/runner/miniconda3/envs/test/lib/python3.12/site-packages/pluggy/_callers.py", line 166, in _multicall
teardown.throw(outcome._exception)
File "/Users/runner/miniconda3/envs/test/lib/python3.12/site-packages/_pytest/logging.py", line 839, in pytest_runtest_call
yield from self._runtest_for(item, "call")
File "/Users/runner/miniconda3/envs/test/lib/python3.12/site-packages/_pytest/logging.py", line 822, in _runtest_for
yield
File "/Users/runner/miniconda3/envs/test/lib/python3.12/site-packages/pluggy/_callers.py", line 166, in _multicall
teardown.throw(outcome._exception)
File "/Users/runner/miniconda3/envs/test/lib/python3.12/site-packages/_pytest/capture.py", line 882, in pytest_runtest_call
return (yield)
^^^^^
File "/Users/runner/miniconda3/envs/test/lib/python3.12/site-packages/pluggy/_callers.py", line 166, in _multicall
teardown.throw(outcome._exception)
File "/Users/runner/miniconda3/envs/test/lib/python3.12/site-packages/_pytest/skipping.py", line 256, in pytest_runtest_call
return (yield)
^^^^^
File "/Users/runner/miniconda3/envs/test/lib/python3.12/site-packages/pluggy/_callers.py", line 102, in _multicall
res = hook_impl.function(*args)
^^^^^^^^^^^^^^^^^^^^^^^^^
File "/Users/runner/miniconda3/envs/test/lib/python3.12/site-packages/_pytest/runner.py", line 182, in pytest_runtest_call
raise e
File "/Users/runner/miniconda3/envs/test/lib/python3.12/site-packages/_pytest/runner.py", line 174, in pytest_runtest_call
item.runtest()
File "/Users/runner/miniconda3/envs/test/lib/python3.12/site-packages/_pytest/python.py", line 1831, in runtest
self.ihook.pytest_pyfunc_call(pyfuncitem=self)
File "/Users/runner/miniconda3/envs/test/lib/python3.12/site-packages/pluggy/_hooks.py", line 501, in __call__
return self._hookexec(self.name, self._hookimpls.copy(), kwargs, firstresult)
^^^^^^^^^^^^^^^^^^^^^^^^^^^^^^^^^^^^^^^^^^^^^^^^^^^^^^^^^^^^^^^^^^^^^^
File "/Users/runner/miniconda3/envs/test/lib/python3.12/site-packages/pluggy/_manager.py", line 119, in _hookexec
return self._inner_hookexec(hook_name, methods, kwargs, firstresult)
^^^^^^^^^^^^^^^^^^^^^^^^^^^^^^^^^^^^^^^^^^^^^^^^^^^^^^^^^^^^^
File "/Users/runner/miniconda3/envs/test/lib/python3.12/site-packages/pluggy/_callers.py", line 138, in _multicall
raise exception.with_traceback(exception.__traceback__)
File "/Users/runner/miniconda3/envs/test/lib/python3.12/site-packages/pluggy/_callers.py", line 102, in _multicall
res = hook_impl.function(*args)
^^^^^^^^^^^^^^^^^^^^^^^^^
File "/Users/runner/miniconda3/envs/test/lib/python3.12/site-packages/_pytest/python.py", line 194, in pytest_pyfunc_call
result = testfunction(**testargs)
^^^^^^^^^^^^^^^^^^^^^^^^
File "/Users/runner/miniconda3/envs/test/lib/python3.12/unittest/mock.py", line 1387, in patched
return func(*newargs, **newkeywargs)
^^^^^^^^^^^^^^^^^^^^^^^^^^^^^
File "/Users/runner/miniconda3/envs/test/lib/python3.12/site-packages/obspy/clients/fdsn/tests/test_client.py", line 1517, in test_bad_request_exception
self.client.get_stations()
File "/Users/runner/miniconda3/envs/test/lib/python3.12/site-packages/obspy/clients/fdsn/client.py", line 748, in get_stations
data_stream = self._download(url)
^^^^^^^^^^^^^^^^^^^
File "/Users/runner/miniconda3/envs/test/lib/python3.12/site-packages/obspy/clients/fdsn/client.py", line 1486, in _download
raise_on_error(code, data)
File "/Users/runner/miniconda3/envs/test/lib/python3.12/site-packages/obspy/clients/fdsn/client.py", line 1802, in raise_on_error
server_info = data.decode('ASCII', errors='ignore')
^^^^^^^^^^^
AttributeError: '_io.BytesIO' object has no attribute 'decode'
Traceback (most recent call last):
File "/Users/runner/miniconda3/envs/test/lib/python3.12/site-packages/_pytest/runner.py", line 346, in from_call
result: Optional[TResult] = func()
^^^^^^
File "/Users/runner/miniconda3/envs/test/lib/python3.12/site-packages/_pytest/runner.py", line 267, in <lambda>
lambda: ihook(item=item, **kwds), when=when, reraise=reraise
^^^^^^^^^^^^^^^^^^^^^^^^
File "/Users/runner/miniconda3/envs/test/lib/python3.12/site-packages/pluggy/_hooks.py", line 501, in __call__
return self._hookexec(self.name, self._hookimpls.copy(), kwargs, firstresult)
^^^^^^^^^^^^^^^^^^^^^^^^^^^^^^^^^^^^^^^^^^^^^^^^^^^^^^^^^^^^^^^^^^^^^^
File "/Users/runner/miniconda3/envs/test/lib/python3.12/site-packages/pluggy/_manager.py", line 119, in _hookexec
return self._inner_hookexec(hook_name, methods, kwargs, firstresult)
^^^^^^^^^^^^^^^^^^^^^^^^^^^^^^^^^^^^^^^^^^^^^^^^^^^^^^^^^^^^^
File "/Users/runner/miniconda3/envs/test/lib/python3.12/site-packages/pluggy/_callers.py", line 181, in _multicall
return outcome.get_result()
^^^^^^^^^^^^^^^^^^^^
File "/Users/runner/miniconda3/envs/test/lib/python3.12/site-packages/pluggy/_result.py", line 99, in get_result
raise exc.with_traceback(exc.__traceback__)
File "/Users/runner/miniconda3/envs/test/lib/python3.12/site-packages/pluggy/_callers.py", line 166, in _multicall
teardown.throw(outcome._exception)
File "/Users/runner/miniconda3/envs/test/lib/python3.12/site-packages/_pytest/threadexception.py", line 87, in pytest_runtest_call
yield from thread_exception_runtest_hook()
File "/Users/runner/miniconda3/envs/test/lib/python3.12/site-packages/_pytest/threadexception.py", line 63, in thread_exception_runtest_hook
yield
File "/Users/runner/miniconda3/envs/test/lib/python3.12/site-packages/pluggy/_callers.py", line 166, in _multicall
teardown.throw(outcome._exception)
File "/Users/runner/miniconda3/envs/test/lib/python3.12/site-packages/_pytest/unraisableexception.py", line 90, in pytest_runtest_call
yield from unraisable_exception_runtest_hook()
File "/Users/runner/miniconda3/envs/test/lib/python3.12/site-packages/_pytest/unraisableexception.py", line 65, in unraisable_exception_runtest_hook
yield
File "/Users/runner/miniconda3/envs/test/lib/python3.12/site-packages/pluggy/_callers.py", line 166, in _multicall
teardown.throw(outcome._exception)
File "/Users/runner/miniconda3/envs/test/lib/python3.12/site-packages/_pytest/logging.py", line 839, in pytest_runtest_call
yield from self._runtest_for(item, "call")
File "/Users/runner/miniconda3/envs/test/lib/python3.12/site-packages/_pytest/logging.py", line 822, in _runtest_for
yield
File "/Users/runner/miniconda3/envs/test/lib/python3.12/site-packages/pluggy/_callers.py", line 166, in _multicall
teardown.throw(outcome._exception)
File "/Users/runner/miniconda3/envs/test/lib/python3.12/site-packages/_pytest/capture.py", line 882, in pytest_runtest_call
return (yield)
^^^^^
File "/Users/runner/miniconda3/envs/test/lib/python3.12/site-packages/pluggy/_callers.py", line 166, in _multicall
teardown.throw(outcome._exception)
File "/Users/runner/miniconda3/envs/test/lib/python3.12/site-packages/_pytest/skipping.py", line 256, in pytest_runtest_call
return (yield)
^^^^^
File "/Users/runner/miniconda3/envs/test/lib/python3.12/site-packages/pluggy/_callers.py", line 102, in _multicall
res = hook_impl.function(*args)
^^^^^^^^^^^^^^^^^^^^^^^^^
File "/Users/runner/miniconda3/envs/test/lib/python3.12/site-packages/_pytest/runner.py", line 182, in pytest_runtest_call
raise e
File "/Users/runner/miniconda3/envs/test/lib/python3.12/site-packages/_pytest/runner.py", line 174, in pytest_runtest_call
item.runtest()
File "/Users/runner/miniconda3/envs/test/lib/python3.12/site-packages/_pytest/python.py", line 1831, in runtest
self.ihook.pytest_pyfunc_call(pyfuncitem=self)
File "/Users/runner/miniconda3/envs/test/lib/python3.12/site-packages/pluggy/_hooks.py", line 501, in __call__
return self._hookexec(self.name, self._hookimpls.copy(), kwargs, firstresult)
^^^^^^^^^^^^^^^^^^^^^^^^^^^^^^^^^^^^^^^^^^^^^^^^^^^^^^^^^^^^^^^^^^^^^^
File "/Users/runner/miniconda3/envs/test/lib/python3.12/site-packages/pluggy/_manager.py", line 119, in _hookexec
return self._inner_hookexec(hook_name, methods, kwargs, firstresult)
^^^^^^^^^^^^^^^^^^^^^^^^^^^^^^^^^^^^^^^^^^^^^^^^^^^^^^^^^^^^^
File "/Users/runner/miniconda3/envs/test/lib/python3.12/site-packages/pluggy/_callers.py", line 138, in _multicall
raise exception.with_traceback(exception.__traceback__)
File "/Users/runner/miniconda3/envs/test/lib/python3.12/site-packages/pluggy/_callers.py", line 102, in _multicall
res = hook_impl.function(*args)
^^^^^^^^^^^^^^^^^^^^^^^^^
File "/Users/runner/miniconda3/envs/test/lib/python3.12/site-packages/_pytest/python.py", line 194, in pytest_pyfunc_call
result = testfunction(**testargs)
^^^^^^^^^^^^^^^^^^^^^^^^
File "/Users/runner/miniconda3/envs/test/lib/python3.12/unittest/mock.py", line 1387, in patched
return func(*newargs, **newkeywargs)
^^^^^^^^^^^^^^^^^^^^^^^^^^^^^
File "/Users/runner/miniconda3/envs/test/lib/python3.12/site-packages/obspy/clients/fdsn/tests/test_client.py", line 1526, in test_server_exception
self.client.get_stations()
File "/Users/runner/miniconda3/envs/test/lib/python3.12/site-packages/obspy/clients/fdsn/client.py", line 748, in get_stations
data_stream = self._download(url)
^^^^^^^^^^^^^^^^^^^
File "/Users/runner/miniconda3/envs/test/lib/python3.12/site-packages/obspy/clients/fdsn/client.py", line 1486, in _download
raise_on_error(code, data)
File "/Users/runner/miniconda3/envs/test/lib/python3.12/site-packages/obspy/clients/fdsn/client.py", line 1802, in raise_on_error
server_info = data.decode('ASCII', errors='ignore')
^^^^^^^^^^^
AttributeError: 'NoneType' object has no attribute 'decode'
Traceback (most recent call last):
File "/Users/runner/miniconda3/envs/test/lib/python3.12/site-packages/_pytest/runner.py", line 346, in from_call
result: Optional[TResult] = func()
^^^^^^
File "/Users/runner/miniconda3/envs/test/lib/python3.12/site-packages/_pytest/runner.py", line 267, in <lambda>
lambda: ihook(item=item, **kwds), when=when, reraise=reraise
^^^^^^^^^^^^^^^^^^^^^^^^
File "/Users/runner/miniconda3/envs/test/lib/python3.12/site-packages/pluggy/_hooks.py", line 501, in __call__
return self._hookexec(self.name, self._hookimpls.copy(), kwargs, firstresult)
^^^^^^^^^^^^^^^^^^^^^^^^^^^^^^^^^^^^^^^^^^^^^^^^^^^^^^^^^^^^^^^^^^^^^^
File "/Users/runner/miniconda3/envs/test/lib/python3.12/site-packages/pluggy/_manager.py", line 119, in _hookexec
return self._inner_hookexec(hook_name, methods, kwargs, firstresult)
^^^^^^^^^^^^^^^^^^^^^^^^^^^^^^^^^^^^^^^^^^^^^^^^^^^^^^^^^^^^^
File "/Users/runner/miniconda3/envs/test/lib/python3.12/site-packages/pluggy/_callers.py", line 181, in _multicall
return outcome.get_result()
^^^^^^^^^^^^^^^^^^^^
File "/Users/runner/miniconda3/envs/test/lib/python3.12/site-packages/pluggy/_result.py", line 99, in get_result
raise exc.with_traceback(exc.__traceback__)
File "/Users/runner/miniconda3/envs/test/lib/python3.12/site-packages/pluggy/_callers.py", line 166, in _multicall
teardown.throw(outcome._exception)
File "/Users/runner/miniconda3/envs/test/lib/python3.12/site-packages/_pytest/threadexception.py", line 87, in pytest_runtest_call
yield from thread_exception_runtest_hook()
File "/Users/runner/miniconda3/envs/test/lib/python3.12/site-packages/_pytest/threadexception.py", line 63, in thread_exception_runtest_hook
yield
File "/Users/runner/miniconda3/envs/test/lib/python3.12/site-packages/pluggy/_callers.py", line 166, in _multicall
teardown.throw(outcome._exception)
File "/Users/runner/miniconda3/envs/test/lib/python3.12/site-packages/_pytest/unraisableexception.py", line 90, in pytest_runtest_call
yield from unraisable_exception_runtest_hook()
File "/Users/runner/miniconda3/envs/test/lib/python3.12/site-packages/_pytest/unraisableexception.py", line 65, in unraisable_exception_runtest_hook
yield
File "/Users/runner/miniconda3/envs/test/lib/python3.12/site-packages/pluggy/_callers.py", line 166, in _multicall
teardown.throw(outcome._exception)
File "/Users/runner/miniconda3/envs/test/lib/python3.12/site-packages/_pytest/logging.py", line 839, in pytest_runtest_call
yield from self._runtest_for(item, "call")
File "/Users/runner/miniconda3/envs/test/lib/python3.12/site-packages/_pytest/logging.py", line 822, in _runtest_for
yield
File "/Users/runner/miniconda3/envs/test/lib/python3.12/site-packages/pluggy/_callers.py", line 166, in _multicall
teardown.throw(outcome._exception)
File "/Users/runner/miniconda3/envs/test/lib/python3.12/site-packages/_pytest/capture.py", line 882, in pytest_runtest_call
return (yield)
^^^^^
File "/Users/runner/miniconda3/envs/test/lib/python3.12/site-packages/pluggy/_callers.py", line 166, in _multicall
teardown.throw(outcome._exception)
File "/Users/runner/miniconda3/envs/test/lib/python3.12/site-packages/_pytest/skipping.py", line 256, in pytest_runtest_call
return (yield)
^^^^^
File "/Users/runner/miniconda3/envs/test/lib/python3.12/site-packages/pluggy/_callers.py", line 102, in _multicall
res = hook_impl.function(*args)
^^^^^^^^^^^^^^^^^^^^^^^^^
File "/Users/runner/miniconda3/envs/test/lib/python3.12/site-packages/_pytest/runner.py", line 182, in pytest_runtest_call
raise e
File "/Users/runner/miniconda3/envs/test/lib/python3.12/site-packages/_pytest/runner.py", line 174, in pytest_runtest_call
item.runtest()
File "/Users/runner/miniconda3/envs/test/lib/python3.12/site-packages/_pytest/python.py", line 1831, in runtest
self.ihook.pytest_pyfunc_call(pyfuncitem=self)
File "/Users/runner/miniconda3/envs/test/lib/python3.12/site-packages/pluggy/_hooks.py", line 501, in __call__
return self._hookexec(self.name, self._hookimpls.copy(), kwargs, firstresult)
^^^^^^^^^^^^^^^^^^^^^^^^^^^^^^^^^^^^^^^^^^^^^^^^^^^^^^^^^^^^^^^^^^^^^^
File "/Users/runner/miniconda3/envs/test/lib/python3.12/site-packages/pluggy/_manager.py", line 119, in _hookexec
return self._inner_hookexec(hook_name, methods, kwargs, firstresult)
^^^^^^^^^^^^^^^^^^^^^^^^^^^^^^^^^^^^^^^^^^^^^^^^^^^^^^^^^^^^^
File "/Users/runner/miniconda3/envs/test/lib/python3.12/site-packages/pluggy/_callers.py", line 138, in _multicall
raise exception.with_traceback(exception.__traceback__)
File "/Users/runner/miniconda3/envs/test/lib/python3.12/site-packages/pluggy/_callers.py", line 102, in _multicall
res = hook_impl.function(*args)
^^^^^^^^^^^^^^^^^^^^^^^^^
File "/Users/runner/miniconda3/envs/test/lib/python3.12/site-packages/_pytest/python.py", line 194, in pytest_pyfunc_call
result = testfunction(**testargs)
^^^^^^^^^^^^^^^^^^^^^^^^
File "/Users/runner/miniconda3/envs/test/lib/python3.12/unittest/mock.py", line 1387, in patched
return func(*newargs, **newkeywargs)
^^^^^^^^^^^^^^^^^^^^^^^^^^^^^
File "/Users/runner/miniconda3/envs/test/lib/python3.12/site-packages/obspy/clients/fdsn/tests/test_client.py", line 1535, in test_too_many_requests_exception
self.client.get_stations()
File "/Users/runner/miniconda3/envs/test/lib/python3.12/site-packages/obspy/clients/fdsn/client.py", line 748, in get_stations
data_stream = self._download(url)
^^^^^^^^^^^^^^^^^^^
File "/Users/runner/miniconda3/envs/test/lib/python3.12/site-packages/obspy/clients/fdsn/client.py", line 1486, in _download
raise_on_error(code, data)
File "/Users/runner/miniconda3/envs/test/lib/python3.12/site-packages/obspy/clients/fdsn/client.py", line 1802, in raise_on_error
server_info = data.decode('ASCII', errors='ignore')
^^^^^^^^^^^
AttributeError: 'NoneType' object has no attribute 'decode'
Traceback (most recent call last):
File "/Users/runner/miniconda3/envs/test/lib/python3.12/site-packages/_pytest/runner.py", line 346, in from_call
result: Optional[TResult] = func()
^^^^^^
File "/Users/runner/miniconda3/envs/test/lib/python3.12/site-packages/_pytest/runner.py", line 267, in <lambda>
lambda: ihook(item=item, **kwds), when=when, reraise=reraise
^^^^^^^^^^^^^^^^^^^^^^^^
File "/Users/runner/miniconda3/envs/test/lib/python3.12/site-packages/pluggy/_hooks.py", line 501, in __call__
return self._hookexec(self.name, self._hookimpls.copy(), kwargs, firstresult)
^^^^^^^^^^^^^^^^^^^^^^^^^^^^^^^^^^^^^^^^^^^^^^^^^^^^^^^^^^^^^^^^^^^^^^
File "/Users/runner/miniconda3/envs/test/lib/python3.12/site-packages/pluggy/_manager.py", line 119, in _hookexec
return self._inner_hookexec(hook_name, methods, kwargs, firstresult)
^^^^^^^^^^^^^^^^^^^^^^^^^^^^^^^^^^^^^^^^^^^^^^^^^^^^^^^^^^^^^
File "/Users/runner/miniconda3/envs/test/lib/python3.12/site-packages/pluggy/_callers.py", line 181, in _multicall
return outcome.get_result()
^^^^^^^^^^^^^^^^^^^^
File "/Users/runner/miniconda3/envs/test/lib/python3.12/site-packages/pluggy/_result.py", line 99, in get_result
raise exc.with_traceback(exc.__traceback__)
File "/Users/runner/miniconda3/envs/test/lib/python3.12/site-packages/pluggy/_callers.py", line 166, in _multicall
teardown.throw(outcome._exception)
File "/Users/runner/miniconda3/envs/test/lib/python3.12/site-packages/_pytest/threadexception.py", line 87, in pytest_runtest_call
yield from thread_exception_runtest_hook()
File "/Users/runner/miniconda3/envs/test/lib/python3.12/site-packages/_pytest/threadexception.py", line 63, in thread_exception_runtest_hook
yield
File "/Users/runner/miniconda3/envs/test/lib/python3.12/site-packages/pluggy/_callers.py", line 166, in _multicall
teardown.throw(outcome._exception)
File "/Users/runner/miniconda3/envs/test/lib/python3.12/site-packages/_pytest/unraisableexception.py", line 90, in pytest_runtest_call
yield from unraisable_exception_runtest_hook()
File "/Users/runner/miniconda3/envs/test/lib/python3.12/site-packages/_pytest/unraisableexception.py", line 65, in unraisable_exception_runtest_hook
yield
File "/Users/runner/miniconda3/envs/test/lib/python3.12/site-packages/pluggy/_callers.py", line 166, in _multicall
teardown.throw(outcome._exception)
File "/Users/runner/miniconda3/envs/test/lib/python3.12/site-packages/_pytest/logging.py", line 839, in pytest_runtest_call
yield from self._runtest_for(item, "call")
File "/Users/runner/miniconda3/envs/test/lib/python3.12/site-packages/_pytest/logging.py", line 822, in _runtest_for
yield
File "/Users/runner/miniconda3/envs/test/lib/python3.12/site-packages/pluggy/_callers.py", line 166, in _multicall
teardown.throw(outcome._exception)
File "/Users/runner/miniconda3/envs/test/lib/python3.12/site-packages/_pytest/capture.py", line 882, in pytest_runtest_call
return (yield)
^^^^^
File "/Users/runner/miniconda3/envs/test/lib/python3.12/site-packages/pluggy/_callers.py", line 166, in _multicall
teardown.throw(outcome._exception)
File "/Users/runner/miniconda3/envs/test/lib/python3.12/site-packages/_pytest/skipping.py", line 256, in pytest_runtest_call
return (yield)
^^^^^
File "/Users/runner/miniconda3/envs/test/lib/python3.12/site-packages/pluggy/_callers.py", line 102, in _multicall
res = hook_impl.function(*args)
^^^^^^^^^^^^^^^^^^^^^^^^^
File "/Users/runner/miniconda3/envs/test/lib/python3.12/site-packages/_pytest/runner.py", line 182, in pytest_runtest_call
raise e
File "/Users/runner/miniconda3/envs/test/lib/python3.12/site-packages/_pytest/runner.py", line 174, in pytest_runtest_call
item.runtest()
File "/Users/runner/miniconda3/envs/test/lib/python3.12/site-packages/_pytest/python.py", line 1831, in runtest
self.ihook.pytest_pyfunc_call(pyfuncitem=self)
File "/Users/runner/miniconda3/envs/test/lib/python3.12/site-packages/pluggy/_hooks.py", line 501, in __call__
return self._hookexec(self.name, self._hookimpls.copy(), kwargs, firstresult)
^^^^^^^^^^^^^^^^^^^^^^^^^^^^^^^^^^^^^^^^^^^^^^^^^^^^^^^^^^^^^^^^^^^^^^
File "/Users/runner/miniconda3/envs/test/lib/python3.12/site-packages/pluggy/_manager.py", line 119, in _hookexec
return self._inner_hookexec(hook_name, methods, kwargs, firstresult)
^^^^^^^^^^^^^^^^^^^^^^^^^^^^^^^^^^^^^^^^^^^^^^^^^^^^^^^^^^^^^
File "/Users/runner/miniconda3/envs/test/lib/python3.12/site-packages/pluggy/_callers.py", line 138, in _multicall
raise exception.with_traceback(exception.__traceback__)
File "/Users/runner/miniconda3/envs/test/lib/python3.12/site-packages/pluggy/_callers.py", line 102, in _multicall
res = hook_impl.function(*args)
^^^^^^^^^^^^^^^^^^^^^^^^^
File "/Users/runner/miniconda3/envs/test/lib/python3.12/site-packages/_pytest/python.py", line 194, in pytest_pyfunc_call
result = testfunction(**testargs)
^^^^^^^^^^^^^^^^^^^^^^^^
File "/Users/runner/miniconda3/envs/test/lib/python3.12/site-packages/obspy/clients/fdsn/tests/test_eidaws_routing_client.py", line 135, in test_error_handling
self.client.get_waveforms(
File "/Users/runner/miniconda3/envs/test/lib/python3.12/site-packages/decorator.py", line 232, in fun
return caller(func, *(extras + args), **kw)
^^^^^^^^^^^^^^^^^^^^^^^^^^^^^^^^^^^^
File "/Users/runner/miniconda3/envs/test/lib/python3.12/site-packages/obspy/clients/fdsn/routing/routing_client.py", line 84, in _assert_filename_not_in_kwargs
return f(*args, **kwargs)
^^^^^^^^^^^^^^^^^^
File "/Users/runner/miniconda3/envs/test/lib/python3.12/site-packages/decorator.py", line 232, in fun
return caller(func, *(extras + args), **kw)
^^^^^^^^^^^^^^^^^^^^^^^^^^^^^^^^^^^^
File "/Users/runner/miniconda3/envs/test/lib/python3.12/site-packages/obspy/clients/fdsn/routing/routing_client.py", line 91, in _assert_attach_response_not_in_kwargs
return f(*args, **kwargs)
^^^^^^^^^^^^^^^^^^
File "/Users/runner/miniconda3/envs/test/lib/python3.12/site-packages/obspy/clients/fdsn/routing/routing_client.py", line 335, in get_waveforms
return self.get_waveforms_bulk([bulk], **kwargs)
^^^^^^^^^^^^^^^^^^^^^^^^^^^^^^^^^^^^^^^^^
File "/Users/runner/miniconda3/envs/test/lib/python3.12/site-packages/decorator.py", line 232, in fun
return caller(func, *(extras + args), **kw)
^^^^^^^^^^^^^^^^^^^^^^^^^^^^^^^^^^^^
File "/Users/runner/miniconda3/envs/test/lib/python3.12/site-packages/obspy/clients/fdsn/routing/routing_client.py", line 84, in _assert_filename_not_in_kwargs
return f(*args, **kwargs)
^^^^^^^^^^^^^^^^^^
File "/Users/runner/miniconda3/envs/test/lib/python3.12/site-packages/decorator.py", line 232, in fun
return caller(func, *(extras + args), **kw)
^^^^^^^^^^^^^^^^^^^^^^^^^^^^^^^^^^^^
File "/Users/runner/miniconda3/envs/test/lib/python3.12/site-packages/obspy/clients/fdsn/routing/routing_client.py", line 91, in _assert_attach_response_not_in_kwargs
return f(*args, **kwargs)
^^^^^^^^^^^^^^^^^^
File "/Users/runner/miniconda3/envs/test/lib/python3.12/site-packages/obspy/clients/fdsn/routing/eidaws_routing_client.py", line 99, in get_waveforms_bulk
inv = self.get_stations_bulk(_b, level="channel", **kwargs)
^^^^^^^^^^^^^^^^^^^^^^^^^^^^^^^^^^^^^^^^^^^^^^^^^^^^^
File "/Users/runner/miniconda3/envs/test/lib/python3.12/site-packages/decorator.py", line 232, in fun
return caller(func, *(extras + args), **kw)
^^^^^^^^^^^^^^^^^^^^^^^^^^^^^^^^^^^^
File "/Users/runner/miniconda3/envs/test/lib/python3.12/site-packages/obspy/clients/fdsn/routing/routing_client.py", line 77, in _assert_format_not_in_kwargs
return f(*args, **kwargs)
^^^^^^^^^^^^^^^^^^
File "/Users/runner/miniconda3/envs/test/lib/python3.12/site-packages/decorator.py", line 232, in fun
return caller(func, *(extras + args), **kw)
^^^^^^^^^^^^^^^^^^^^^^^^^^^^^^^^^^^^
File "/Users/runner/miniconda3/envs/test/lib/python3.12/site-packages/obspy/clients/fdsn/routing/routing_client.py", line 84, in _assert_filename_not_in_kwargs
return f(*args, **kwargs)
^^^^^^^^^^^^^^^^^^
File "/Users/runner/miniconda3/envs/test/lib/python3.12/site-packages/obspy/clients/fdsn/routing/eidaws_routing_client.py", line 175, in get_stations_bulk
r = self._download(self._url + "/query", data=bulk_str,
^^^^^^^^^^^^^^^^^^^^^^^^^^^^^^^^^^^^^^^^^^^^^^^^^^^
File "/Users/runner/miniconda3/envs/test/lib/python3.12/site-packages/obspy/clients/base.py", line 249, in _download
self._handle_requests_http_error(r)
File "/Users/runner/miniconda3/envs/test/lib/python3.12/site-packages/obspy/clients/fdsn/routing/routing_client.py", line 304, in _handle_requests_http_error
raise_on_error(r.status_code, buf)
File "/Users/runner/miniconda3/envs/test/lib/python3.12/site-packages/obspy/clients/fdsn/client.py", line 1802, in raise_on_error
server_info = data.decode('ASCII', errors='ignore')
^^^^^^^^^^^
AttributeError: '_io.BytesIO' object has no attribute 'decode'
Traceback (most recent call last):
File "/Users/runner/miniconda3/envs/test/lib/python3.12/site-packages/_pytest/runner.py", line 346, in from_call
result: Optional[TResult] = func()
^^^^^^
File "/Users/runner/miniconda3/envs/test/lib/python3.12/site-packages/_pytest/runner.py", line 267, in <lambda>
lambda: ihook(item=item, **kwds), when=when, reraise=reraise
^^^^^^^^^^^^^^^^^^^^^^^^
File "/Users/runner/miniconda3/envs/test/lib/python3.12/site-packages/pluggy/_hooks.py", line 501, in __call__
return self._hookexec(self.name, self._hookimpls.copy(), kwargs, firstresult)
^^^^^^^^^^^^^^^^^^^^^^^^^^^^^^^^^^^^^^^^^^^^^^^^^^^^^^^^^^^^^^^^^^^^^^
File "/Users/runner/miniconda3/envs/test/lib/python3.12/site-packages/pluggy/_manager.py", line 119, in _hookexec
return self._inner_hookexec(hook_name, methods, kwargs, firstresult)
^^^^^^^^^^^^^^^^^^^^^^^^^^^^^^^^^^^^^^^^^^^^^^^^^^^^^^^^^^^^^
File "/Users/runner/miniconda3/envs/test/lib/python3.12/site-packages/pluggy/_callers.py", line 181, in _multicall
return outcome.get_result()
^^^^^^^^^^^^^^^^^^^^
File "/Users/runner/miniconda3/envs/test/lib/python3.12/site-packages/pluggy/_result.py", line 99, in get_result
raise exc.with_traceback(exc.__traceback__)
File "/Users/runner/miniconda3/envs/test/lib/python3.12/site-packages/pluggy/_callers.py", line 166, in _multicall
teardown.throw(outcome._exception)
File "/Users/runner/miniconda3/envs/test/lib/python3.12/site-packages/_pytest/threadexception.py", line 87, in pytest_runtest_call
yield from thread_exception_runtest_hook()
File "/Users/runner/miniconda3/envs/test/lib/python3.12/site-packages/_pytest/threadexception.py", line 63, in thread_exception_runtest_hook
yield
File "/Users/runner/miniconda3/envs/test/lib/python3.12/site-packages/pluggy/_callers.py", line 166, in _multicall
teardown.throw(outcome._exception)
File "/Users/runner/miniconda3/envs/test/lib/python3.12/site-packages/_pytest/unraisableexception.py", line 90, in pytest_runtest_call
yield from unraisable_exception_runtest_hook()
File "/Users/runner/miniconda3/envs/test/lib/python3.12/site-packages/_pytest/unraisableexception.py", line 65, in unraisable_exception_runtest_hook
yield
File "/Users/runner/miniconda3/envs/test/lib/python3.12/site-packages/pluggy/_callers.py", line 166, in _multicall
teardown.throw(outcome._exception)
File "/Users/runner/miniconda3/envs/test/lib/python3.12/site-packages/_pytest/logging.py", line 839, in pytest_runtest_call
yield from self._runtest_for(item, "call")
File "/Users/runner/miniconda3/envs/test/lib/python3.12/site-packages/_pytest/logging.py", line 822, in _runtest_for
yield
File "/Users/runner/miniconda3/envs/test/lib/python3.12/site-packages/pluggy/_callers.py", line 166, in _multicall
teardown.throw(outcome._exception)
File "/Users/runner/miniconda3/envs/test/lib/python3.12/site-packages/_pytest/capture.py", line 882, in pytest_runtest_call
return (yield)
^^^^^
File "/Users/runner/miniconda3/envs/test/lib/python3.12/site-packages/pluggy/_callers.py", line 166, in _multicall
teardown.throw(outcome._exception)
File "/Users/runner/miniconda3/envs/test/lib/python3.12/site-packages/_pytest/skipping.py", line 256, in pytest_runtest_call
return (yield)
^^^^^
File "/Users/runner/miniconda3/envs/test/lib/python3.12/site-packages/pluggy/_callers.py", line 102, in _multicall
res = hook_impl.function(*args)
^^^^^^^^^^^^^^^^^^^^^^^^^
File "/Users/runner/miniconda3/envs/test/lib/python3.12/site-packages/_pytest/runner.py", line 182, in pytest_runtest_call
raise e
File "/Users/runner/miniconda3/envs/test/lib/python3.12/site-packages/_pytest/runner.py", line 174, in pytest_runtest_call
item.runtest()
File "/Users/runner/miniconda3/envs/test/lib/python3.12/site-packages/_pytest/python.py", line 1831, in runtest
self.ihook.pytest_pyfunc_call(pyfuncitem=self)
File "/Users/runner/miniconda3/envs/test/lib/python3.12/site-packages/pluggy/_hooks.py", line 501, in __call__
return self._hookexec(self.name, self._hookimpls.copy(), kwargs, firstresult)
^^^^^^^^^^^^^^^^^^^^^^^^^^^^^^^^^^^^^^^^^^^^^^^^^^^^^^^^^^^^^^^^^^^^^^
File "/Users/runner/miniconda3/envs/test/lib/python3.12/site-packages/pluggy/_manager.py", line 119, in _hookexec
return self._inner_hookexec(hook_name, methods, kwargs, firstresult)
^^^^^^^^^^^^^^^^^^^^^^^^^^^^^^^^^^^^^^^^^^^^^^^^^^^^^^^^^^^^^
File "/Users/runner/miniconda3/envs/test/lib/python3.12/site-packages/pluggy/_callers.py", line 138, in _multicall
raise exception.with_traceback(exception.__traceback__)
File "/Users/runner/miniconda3/envs/test/lib/python3.12/site-packages/pluggy/_callers.py", line 102, in _multicall
res = hook_impl.function(*args)
^^^^^^^^^^^^^^^^^^^^^^^^^
File "/Users/runner/miniconda3/envs/test/lib/python3.12/site-packages/_pytest/python.py", line 194, in pytest_pyfunc_call
result = testfunction(**testargs)
^^^^^^^^^^^^^^^^^^^^^^^^
File "/Users/runner/miniconda3/envs/test/lib/python3.12/site-packages/obspy/clients/fdsn/tests/test_federator_routing_client.py", line 329, in test_get_stations_integration_test
assert len(inv) >= 1
AssertionError: assert 0 >= 1
+ where 0 = len(<obspy.core.inventory.inventory.Inventory object at 0x148c7d100>)
390 :rtype: str or ``None``
391 :return: SEED RESP file as string if no ``filename`` is given..
392
393 .. rubric:: Example
394
395 >>> from obspy.clients.iris import Client
396 >>> from obspy import UTCDateTime
397 >>> client = Client()
398 >>> dt = UTCDateTime("2010-02-27T06:30:00.000")
399 >>> data = client.resp("IU", "ANMO", "00", "BHZ", dt)
UNEXPECTED EXCEPTION: Exception('No response data available (HTTPError: HTTP Error 500: )')
Traceback (most recent call last):
File "/Users/runner/miniconda3/envs/test/lib/python3.12/site-packages/obspy/clients/iris/client.py", line 437, in resp
data = self._fetch("resp", **kwargs)
^^^^^^^^^^^^^^^^^^^^^^^^^^^^^
File "/Users/runner/miniconda3/envs/test/lib/python3.12/site-packages/obspy/clients/iris/client.py", line 124, in _fetch
response = urllib_request.urlopen(req, timeout=self.timeout)
^^^^^^^^^^^^^^^^^^^^^^^^^^^^^^^^^^^^^^^^^^^^^^^^^
File "/Users/runner/miniconda3/envs/test/lib/python3.12/urllib/request.py", line 215, in urlopen
return opener.open(url, data, timeout)
^^^^^^^^^^^^^^^^^^^^^^^^^^^^^^^
File "/Users/runner/miniconda3/envs/test/lib/python3.12/urllib/request.py", line 521, in open
response = meth(req, response)
^^^^^^^^^^^^^^^^^^^
File "/Users/runner/miniconda3/envs/test/lib/python3.12/urllib/request.py", line 630, in http_response
response = self.parent.error(
^^^^^^^^^^^^^^^^^^
File "/Users/runner/miniconda3/envs/test/lib/python3.12/urllib/request.py", line 559, in error
return self._call_chain(*args)
^^^^^^^^^^^^^^^^^^^^^^^
File "/Users/runner/miniconda3/envs/test/lib/python3.12/urllib/request.py", line 492, in _call_chain
result = func(*args)
^^^^^^^^^^^
File "/Users/runner/miniconda3/envs/test/lib/python3.12/urllib/request.py", line 639, in http_error_default
raise HTTPError(req.full_url, code, msg, hdrs, fp)
urllib.error.HTTPError: HTTP Error 500:
During handling of the above exception, another exception occurred:
Traceback (most recent call last):
File "/Users/runner/miniconda3/envs/test/lib/python3.12/doctest.py", line 1361, in __run
exec(compile(example.source, filename, "single",
File "<doctest obspy.clients.iris.client.Client.resp[4]>", line 1, in <module>
File "/Users/runner/miniconda3/envs/test/lib/python3.12/site-packages/obspy/clients/iris/client.py", line 441, in resp
raise Exception(msg)
Exception: No response data available (HTTPError: HTTP Error 500: )
/Users/runner/miniconda3/envs/test/lib/python3.12/site-packages/obspy/clients/iris/client.py:399: UnexpectedException
200 Supports ``fnmatch`` wildcards, e.g. ``*`` and ``?``, in ``network``,
201 ``station``, ``location`` and ``channel``.
202
203 >>> client = Client('rtserver.ipgp.fr')
204 >>> info = client.get_info(station="FDFM")
205 >>> print(info)
206 [('G', 'FDFM')]
207 >>> info = client.get_info(station="FD?M", channel='*Z',
208 ... level='channel')
209 >>> print(info) # doctest: +NORMALIZE_WHITESPACE
Expected:
[('G', 'FDFM', '00', 'BHZ'), ('G', 'FDFM', '00', 'HHZ'),
('G', 'FDFM', '00', 'HNZ'), ('G', 'FDFM', '00', 'LHZ'),
('G', 'FDFM', '10', 'BHZ'), ('G', 'FDFM', '10', 'HHZ'),
('G', 'FDFM', '10', 'LHZ')]
Got:
[('G', 'FDFM', '00', 'BHZ'), ('G', 'FDFM', '00', 'HHZ'), ('G', 'FDFM', '00', 'HNZ'), ('G', 'FDFM', '00', 'LHZ')]
/Users/runner/miniconda3/envs/test/lib/python3.12/site-packages/obspy/clients/seedlink/basic_client.py:209: DocTestFailure
078 >>> print(st) # doctest: +ELLIPSIS
079 1 Trace(s) in Stream:
080 G.FDFM.00.BHZ | 20... | 20.0 Hz, ... samples
081
082 Most servers support '?' single-character wildcard in location and
083 channel code fields:
084
085 >>> st = client.get_waveforms("G", "FDFM", "??", "B??", t, t + 5)
086 >>> st = st.sort(reverse=True)
087 >>> print(st) # doctest: +ELLIPSIS
Differences (unified diff with -expected +actual):
@@ -1,7 +1,4 @@
-6 Trace(s) in Stream:
-G.FDFM.10.BHZ | 20... | 20.0 Hz, ... samples
-G.FDFM.10.BHN | 20... | 20.0 Hz, ... samples
-G.FDFM.10.BHE | 20... | 20.0 Hz, ... samples
-G.FDFM.00.BHZ | 20... | 20.0 Hz, ... samples
-G.FDFM.00.BHN | 20... | 20.0 Hz, ... samples
-G.FDFM.00.BHE | 20... | 20.0 Hz, ... samples
+3 Trace(s) in Stream:
+G.FDFM.00.BHZ | 2024-02-23T12:29:56.750000Z - 2024-02-23T12:30:01.750000Z | 20.0 Hz, 101 samples
+G.FDFM.00.BHN | 2024-02-23T12:29:56.750000Z - 2024-02-23T12:30:01.750000Z | 20.0 Hz, 101 samples
+G.FDFM.00.BHE | 2024-02-23T12:29:56.750000Z - 2024-02-23T12:30:01.750000Z | 20.0 Hz, 101 samples
/Users/runner/miniconda3/envs/test/lib/python3.12/site-packages/obspy/clients/seedlink/basic_client.py:87: DocTestFailure

Skipped tests (5)

Submodule Test Skip message
clients.fdsn clients/fdsn/tests/test_client.py::TestClient::test_trim_stream_after_get_waveform Skipped: data no longer available
clients.fdsn clients/fdsn/tests/test_client.py::TestClient::test_eida_token_resolution Skipped: Token is expired
clients.seedlink clients/seedlink/tests/test_slclient.py::TestSLClient::test_info Skipped: test must be started manually
clients.seedlink clients/seedlink/tests/test_slclient.py::TestSLClient::test_time_window Skipped: test must be started manually
clients.seedlink clients/seedlink/tests/test_slclient.py::TestSLClient::test_issue708 Skipped: test must be started manually

Slowest tests (20)

Runtime Test
14.828s clients/fdsn/tests/test_eidaws_routing_client.py::TestEIDAWSRoutingClient::test_get_waveforms_integration_test
8.589s clients/fdsn/tests/test_client.py::TestClient::test_dataselect_bulk
7.804s clients/syngine/tests/test_client.py::TestClient::test_get_available_models
7.263s clients/fdsn/tests/test_client.py::TestClient::test_irisph5_event
3.974s clients/fdsn/tests/test_client.py::TestClient::test_iris_example_queries_dataselect
3.621s clients/fdsn/tests/test_client.py::TestClient::test_iris_example_queries_dataselect_discover_services_false
3.406s clients/fdsn/tests/test_client.py::TestClient::test_redirection_auth
3.199s clients/seedlink/tests/test_basic_client.py::TestClient::test_multiple_waveform_requests_with_multiple_info_requests
2.938s clients/syngine/tests/test_client.py::TestClient::test_get_waveforms
2.845s clients/fdsn/tests/test_client.py::TestClient::test_redirection
2.836s clients/fdsn/client.py::obspy.clients.fdsn.client.Client.get_waveforms_bulk
2.677s clients/syngine/__init__.py::obspy.clients.syngine
2.092s clients/iris/tests/test_client.py::TestClient::test_resp
2.092s clients/fdsn/client.py::obspy.clients.fdsn.client.Client.get_waveforms
2.064s clients/iris/tests/test_client.py::TestClient::test_evalresp
2.063s clients/nrl/client.py::obspy.clients.nrl.client.NRL.get_response
2.039s clients/fdsn/tests/test_federator_routing_client.py::TestFederatorRoutingClient::test_get_waveforms_integration_test
2.036s clients/fdsn/__init__.py::obspy.clients.fdsn
1.735s clients/fdsn/tests/test_eidaws_routing_client.py::TestEIDAWSRoutingClient::test_get_stations_integration_test
1.714s clients/fdsn/tests/test_mass_downloader.py::TestDownloadHelper::test_download_method

Warnings (6)

Stage Filename Category Message
runtest /Users/runner/miniconda3/envs/test/lib/python3.12/site-packages/_pytest/threadexception.py:77 PytestUnhandledThreadExceptionWarning Exception in thread Thread-192 Traceback (most recent call last): File "/Users/runner/miniconda3/envs/test/lib/python3.12/threading.py", line 1073, in _bootstrap_inner self.run() File "/Users/runner/miniconda3/envs/test/lib/python3.12/site-packages/obspy/clients/fdsn/client.py", line 1543, in run code, data = download_url( ^^^^^^^^^^^^^ File "/Users/runner/miniconda3/envs/test/lib/python3.12/site-packages/obspy/clients/fdsn/client.py", line 1922, in download_url data = f.read() ^^^^^^^^ File "/Users/runner/miniconda3/envs/test/lib/python3.12/gzip.py", line 324, in read return self._buffer.read(size) ^^^^^^^^^^^^^^^^^^^^^^^ File "/Users/runner/miniconda3/envs/test/lib/python3.12/_compression.py", line 118, in readall while data := self.read(sys.maxsize): ^^^^^^^^^^^^^^^^^^^^^^ File "/Users/runner/miniconda3/envs/test/lib/python3.12/gzip.py", line 527, in read if not self._read_gzip_header(): ^^^^^^^^^^^^^^^^^^^^^^^^ File "/Users/runner/miniconda3/envs/test/lib/python3.12/gzip.py", line 496, in _read_gzip_header last_mtime = _read_gzip_header(self._fp) ^^^^^^^^^^^^^^^^^^^^^^^^^^^ File "/Users/runner/miniconda3/envs/test/lib/python3.12/gzip.py", line 456, in _read_gzip_header raise BadGzipFile('Not a gzipped file (%r)' % magic) gzip.BadGzipFile: Not a gzipped file (b'a\r')
runtest /Users/runner/miniconda3/envs/test/lib/python3.12/site-packages/obspy/clients/fdsn/routing/routing_client.py:99 UserWarning Failed to download data of type 'station' from 'http://service.iris.edu' due to: Traceback (most recent call last): File "/Users/runner/miniconda3/envs/test/lib/python3.12/site-packages/obspy/clients/fdsn/routing/routing_client.py", line 96, in _try_download_bulk return _download_bulk(r) ^^^^^^^^^^^^^^^^^ File "/Users/runner/miniconda3/envs/test/lib/python3.12/site-packages/obspy/clients/fdsn/routing/routing_client.py", line 131, in _download_bulk service = c.services["station"] ~~~~~~~~~~^^^^^^^^^^^ KeyError: 'station'
runtest /Users/runner/miniconda3/envs/test/lib/python3.12/site-packages/obspy/clients/fdsn/routing/routing_client.py:99 UserWarning Failed to download data of type 'waveform' from 'https://webservices.ingv.it' due to: Traceback (most recent call last): File "/Users/runner/miniconda3/envs/test/lib/python3.12/site-packages/obspy/clients/fdsn/routing/routing_client.py", line 96, in _try_download_bulk return _download_bulk(r) ^^^^^^^^^^^^^^^^^ File "/Users/runner/miniconda3/envs/test/lib/python3.12/site-packages/obspy/clients/fdsn/routing/routing_client.py", line 139, in _download_bulk return fct(bulk_str + r["bulk_str"]) ^^^^^^^^^^^^^^^^^^^^^^^^^^^^^ File "/Users/runner/miniconda3/envs/test/lib/python3.12/site-packages/obspy/clients/fdsn/client.py", line 1051, in get_waveforms_bulk data_stream = self._download( ^^^^^^^^^^^^^^^ File "/Users/runner/miniconda3/envs/test/lib/python3.12/site-packages/obspy/clients/fdsn/client.py", line 1486, in _download raise_on_error(code, data) File "/Users/runner/miniconda3/envs/test/lib/python3.12/site-packages/obspy/clients/fdsn/client.py", line 1802, in raise_on_error server_info = data.decode('ASCII', errors='ignore') ^^^^^^^^^^^ AttributeError: '_io.BytesIO' object has no attribute 'decode'
runtest /Users/runner/miniconda3/envs/test/lib/python3.12/site-packages/obspy/clients/fdsn/routing/routing_client.py:99 UserWarning Failed to download data of type 'station' from 'https://orfeus-eu.org' due to: Traceback (most recent call last): File "/Users/runner/miniconda3/envs/test/lib/python3.12/site-packages/obspy/clients/fdsn/routing/routing_client.py", line 96, in _try_download_bulk return _download_bulk(r) ^^^^^^^^^^^^^^^^^ File "/Users/runner/miniconda3/envs/test/lib/python3.12/site-packages/obspy/clients/fdsn/routing/routing_client.py", line 139, in _download_bulk return fct(bulk_str + r["bulk_str"]) ^^^^^^^^^^^^^^^^^^^^^^^^^^^^^ File "/Users/runner/miniconda3/envs/test/lib/python3.12/site-packages/obspy/clients/fdsn/client.py", line 1249, in get_stations_bulk data_stream = self._download( ^^^^^^^^^^^^^^^ File "/Users/runner/miniconda3/envs/test/lib/python3.12/site-packages/obspy/clients/fdsn/client.py", line 1486, in _download raise_on_error(code, data) File "/Users/runner/miniconda3/envs/test/lib/python3.12/site-packages/obspy/clients/fdsn/client.py", line 1802, in raise_on_error server_info = data.decode('ASCII', errors='ignore') ^^^^^^^^^^^ AttributeError: '_io.BytesIO' object has no attribute 'decode'
runtest /Users/runner/miniconda3/envs/test/lib/python3.12/site-packages/obspy/clients/fdsn/routing/routing_client.py:99 UserWarning Failed to download data of type 'waveform' from 'https://eida-sc3.infp.ro' due to: Traceback (most recent call last): File "/Users/runner/miniconda3/envs/test/lib/python3.12/site-packages/obspy/clients/fdsn/routing/routing_client.py", line 96, in _try_download_bulk return _download_bulk(r) ^^^^^^^^^^^^^^^^^ File "/Users/runner/miniconda3/envs/test/lib/python3.12/site-packages/obspy/clients/fdsn/routing/routing_client.py", line 139, in _download_bulk return fct(bulk_str + r["bulk_str"]) ^^^^^^^^^^^^^^^^^^^^^^^^^^^^^ File "/Users/runner/miniconda3/envs/test/lib/python3.12/site-packages/obspy/clients/fdsn/client.py", line 1051, in get_waveforms_bulk data_stream = self._download( ^^^^^^^^^^^^^^^ File "/Users/runner/miniconda3/envs/test/lib/python3.12/site-packages/obspy/clients/fdsn/client.py", line 1486, in _download raise_on_error(code, data) File "/Users/runner/miniconda3/envs/test/lib/python3.12/site-packages/obspy/clients/fdsn/client.py", line 1802, in raise_on_error server_info = data.decode('ASCII', errors='ignore') ^^^^^^^^^^^ AttributeError: '_io.BytesIO' object has no attribute 'decode'
runtest /Users/runner/miniconda3/envs/test/lib/python3.12/site-packages/_pytest/threadexception.py:77 PytestUnhandledThreadExceptionWarning Exception in thread Thread-103 Traceback (most recent call last): File "/Users/runner/miniconda3/envs/test/lib/python3.12/threading.py", line 1073, in _bootstrap_inner self.run() File "/Users/runner/miniconda3/envs/test/lib/python3.12/site-packages/obspy/clients/fdsn/client.py", line 1543, in run code, data = download_url( ^^^^^^^^^^ ValueError: not enough values to unpack (expected 2, got 0)