#137367 Report by node gh-actions covering 200 tests from 61 modules resulted into 17 errors

Report

ObsPy version
1.4.0.post0+332.ga357b34364.o…
GitHub Pull Request
-
Report file
JSON document
Total runtime
164.2 sec
Report date/time
Feb. 23, 2024, 6:57 a.m.

System / Python

Architecture
64bit
Machine
AMD64
Node
gh-actions
Processor
AMD64 Family 25 Model 1 Stepping 1, AuthenticAMD
Python Compiler
MSC v.1937 64 bit (AMD64)
Python Implementation
CPython
Python Version
3.12.2
Release
2022Server
System
Windows
Version
10.0.20348

Dependencies

cartopy
0.22.0
decorator
5.1.1
flake8
---
geographiclib
2.0
lxml
5.1.0
matplotlib
3.8.3
numpy
1.26.4
obspy
1.4.0.post0+332.ga357b34364.obspy.master
pyproj
3.6.1
pytest
8.0.1
pytest-json-report
1.5.0
requests
2.31.0
scipy
1.12.0
setuptools
69.1.0
shapefile
---
sqlalchemy
1.4.49

Modules (61)

Module Errors / Failures Tracebacks
obspy.clients.earthworm 1 1
obspy.clients.fdsn 13 2 3 4 5 6 7 8 9 10 11 12 13 14
obspy.clients.filesystem Not tested -
obspy.clients.iris 1 15
obspy.clients.neic - -
obspy.clients.nrl - -
obspy.clients.seedlink 2 16 17
obspy.clients.syngine - -
obspy.core - -
obspy.core.event Not tested -
obspy.core.inventory Not tested -
obspy.core.util Not tested -
obspy.geodetics Not tested -
obspy.imaging Not tested -
obspy.io.ah Not tested -
obspy.io.alsep Not tested -
obspy.io.arclink Not tested -
obspy.io.ascii Not tested -
obspy.io.cmtsolution Not tested -
obspy.io.cnv Not tested -
obspy.io.css Not tested -
obspy.io.csv Not tested -
obspy.io.cybershake Not tested -
obspy.io.dmx Not tested -
obspy.io.focmec Not tested -
obspy.io.gcf Not tested -
obspy.io.gse2 Not tested -
obspy.io.hypodd Not tested -
obspy.io.iaspei Not tested -
obspy.io.json Not tested -
obspy.io.kinemetrics Not tested -
obspy.io.kml Not tested -
obspy.io.mseed Not tested -
obspy.io.ndk Not tested -
obspy.io.nied Not tested -
obspy.io.nlloc Not tested -
obspy.io.nordic Not tested -
obspy.io.pdas Not tested -
obspy.io.pde Not tested -
obspy.io.quakeml Not tested -
obspy.io.reftek Not tested -
obspy.io.rg16 Not tested -
obspy.io.sac Not tested -
obspy.io.scardec Not tested -
obspy.io.seg2 Not tested -
obspy.io.segy Not tested -
obspy.io.seisan Not tested -
obspy.io.seiscomp Not tested -
obspy.io.sh Not tested -
obspy.io.shapefile Not tested -
obspy.io.stationtxt Not tested -
obspy.io.stationxml Not tested -
obspy.io.wav Not tested -
obspy.io.win Not tested -
obspy.io.xseed Not tested -
obspy.io.y Not tested -
obspy.io.zmap Not tested -
obspy.realtime Not tested -
obspy.scripts Not tested -
obspy.signal Not tested -
obspy.taup Not tested -
Summary 17 17

Tracebacks (17)

Traceback (most recent call last):
File "C:\Miniconda3\envs\test\Lib\site-packages\_pytest\runner.py", line 346, in from_call
result: Optional[TResult] = func()
^^^^^^
File "C:\Miniconda3\envs\test\Lib\site-packages\_pytest\runner.py", line 267, in <lambda>
lambda: ihook(item=item, **kwds), when=when, reraise=reraise
^^^^^^^^^^^^^^^^^^^^^^^^
File "C:\Miniconda3\envs\test\Lib\site-packages\pluggy\_hooks.py", line 501, in __call__
return self._hookexec(self.name, self._hookimpls.copy(), kwargs, firstresult)
^^^^^^^^^^^^^^^^^^^^^^^^^^^^^^^^^^^^^^^^^^^^^^^^^^^^^^^^^^^^^^^^^^^^^^
File "C:\Miniconda3\envs\test\Lib\site-packages\pluggy\_manager.py", line 119, in _hookexec
return self._inner_hookexec(hook_name, methods, kwargs, firstresult)
^^^^^^^^^^^^^^^^^^^^^^^^^^^^^^^^^^^^^^^^^^^^^^^^^^^^^^^^^^^^^
File "C:\Miniconda3\envs\test\Lib\site-packages\pluggy\_callers.py", line 181, in _multicall
return outcome.get_result()
^^^^^^^^^^^^^^^^^^^^
File "C:\Miniconda3\envs\test\Lib\site-packages\pluggy\_result.py", line 99, in get_result
raise exc.with_traceback(exc.__traceback__)
File "C:\Miniconda3\envs\test\Lib\site-packages\pluggy\_callers.py", line 166, in _multicall
teardown.throw(outcome._exception)
File "C:\Miniconda3\envs\test\Lib\site-packages\_pytest\threadexception.py", line 87, in pytest_runtest_call
yield from thread_exception_runtest_hook()
File "C:\Miniconda3\envs\test\Lib\site-packages\_pytest\threadexception.py", line 63, in thread_exception_runtest_hook
yield
File "C:\Miniconda3\envs\test\Lib\site-packages\pluggy\_callers.py", line 166, in _multicall
teardown.throw(outcome._exception)
File "C:\Miniconda3\envs\test\Lib\site-packages\_pytest\unraisableexception.py", line 90, in pytest_runtest_call
yield from unraisable_exception_runtest_hook()
File "C:\Miniconda3\envs\test\Lib\site-packages\_pytest\unraisableexception.py", line 65, in unraisable_exception_runtest_hook
yield
File "C:\Miniconda3\envs\test\Lib\site-packages\pluggy\_callers.py", line 166, in _multicall
teardown.throw(outcome._exception)
File "C:\Miniconda3\envs\test\Lib\site-packages\_pytest\logging.py", line 839, in pytest_runtest_call
yield from self._runtest_for(item, "call")
File "C:\Miniconda3\envs\test\Lib\site-packages\_pytest\logging.py", line 822, in _runtest_for
yield
File "C:\Miniconda3\envs\test\Lib\site-packages\pluggy\_callers.py", line 166, in _multicall
teardown.throw(outcome._exception)
File "C:\Miniconda3\envs\test\Lib\site-packages\_pytest\capture.py", line 882, in pytest_runtest_call
return (yield)
^^^^^
File "C:\Miniconda3\envs\test\Lib\site-packages\pluggy\_callers.py", line 166, in _multicall
teardown.throw(outcome._exception)
File "C:\Miniconda3\envs\test\Lib\site-packages\_pytest\skipping.py", line 256, in pytest_runtest_call
return (yield)
^^^^^
File "C:\Miniconda3\envs\test\Lib\site-packages\pluggy\_callers.py", line 102, in _multicall
res = hook_impl.function(*args)
^^^^^^^^^^^^^^^^^^^^^^^^^
File "C:\Miniconda3\envs\test\Lib\site-packages\_pytest\runner.py", line 182, in pytest_runtest_call
raise e
File "C:\Miniconda3\envs\test\Lib\site-packages\_pytest\runner.py", line 174, in pytest_runtest_call
item.runtest()
File "C:\Miniconda3\envs\test\Lib\site-packages\_pytest\python.py", line 1831, in runtest
self.ihook.pytest_pyfunc_call(pyfuncitem=self)
File "C:\Miniconda3\envs\test\Lib\site-packages\pluggy\_hooks.py", line 501, in __call__
return self._hookexec(self.name, self._hookimpls.copy(), kwargs, firstresult)
^^^^^^^^^^^^^^^^^^^^^^^^^^^^^^^^^^^^^^^^^^^^^^^^^^^^^^^^^^^^^^^^^^^^^^
File "C:\Miniconda3\envs\test\Lib\site-packages\pluggy\_manager.py", line 119, in _hookexec
return self._inner_hookexec(hook_name, methods, kwargs, firstresult)
^^^^^^^^^^^^^^^^^^^^^^^^^^^^^^^^^^^^^^^^^^^^^^^^^^^^^^^^^^^^^
File "C:\Miniconda3\envs\test\Lib\site-packages\pluggy\_callers.py", line 138, in _multicall
raise exception.with_traceback(exception.__traceback__)
File "C:\Miniconda3\envs\test\Lib\site-packages\pluggy\_callers.py", line 102, in _multicall
res = hook_impl.function(*args)
^^^^^^^^^^^^^^^^^^^^^^^^^
File "C:\Miniconda3\envs\test\Lib\site-packages\_pytest\python.py", line 194, in pytest_pyfunc_call
result = testfunction(**testargs)
^^^^^^^^^^^^^^^^^^^^^^^^
File "C:\Miniconda3\envs\test\Lib\site-packages\decorator.py", line 232, in fun
return caller(func, *(extras + args), **kw)
^^^^^^^^^^^^^^^^^^^^^^^^^^^^^^^^^^^^
File "C:\Miniconda3\envs\test\Lib\site-packages\obspy\core\util\decorator.py", line 119, in skip_on_network_error
return func(*args, **kwargs)
^^^^^^^^^^^^^^^^^^^^^
File "C:\Miniconda3\envs\test\Lib\site-packages\obspy\clients\earthworm\tests\test_client.py", line 111, in test_get_waveform_no_cleanup
assert len(ew_stream) >= 2
AssertionError: assert 1 >= 2
+ where 1 = len(<obspy.core.stream.Stream object at 0x0000024BD64E3260>)
Traceback (most recent call last):
File "C:\Miniconda3\envs\test\Lib\site-packages\_pytest\runner.py", line 346, in from_call
result: Optional[TResult] = func()
^^^^^^
File "C:\Miniconda3\envs\test\Lib\site-packages\_pytest\runner.py", line 267, in <lambda>
lambda: ihook(item=item, **kwds), when=when, reraise=reraise
^^^^^^^^^^^^^^^^^^^^^^^^
File "C:\Miniconda3\envs\test\Lib\site-packages\pluggy\_hooks.py", line 501, in __call__
return self._hookexec(self.name, self._hookimpls.copy(), kwargs, firstresult)
^^^^^^^^^^^^^^^^^^^^^^^^^^^^^^^^^^^^^^^^^^^^^^^^^^^^^^^^^^^^^^^^^^^^^^
File "C:\Miniconda3\envs\test\Lib\site-packages\pluggy\_manager.py", line 119, in _hookexec
return self._inner_hookexec(hook_name, methods, kwargs, firstresult)
^^^^^^^^^^^^^^^^^^^^^^^^^^^^^^^^^^^^^^^^^^^^^^^^^^^^^^^^^^^^^
File "C:\Miniconda3\envs\test\Lib\site-packages\pluggy\_callers.py", line 181, in _multicall
return outcome.get_result()
^^^^^^^^^^^^^^^^^^^^
File "C:\Miniconda3\envs\test\Lib\site-packages\pluggy\_result.py", line 99, in get_result
raise exc.with_traceback(exc.__traceback__)
File "C:\Miniconda3\envs\test\Lib\site-packages\pluggy\_callers.py", line 166, in _multicall
teardown.throw(outcome._exception)
File "C:\Miniconda3\envs\test\Lib\site-packages\_pytest\threadexception.py", line 87, in pytest_runtest_call
yield from thread_exception_runtest_hook()
File "C:\Miniconda3\envs\test\Lib\site-packages\_pytest\threadexception.py", line 63, in thread_exception_runtest_hook
yield
File "C:\Miniconda3\envs\test\Lib\site-packages\pluggy\_callers.py", line 166, in _multicall
teardown.throw(outcome._exception)
File "C:\Miniconda3\envs\test\Lib\site-packages\_pytest\unraisableexception.py", line 90, in pytest_runtest_call
yield from unraisable_exception_runtest_hook()
File "C:\Miniconda3\envs\test\Lib\site-packages\_pytest\unraisableexception.py", line 65, in unraisable_exception_runtest_hook
yield
File "C:\Miniconda3\envs\test\Lib\site-packages\pluggy\_callers.py", line 166, in _multicall
teardown.throw(outcome._exception)
File "C:\Miniconda3\envs\test\Lib\site-packages\_pytest\logging.py", line 839, in pytest_runtest_call
yield from self._runtest_for(item, "call")
File "C:\Miniconda3\envs\test\Lib\site-packages\_pytest\logging.py", line 822, in _runtest_for
yield
File "C:\Miniconda3\envs\test\Lib\site-packages\pluggy\_callers.py", line 166, in _multicall
teardown.throw(outcome._exception)
File "C:\Miniconda3\envs\test\Lib\site-packages\_pytest\capture.py", line 882, in pytest_runtest_call
return (yield)
^^^^^
File "C:\Miniconda3\envs\test\Lib\site-packages\pluggy\_callers.py", line 166, in _multicall
teardown.throw(outcome._exception)
File "C:\Miniconda3\envs\test\Lib\site-packages\_pytest\skipping.py", line 256, in pytest_runtest_call
return (yield)
^^^^^
File "C:\Miniconda3\envs\test\Lib\site-packages\pluggy\_callers.py", line 102, in _multicall
res = hook_impl.function(*args)
^^^^^^^^^^^^^^^^^^^^^^^^^
File "C:\Miniconda3\envs\test\Lib\site-packages\_pytest\runner.py", line 182, in pytest_runtest_call
raise e
File "C:\Miniconda3\envs\test\Lib\site-packages\_pytest\runner.py", line 174, in pytest_runtest_call
item.runtest()
File "C:\Miniconda3\envs\test\Lib\site-packages\_pytest\python.py", line 1831, in runtest
self.ihook.pytest_pyfunc_call(pyfuncitem=self)
File "C:\Miniconda3\envs\test\Lib\site-packages\pluggy\_hooks.py", line 501, in __call__
return self._hookexec(self.name, self._hookimpls.copy(), kwargs, firstresult)
^^^^^^^^^^^^^^^^^^^^^^^^^^^^^^^^^^^^^^^^^^^^^^^^^^^^^^^^^^^^^^^^^^^^^^
File "C:\Miniconda3\envs\test\Lib\site-packages\pluggy\_manager.py", line 119, in _hookexec
return self._inner_hookexec(hook_name, methods, kwargs, firstresult)
^^^^^^^^^^^^^^^^^^^^^^^^^^^^^^^^^^^^^^^^^^^^^^^^^^^^^^^^^^^^^
File "C:\Miniconda3\envs\test\Lib\site-packages\pluggy\_callers.py", line 138, in _multicall
raise exception.with_traceback(exception.__traceback__)
File "C:\Miniconda3\envs\test\Lib\site-packages\pluggy\_callers.py", line 102, in _multicall
res = hook_impl.function(*args)
^^^^^^^^^^^^^^^^^^^^^^^^^
File "C:\Miniconda3\envs\test\Lib\site-packages\_pytest\python.py", line 194, in pytest_pyfunc_call
result = testfunction(**testargs)
^^^^^^^^^^^^^^^^^^^^^^^^
File "C:\Miniconda3\envs\test\Lib\site-packages\obspy\clients\fdsn\tests\test_client.py", line 382, in test_iris_event_catalog_availability
assert {*self.client.services["available_event_catalogs"]} == \
AssertionError: assert {'GCMT\n ', '...'NEIC PDE\n '} == {'GCMT', 'ISC', 'NEIC PDE'}
Extra items in the left set:
'GCMT\n '
'ISC\n '
'NEIC PDE\n '
Extra items in the right set:
'NEIC PDE'
'ISC'
'GCMT'
Full diff:
{
- 'GCMT',
? -
+ 'GCMT\n'
? ++
+ ' ',
- 'ISC',
? -
+ 'ISC\n'
? ++
+ ' ',
- 'NEIC PDE',
? -
+ 'NEIC PDE\n'
? ++
+ ' ',
}
Traceback (most recent call last):
File "C:\Miniconda3\envs\test\Lib\site-packages\_pytest\runner.py", line 346, in from_call
result: Optional[TResult] = func()
^^^^^^
File "C:\Miniconda3\envs\test\Lib\site-packages\_pytest\runner.py", line 267, in <lambda>
lambda: ihook(item=item, **kwds), when=when, reraise=reraise
^^^^^^^^^^^^^^^^^^^^^^^^
File "C:\Miniconda3\envs\test\Lib\site-packages\pluggy\_hooks.py", line 501, in __call__
return self._hookexec(self.name, self._hookimpls.copy(), kwargs, firstresult)
^^^^^^^^^^^^^^^^^^^^^^^^^^^^^^^^^^^^^^^^^^^^^^^^^^^^^^^^^^^^^^^^^^^^^^
File "C:\Miniconda3\envs\test\Lib\site-packages\pluggy\_manager.py", line 119, in _hookexec
return self._inner_hookexec(hook_name, methods, kwargs, firstresult)
^^^^^^^^^^^^^^^^^^^^^^^^^^^^^^^^^^^^^^^^^^^^^^^^^^^^^^^^^^^^^
File "C:\Miniconda3\envs\test\Lib\site-packages\pluggy\_callers.py", line 181, in _multicall
return outcome.get_result()
^^^^^^^^^^^^^^^^^^^^
File "C:\Miniconda3\envs\test\Lib\site-packages\pluggy\_result.py", line 99, in get_result
raise exc.with_traceback(exc.__traceback__)
File "C:\Miniconda3\envs\test\Lib\site-packages\pluggy\_callers.py", line 166, in _multicall
teardown.throw(outcome._exception)
File "C:\Miniconda3\envs\test\Lib\site-packages\_pytest\threadexception.py", line 87, in pytest_runtest_call
yield from thread_exception_runtest_hook()
File "C:\Miniconda3\envs\test\Lib\site-packages\_pytest\threadexception.py", line 63, in thread_exception_runtest_hook
yield
File "C:\Miniconda3\envs\test\Lib\site-packages\pluggy\_callers.py", line 166, in _multicall
teardown.throw(outcome._exception)
File "C:\Miniconda3\envs\test\Lib\site-packages\_pytest\unraisableexception.py", line 90, in pytest_runtest_call
yield from unraisable_exception_runtest_hook()
File "C:\Miniconda3\envs\test\Lib\site-packages\_pytest\unraisableexception.py", line 65, in unraisable_exception_runtest_hook
yield
File "C:\Miniconda3\envs\test\Lib\site-packages\pluggy\_callers.py", line 166, in _multicall
teardown.throw(outcome._exception)
File "C:\Miniconda3\envs\test\Lib\site-packages\_pytest\logging.py", line 839, in pytest_runtest_call
yield from self._runtest_for(item, "call")
File "C:\Miniconda3\envs\test\Lib\site-packages\_pytest\logging.py", line 822, in _runtest_for
yield
File "C:\Miniconda3\envs\test\Lib\site-packages\pluggy\_callers.py", line 166, in _multicall
teardown.throw(outcome._exception)
File "C:\Miniconda3\envs\test\Lib\site-packages\_pytest\capture.py", line 882, in pytest_runtest_call
return (yield)
^^^^^
File "C:\Miniconda3\envs\test\Lib\site-packages\pluggy\_callers.py", line 166, in _multicall
teardown.throw(outcome._exception)
File "C:\Miniconda3\envs\test\Lib\site-packages\_pytest\skipping.py", line 256, in pytest_runtest_call
return (yield)
^^^^^
File "C:\Miniconda3\envs\test\Lib\site-packages\pluggy\_callers.py", line 102, in _multicall
res = hook_impl.function(*args)
^^^^^^^^^^^^^^^^^^^^^^^^^
File "C:\Miniconda3\envs\test\Lib\site-packages\_pytest\runner.py", line 182, in pytest_runtest_call
raise e
File "C:\Miniconda3\envs\test\Lib\site-packages\_pytest\runner.py", line 174, in pytest_runtest_call
item.runtest()
File "C:\Miniconda3\envs\test\Lib\site-packages\_pytest\python.py", line 1831, in runtest
self.ihook.pytest_pyfunc_call(pyfuncitem=self)
File "C:\Miniconda3\envs\test\Lib\site-packages\pluggy\_hooks.py", line 501, in __call__
return self._hookexec(self.name, self._hookimpls.copy(), kwargs, firstresult)
^^^^^^^^^^^^^^^^^^^^^^^^^^^^^^^^^^^^^^^^^^^^^^^^^^^^^^^^^^^^^^^^^^^^^^
File "C:\Miniconda3\envs\test\Lib\site-packages\pluggy\_manager.py", line 119, in _hookexec
return self._inner_hookexec(hook_name, methods, kwargs, firstresult)
^^^^^^^^^^^^^^^^^^^^^^^^^^^^^^^^^^^^^^^^^^^^^^^^^^^^^^^^^^^^^
File "C:\Miniconda3\envs\test\Lib\site-packages\pluggy\_callers.py", line 138, in _multicall
raise exception.with_traceback(exception.__traceback__)
File "C:\Miniconda3\envs\test\Lib\site-packages\pluggy\_callers.py", line 102, in _multicall
res = hook_impl.function(*args)
^^^^^^^^^^^^^^^^^^^^^^^^^
File "C:\Miniconda3\envs\test\Lib\site-packages\_pytest\python.py", line 194, in pytest_pyfunc_call
result = testfunction(**testargs)
^^^^^^^^^^^^^^^^^^^^^^^^
File "C:\Miniconda3\envs\test\Lib\site-packages\obspy\clients\fdsn\tests\test_client.py", line 814, in test_help_function_with_iris
assert got[-2].startswith('Available catalogs:')
AssertionError: assert False
+ where False = <built-in method startswith of str object at 0x0000024BDC9E6880>('Available catalogs:')
+ where <built-in method startswith of str object at 0x0000024BDC9E6880> = 'ott'.startswith
Traceback (most recent call last):
File "C:\Miniconda3\envs\test\Lib\site-packages\_pytest\runner.py", line 346, in from_call
result: Optional[TResult] = func()
^^^^^^
File "C:\Miniconda3\envs\test\Lib\site-packages\_pytest\runner.py", line 267, in <lambda>
lambda: ihook(item=item, **kwds), when=when, reraise=reraise
^^^^^^^^^^^^^^^^^^^^^^^^
File "C:\Miniconda3\envs\test\Lib\site-packages\pluggy\_hooks.py", line 501, in __call__
return self._hookexec(self.name, self._hookimpls.copy(), kwargs, firstresult)
^^^^^^^^^^^^^^^^^^^^^^^^^^^^^^^^^^^^^^^^^^^^^^^^^^^^^^^^^^^^^^^^^^^^^^
File "C:\Miniconda3\envs\test\Lib\site-packages\pluggy\_manager.py", line 119, in _hookexec
return self._inner_hookexec(hook_name, methods, kwargs, firstresult)
^^^^^^^^^^^^^^^^^^^^^^^^^^^^^^^^^^^^^^^^^^^^^^^^^^^^^^^^^^^^^
File "C:\Miniconda3\envs\test\Lib\site-packages\pluggy\_callers.py", line 181, in _multicall
return outcome.get_result()
^^^^^^^^^^^^^^^^^^^^
File "C:\Miniconda3\envs\test\Lib\site-packages\pluggy\_result.py", line 99, in get_result
raise exc.with_traceback(exc.__traceback__)
File "C:\Miniconda3\envs\test\Lib\site-packages\pluggy\_callers.py", line 166, in _multicall
teardown.throw(outcome._exception)
File "C:\Miniconda3\envs\test\Lib\site-packages\_pytest\threadexception.py", line 87, in pytest_runtest_call
yield from thread_exception_runtest_hook()
File "C:\Miniconda3\envs\test\Lib\site-packages\_pytest\threadexception.py", line 63, in thread_exception_runtest_hook
yield
File "C:\Miniconda3\envs\test\Lib\site-packages\pluggy\_callers.py", line 166, in _multicall
teardown.throw(outcome._exception)
File "C:\Miniconda3\envs\test\Lib\site-packages\_pytest\unraisableexception.py", line 90, in pytest_runtest_call
yield from unraisable_exception_runtest_hook()
File "C:\Miniconda3\envs\test\Lib\site-packages\_pytest\unraisableexception.py", line 65, in unraisable_exception_runtest_hook
yield
File "C:\Miniconda3\envs\test\Lib\site-packages\pluggy\_callers.py", line 166, in _multicall
teardown.throw(outcome._exception)
File "C:\Miniconda3\envs\test\Lib\site-packages\_pytest\logging.py", line 839, in pytest_runtest_call
yield from self._runtest_for(item, "call")
File "C:\Miniconda3\envs\test\Lib\site-packages\_pytest\logging.py", line 822, in _runtest_for
yield
File "C:\Miniconda3\envs\test\Lib\site-packages\pluggy\_callers.py", line 166, in _multicall
teardown.throw(outcome._exception)
File "C:\Miniconda3\envs\test\Lib\site-packages\_pytest\capture.py", line 882, in pytest_runtest_call
return (yield)
^^^^^
File "C:\Miniconda3\envs\test\Lib\site-packages\pluggy\_callers.py", line 166, in _multicall
teardown.throw(outcome._exception)
File "C:\Miniconda3\envs\test\Lib\site-packages\_pytest\skipping.py", line 256, in pytest_runtest_call
return (yield)
^^^^^
File "C:\Miniconda3\envs\test\Lib\site-packages\pluggy\_callers.py", line 102, in _multicall
res = hook_impl.function(*args)
^^^^^^^^^^^^^^^^^^^^^^^^^
File "C:\Miniconda3\envs\test\Lib\site-packages\_pytest\runner.py", line 182, in pytest_runtest_call
raise e
File "C:\Miniconda3\envs\test\Lib\site-packages\_pytest\runner.py", line 174, in pytest_runtest_call
item.runtest()
File "C:\Miniconda3\envs\test\Lib\site-packages\_pytest\python.py", line 1831, in runtest
self.ihook.pytest_pyfunc_call(pyfuncitem=self)
File "C:\Miniconda3\envs\test\Lib\site-packages\pluggy\_hooks.py", line 501, in __call__
return self._hookexec(self.name, self._hookimpls.copy(), kwargs, firstresult)
^^^^^^^^^^^^^^^^^^^^^^^^^^^^^^^^^^^^^^^^^^^^^^^^^^^^^^^^^^^^^^^^^^^^^^
File "C:\Miniconda3\envs\test\Lib\site-packages\pluggy\_manager.py", line 119, in _hookexec
return self._inner_hookexec(hook_name, methods, kwargs, firstresult)
^^^^^^^^^^^^^^^^^^^^^^^^^^^^^^^^^^^^^^^^^^^^^^^^^^^^^^^^^^^^^
File "C:\Miniconda3\envs\test\Lib\site-packages\pluggy\_callers.py", line 138, in _multicall
raise exception.with_traceback(exception.__traceback__)
File "C:\Miniconda3\envs\test\Lib\site-packages\pluggy\_callers.py", line 102, in _multicall
res = hook_impl.function(*args)
^^^^^^^^^^^^^^^^^^^^^^^^^
File "C:\Miniconda3\envs\test\Lib\site-packages\_pytest\python.py", line 194, in pytest_pyfunc_call
result = testfunction(**testargs)
^^^^^^^^^^^^^^^^^^^^^^^^
File "C:\Miniconda3\envs\test\Lib\unittest\mock.py", line 1387, in patched
return func(*newargs, **newkeywargs)
^^^^^^^^^^^^^^^^^^^^^^^^^^^^^
File "C:\Miniconda3\envs\test\Lib\site-packages\obspy\clients\fdsn\tests\test_client.py", line 1428, in test_no_data_exception
self.client.get_stations()
File "C:\Miniconda3\envs\test\Lib\site-packages\obspy\clients\fdsn\client.py", line 748, in get_stations
data_stream = self._download(url)
^^^^^^^^^^^^^^^^^^^
File "C:\Miniconda3\envs\test\Lib\site-packages\obspy\clients\fdsn\client.py", line 1486, in _download
raise_on_error(code, data)
File "C:\Miniconda3\envs\test\Lib\site-packages\obspy\clients\fdsn\client.py", line 1802, in raise_on_error
server_info = data.decode('ASCII', errors='ignore')
^^^^^^^^^^^
AttributeError: 'NoneType' object has no attribute 'decode'
Traceback (most recent call last):
File "C:\Miniconda3\envs\test\Lib\site-packages\_pytest\runner.py", line 346, in from_call
result: Optional[TResult] = func()
^^^^^^
File "C:\Miniconda3\envs\test\Lib\site-packages\_pytest\runner.py", line 267, in <lambda>
lambda: ihook(item=item, **kwds), when=when, reraise=reraise
^^^^^^^^^^^^^^^^^^^^^^^^
File "C:\Miniconda3\envs\test\Lib\site-packages\pluggy\_hooks.py", line 501, in __call__
return self._hookexec(self.name, self._hookimpls.copy(), kwargs, firstresult)
^^^^^^^^^^^^^^^^^^^^^^^^^^^^^^^^^^^^^^^^^^^^^^^^^^^^^^^^^^^^^^^^^^^^^^
File "C:\Miniconda3\envs\test\Lib\site-packages\pluggy\_manager.py", line 119, in _hookexec
return self._inner_hookexec(hook_name, methods, kwargs, firstresult)
^^^^^^^^^^^^^^^^^^^^^^^^^^^^^^^^^^^^^^^^^^^^^^^^^^^^^^^^^^^^^
File "C:\Miniconda3\envs\test\Lib\site-packages\pluggy\_callers.py", line 181, in _multicall
return outcome.get_result()
^^^^^^^^^^^^^^^^^^^^
File "C:\Miniconda3\envs\test\Lib\site-packages\pluggy\_result.py", line 99, in get_result
raise exc.with_traceback(exc.__traceback__)
File "C:\Miniconda3\envs\test\Lib\site-packages\pluggy\_callers.py", line 166, in _multicall
teardown.throw(outcome._exception)
File "C:\Miniconda3\envs\test\Lib\site-packages\_pytest\threadexception.py", line 87, in pytest_runtest_call
yield from thread_exception_runtest_hook()
File "C:\Miniconda3\envs\test\Lib\site-packages\_pytest\threadexception.py", line 63, in thread_exception_runtest_hook
yield
File "C:\Miniconda3\envs\test\Lib\site-packages\pluggy\_callers.py", line 166, in _multicall
teardown.throw(outcome._exception)
File "C:\Miniconda3\envs\test\Lib\site-packages\_pytest\unraisableexception.py", line 90, in pytest_runtest_call
yield from unraisable_exception_runtest_hook()
File "C:\Miniconda3\envs\test\Lib\site-packages\_pytest\unraisableexception.py", line 65, in unraisable_exception_runtest_hook
yield
File "C:\Miniconda3\envs\test\Lib\site-packages\pluggy\_callers.py", line 166, in _multicall
teardown.throw(outcome._exception)
File "C:\Miniconda3\envs\test\Lib\site-packages\_pytest\logging.py", line 839, in pytest_runtest_call
yield from self._runtest_for(item, "call")
File "C:\Miniconda3\envs\test\Lib\site-packages\_pytest\logging.py", line 822, in _runtest_for
yield
File "C:\Miniconda3\envs\test\Lib\site-packages\pluggy\_callers.py", line 166, in _multicall
teardown.throw(outcome._exception)
File "C:\Miniconda3\envs\test\Lib\site-packages\_pytest\capture.py", line 882, in pytest_runtest_call
return (yield)
^^^^^
File "C:\Miniconda3\envs\test\Lib\site-packages\pluggy\_callers.py", line 166, in _multicall
teardown.throw(outcome._exception)
File "C:\Miniconda3\envs\test\Lib\site-packages\_pytest\skipping.py", line 256, in pytest_runtest_call
return (yield)
^^^^^
File "C:\Miniconda3\envs\test\Lib\site-packages\pluggy\_callers.py", line 102, in _multicall
res = hook_impl.function(*args)
^^^^^^^^^^^^^^^^^^^^^^^^^
File "C:\Miniconda3\envs\test\Lib\site-packages\_pytest\runner.py", line 182, in pytest_runtest_call
raise e
File "C:\Miniconda3\envs\test\Lib\site-packages\_pytest\runner.py", line 174, in pytest_runtest_call
item.runtest()
File "C:\Miniconda3\envs\test\Lib\site-packages\_pytest\python.py", line 1831, in runtest
self.ihook.pytest_pyfunc_call(pyfuncitem=self)
File "C:\Miniconda3\envs\test\Lib\site-packages\pluggy\_hooks.py", line 501, in __call__
return self._hookexec(self.name, self._hookimpls.copy(), kwargs, firstresult)
^^^^^^^^^^^^^^^^^^^^^^^^^^^^^^^^^^^^^^^^^^^^^^^^^^^^^^^^^^^^^^^^^^^^^^
File "C:\Miniconda3\envs\test\Lib\site-packages\pluggy\_manager.py", line 119, in _hookexec
return self._inner_hookexec(hook_name, methods, kwargs, firstresult)
^^^^^^^^^^^^^^^^^^^^^^^^^^^^^^^^^^^^^^^^^^^^^^^^^^^^^^^^^^^^^
File "C:\Miniconda3\envs\test\Lib\site-packages\pluggy\_callers.py", line 138, in _multicall
raise exception.with_traceback(exception.__traceback__)
File "C:\Miniconda3\envs\test\Lib\site-packages\pluggy\_callers.py", line 102, in _multicall
res = hook_impl.function(*args)
^^^^^^^^^^^^^^^^^^^^^^^^^
File "C:\Miniconda3\envs\test\Lib\site-packages\_pytest\python.py", line 194, in pytest_pyfunc_call
result = testfunction(**testargs)
^^^^^^^^^^^^^^^^^^^^^^^^
File "C:\Miniconda3\envs\test\Lib\unittest\mock.py", line 1387, in patched
return func(*newargs, **newkeywargs)
^^^^^^^^^^^^^^^^^^^^^^^^^^^^^
File "C:\Miniconda3\envs\test\Lib\site-packages\obspy\clients\fdsn\tests\test_client.py", line 1438, in test_request_too_large_exception
self.client.get_stations()
File "C:\Miniconda3\envs\test\Lib\site-packages\obspy\clients\fdsn\client.py", line 748, in get_stations
data_stream = self._download(url)
^^^^^^^^^^^^^^^^^^^
File "C:\Miniconda3\envs\test\Lib\site-packages\obspy\clients\fdsn\client.py", line 1486, in _download
raise_on_error(code, data)
File "C:\Miniconda3\envs\test\Lib\site-packages\obspy\clients\fdsn\client.py", line 1802, in raise_on_error
server_info = data.decode('ASCII', errors='ignore')
^^^^^^^^^^^
AttributeError: 'NoneType' object has no attribute 'decode'
Traceback (most recent call last):
File "C:\Miniconda3\envs\test\Lib\site-packages\_pytest\runner.py", line 346, in from_call
result: Optional[TResult] = func()
^^^^^^
File "C:\Miniconda3\envs\test\Lib\site-packages\_pytest\runner.py", line 267, in <lambda>
lambda: ihook(item=item, **kwds), when=when, reraise=reraise
^^^^^^^^^^^^^^^^^^^^^^^^
File "C:\Miniconda3\envs\test\Lib\site-packages\pluggy\_hooks.py", line 501, in __call__
return self._hookexec(self.name, self._hookimpls.copy(), kwargs, firstresult)
^^^^^^^^^^^^^^^^^^^^^^^^^^^^^^^^^^^^^^^^^^^^^^^^^^^^^^^^^^^^^^^^^^^^^^
File "C:\Miniconda3\envs\test\Lib\site-packages\pluggy\_manager.py", line 119, in _hookexec
return self._inner_hookexec(hook_name, methods, kwargs, firstresult)
^^^^^^^^^^^^^^^^^^^^^^^^^^^^^^^^^^^^^^^^^^^^^^^^^^^^^^^^^^^^^
File "C:\Miniconda3\envs\test\Lib\site-packages\pluggy\_callers.py", line 181, in _multicall
return outcome.get_result()
^^^^^^^^^^^^^^^^^^^^
File "C:\Miniconda3\envs\test\Lib\site-packages\pluggy\_result.py", line 99, in get_result
raise exc.with_traceback(exc.__traceback__)
File "C:\Miniconda3\envs\test\Lib\site-packages\pluggy\_callers.py", line 166, in _multicall
teardown.throw(outcome._exception)
File "C:\Miniconda3\envs\test\Lib\site-packages\_pytest\threadexception.py", line 87, in pytest_runtest_call
yield from thread_exception_runtest_hook()
File "C:\Miniconda3\envs\test\Lib\site-packages\_pytest\threadexception.py", line 63, in thread_exception_runtest_hook
yield
File "C:\Miniconda3\envs\test\Lib\site-packages\pluggy\_callers.py", line 166, in _multicall
teardown.throw(outcome._exception)
File "C:\Miniconda3\envs\test\Lib\site-packages\_pytest\unraisableexception.py", line 90, in pytest_runtest_call
yield from unraisable_exception_runtest_hook()
File "C:\Miniconda3\envs\test\Lib\site-packages\_pytest\unraisableexception.py", line 65, in unraisable_exception_runtest_hook
yield
File "C:\Miniconda3\envs\test\Lib\site-packages\pluggy\_callers.py", line 166, in _multicall
teardown.throw(outcome._exception)
File "C:\Miniconda3\envs\test\Lib\site-packages\_pytest\logging.py", line 839, in pytest_runtest_call
yield from self._runtest_for(item, "call")
File "C:\Miniconda3\envs\test\Lib\site-packages\_pytest\logging.py", line 822, in _runtest_for
yield
File "C:\Miniconda3\envs\test\Lib\site-packages\pluggy\_callers.py", line 166, in _multicall
teardown.throw(outcome._exception)
File "C:\Miniconda3\envs\test\Lib\site-packages\_pytest\capture.py", line 882, in pytest_runtest_call
return (yield)
^^^^^
File "C:\Miniconda3\envs\test\Lib\site-packages\pluggy\_callers.py", line 166, in _multicall
teardown.throw(outcome._exception)
File "C:\Miniconda3\envs\test\Lib\site-packages\_pytest\skipping.py", line 256, in pytest_runtest_call
return (yield)
^^^^^
File "C:\Miniconda3\envs\test\Lib\site-packages\pluggy\_callers.py", line 102, in _multicall
res = hook_impl.function(*args)
^^^^^^^^^^^^^^^^^^^^^^^^^
File "C:\Miniconda3\envs\test\Lib\site-packages\_pytest\runner.py", line 182, in pytest_runtest_call
raise e
File "C:\Miniconda3\envs\test\Lib\site-packages\_pytest\runner.py", line 174, in pytest_runtest_call
item.runtest()
File "C:\Miniconda3\envs\test\Lib\site-packages\_pytest\python.py", line 1831, in runtest
self.ihook.pytest_pyfunc_call(pyfuncitem=self)
File "C:\Miniconda3\envs\test\Lib\site-packages\pluggy\_hooks.py", line 501, in __call__
return self._hookexec(self.name, self._hookimpls.copy(), kwargs, firstresult)
^^^^^^^^^^^^^^^^^^^^^^^^^^^^^^^^^^^^^^^^^^^^^^^^^^^^^^^^^^^^^^^^^^^^^^
File "C:\Miniconda3\envs\test\Lib\site-packages\pluggy\_manager.py", line 119, in _hookexec
return self._inner_hookexec(hook_name, methods, kwargs, firstresult)
^^^^^^^^^^^^^^^^^^^^^^^^^^^^^^^^^^^^^^^^^^^^^^^^^^^^^^^^^^^^^
File "C:\Miniconda3\envs\test\Lib\site-packages\pluggy\_callers.py", line 138, in _multicall
raise exception.with_traceback(exception.__traceback__)
File "C:\Miniconda3\envs\test\Lib\site-packages\pluggy\_callers.py", line 102, in _multicall
res = hook_impl.function(*args)
^^^^^^^^^^^^^^^^^^^^^^^^^
File "C:\Miniconda3\envs\test\Lib\site-packages\_pytest\python.py", line 194, in pytest_pyfunc_call
result = testfunction(**testargs)
^^^^^^^^^^^^^^^^^^^^^^^^
File "C:\Miniconda3\envs\test\Lib\unittest\mock.py", line 1387, in patched
return func(*newargs, **newkeywargs)
^^^^^^^^^^^^^^^^^^^^^^^^^^^^^
File "C:\Miniconda3\envs\test\Lib\site-packages\obspy\clients\fdsn\tests\test_client.py", line 1450, in test_authentication_exceptions
Client(eida_token="TEST")
File "C:\Miniconda3\envs\test\Lib\site-packages\obspy\clients\fdsn\client.py", line 277, in __init__
self._discover_services()
File "C:\Miniconda3\envs\test\Lib\site-packages\obspy\clients\fdsn\client.py", line 1638, in _discover_services
raise FDSNNoServiceException(msg)
obspy.clients.fdsn.header.FDSNNoServiceException: No FDSN services could be discovered at 'http://service.iris.edu'. This could be due to a temporary service outage or an invalid FDSN service address.
Traceback (most recent call last):
File "C:\Miniconda3\envs\test\Lib\site-packages\_pytest\runner.py", line 346, in from_call
result: Optional[TResult] = func()
^^^^^^
File "C:\Miniconda3\envs\test\Lib\site-packages\_pytest\runner.py", line 267, in <lambda>
lambda: ihook(item=item, **kwds), when=when, reraise=reraise
^^^^^^^^^^^^^^^^^^^^^^^^
File "C:\Miniconda3\envs\test\Lib\site-packages\pluggy\_hooks.py", line 501, in __call__
return self._hookexec(self.name, self._hookimpls.copy(), kwargs, firstresult)
^^^^^^^^^^^^^^^^^^^^^^^^^^^^^^^^^^^^^^^^^^^^^^^^^^^^^^^^^^^^^^^^^^^^^^
File "C:\Miniconda3\envs\test\Lib\site-packages\pluggy\_manager.py", line 119, in _hookexec
return self._inner_hookexec(hook_name, methods, kwargs, firstresult)
^^^^^^^^^^^^^^^^^^^^^^^^^^^^^^^^^^^^^^^^^^^^^^^^^^^^^^^^^^^^^
File "C:\Miniconda3\envs\test\Lib\site-packages\pluggy\_callers.py", line 181, in _multicall
return outcome.get_result()
^^^^^^^^^^^^^^^^^^^^
File "C:\Miniconda3\envs\test\Lib\site-packages\pluggy\_result.py", line 99, in get_result
raise exc.with_traceback(exc.__traceback__)
File "C:\Miniconda3\envs\test\Lib\site-packages\pluggy\_callers.py", line 166, in _multicall
teardown.throw(outcome._exception)
File "C:\Miniconda3\envs\test\Lib\site-packages\_pytest\threadexception.py", line 87, in pytest_runtest_call
yield from thread_exception_runtest_hook()
File "C:\Miniconda3\envs\test\Lib\site-packages\_pytest\threadexception.py", line 63, in thread_exception_runtest_hook
yield
File "C:\Miniconda3\envs\test\Lib\site-packages\pluggy\_callers.py", line 166, in _multicall
teardown.throw(outcome._exception)
File "C:\Miniconda3\envs\test\Lib\site-packages\_pytest\unraisableexception.py", line 90, in pytest_runtest_call
yield from unraisable_exception_runtest_hook()
File "C:\Miniconda3\envs\test\Lib\site-packages\_pytest\unraisableexception.py", line 65, in unraisable_exception_runtest_hook
yield
File "C:\Miniconda3\envs\test\Lib\site-packages\pluggy\_callers.py", line 166, in _multicall
teardown.throw(outcome._exception)
File "C:\Miniconda3\envs\test\Lib\site-packages\_pytest\logging.py", line 839, in pytest_runtest_call
yield from self._runtest_for(item, "call")
File "C:\Miniconda3\envs\test\Lib\site-packages\_pytest\logging.py", line 822, in _runtest_for
yield
File "C:\Miniconda3\envs\test\Lib\site-packages\pluggy\_callers.py", line 166, in _multicall
teardown.throw(outcome._exception)
File "C:\Miniconda3\envs\test\Lib\site-packages\_pytest\capture.py", line 882, in pytest_runtest_call
return (yield)
^^^^^
File "C:\Miniconda3\envs\test\Lib\site-packages\pluggy\_callers.py", line 166, in _multicall
teardown.throw(outcome._exception)
File "C:\Miniconda3\envs\test\Lib\site-packages\_pytest\skipping.py", line 256, in pytest_runtest_call
return (yield)
^^^^^
File "C:\Miniconda3\envs\test\Lib\site-packages\pluggy\_callers.py", line 102, in _multicall
res = hook_impl.function(*args)
^^^^^^^^^^^^^^^^^^^^^^^^^
File "C:\Miniconda3\envs\test\Lib\site-packages\_pytest\runner.py", line 182, in pytest_runtest_call
raise e
File "C:\Miniconda3\envs\test\Lib\site-packages\_pytest\runner.py", line 174, in pytest_runtest_call
item.runtest()
File "C:\Miniconda3\envs\test\Lib\site-packages\_pytest\python.py", line 1831, in runtest
self.ihook.pytest_pyfunc_call(pyfuncitem=self)
File "C:\Miniconda3\envs\test\Lib\site-packages\pluggy\_hooks.py", line 501, in __call__
return self._hookexec(self.name, self._hookimpls.copy(), kwargs, firstresult)
^^^^^^^^^^^^^^^^^^^^^^^^^^^^^^^^^^^^^^^^^^^^^^^^^^^^^^^^^^^^^^^^^^^^^^
File "C:\Miniconda3\envs\test\Lib\site-packages\pluggy\_manager.py", line 119, in _hookexec
return self._inner_hookexec(hook_name, methods, kwargs, firstresult)
^^^^^^^^^^^^^^^^^^^^^^^^^^^^^^^^^^^^^^^^^^^^^^^^^^^^^^^^^^^^^
File "C:\Miniconda3\envs\test\Lib\site-packages\pluggy\_callers.py", line 138, in _multicall
raise exception.with_traceback(exception.__traceback__)
File "C:\Miniconda3\envs\test\Lib\site-packages\pluggy\_callers.py", line 102, in _multicall
res = hook_impl.function(*args)
^^^^^^^^^^^^^^^^^^^^^^^^^
File "C:\Miniconda3\envs\test\Lib\site-packages\_pytest\python.py", line 194, in pytest_pyfunc_call
result = testfunction(**testargs)
^^^^^^^^^^^^^^^^^^^^^^^^
File "C:\Miniconda3\envs\test\Lib\unittest\mock.py", line 1387, in patched
return func(*newargs, **newkeywargs)
^^^^^^^^^^^^^^^^^^^^^^^^^^^^^
File "C:\Miniconda3\envs\test\Lib\site-packages\obspy\clients\fdsn\tests\test_client.py", line 1470, in test_timeout_exception
self.client.get_stations()
File "C:\Miniconda3\envs\test\Lib\site-packages\obspy\clients\fdsn\client.py", line 748, in get_stations
data_stream = self._download(url)
^^^^^^^^^^^^^^^^^^^
File "C:\Miniconda3\envs\test\Lib\site-packages\obspy\clients\fdsn\client.py", line 1486, in _download
raise_on_error(code, data)
File "C:\Miniconda3\envs\test\Lib\site-packages\obspy\clients\fdsn\client.py", line 1802, in raise_on_error
server_info = data.decode('ASCII', errors='ignore')
^^^^^^^^^^^
AttributeError: 'str' object has no attribute 'decode'. Did you mean: 'encode'?
Traceback (most recent call last):
File "C:\Miniconda3\envs\test\Lib\site-packages\_pytest\runner.py", line 346, in from_call
result: Optional[TResult] = func()
^^^^^^
File "C:\Miniconda3\envs\test\Lib\site-packages\_pytest\runner.py", line 267, in <lambda>
lambda: ihook(item=item, **kwds), when=when, reraise=reraise
^^^^^^^^^^^^^^^^^^^^^^^^
File "C:\Miniconda3\envs\test\Lib\site-packages\pluggy\_hooks.py", line 501, in __call__
return self._hookexec(self.name, self._hookimpls.copy(), kwargs, firstresult)
^^^^^^^^^^^^^^^^^^^^^^^^^^^^^^^^^^^^^^^^^^^^^^^^^^^^^^^^^^^^^^^^^^^^^^
File "C:\Miniconda3\envs\test\Lib\site-packages\pluggy\_manager.py", line 119, in _hookexec
return self._inner_hookexec(hook_name, methods, kwargs, firstresult)
^^^^^^^^^^^^^^^^^^^^^^^^^^^^^^^^^^^^^^^^^^^^^^^^^^^^^^^^^^^^^
File "C:\Miniconda3\envs\test\Lib\site-packages\pluggy\_callers.py", line 181, in _multicall
return outcome.get_result()
^^^^^^^^^^^^^^^^^^^^
File "C:\Miniconda3\envs\test\Lib\site-packages\pluggy\_result.py", line 99, in get_result
raise exc.with_traceback(exc.__traceback__)
File "C:\Miniconda3\envs\test\Lib\site-packages\pluggy\_callers.py", line 166, in _multicall
teardown.throw(outcome._exception)
File "C:\Miniconda3\envs\test\Lib\site-packages\_pytest\threadexception.py", line 87, in pytest_runtest_call
yield from thread_exception_runtest_hook()
File "C:\Miniconda3\envs\test\Lib\site-packages\_pytest\threadexception.py", line 63, in thread_exception_runtest_hook
yield
File "C:\Miniconda3\envs\test\Lib\site-packages\pluggy\_callers.py", line 166, in _multicall
teardown.throw(outcome._exception)
File "C:\Miniconda3\envs\test\Lib\site-packages\_pytest\unraisableexception.py", line 90, in pytest_runtest_call
yield from unraisable_exception_runtest_hook()
File "C:\Miniconda3\envs\test\Lib\site-packages\_pytest\unraisableexception.py", line 65, in unraisable_exception_runtest_hook
yield
File "C:\Miniconda3\envs\test\Lib\site-packages\pluggy\_callers.py", line 166, in _multicall
teardown.throw(outcome._exception)
File "C:\Miniconda3\envs\test\Lib\site-packages\_pytest\logging.py", line 839, in pytest_runtest_call
yield from self._runtest_for(item, "call")
File "C:\Miniconda3\envs\test\Lib\site-packages\_pytest\logging.py", line 822, in _runtest_for
yield
File "C:\Miniconda3\envs\test\Lib\site-packages\pluggy\_callers.py", line 166, in _multicall
teardown.throw(outcome._exception)
File "C:\Miniconda3\envs\test\Lib\site-packages\_pytest\capture.py", line 882, in pytest_runtest_call
return (yield)
^^^^^
File "C:\Miniconda3\envs\test\Lib\site-packages\pluggy\_callers.py", line 166, in _multicall
teardown.throw(outcome._exception)
File "C:\Miniconda3\envs\test\Lib\site-packages\_pytest\skipping.py", line 256, in pytest_runtest_call
return (yield)
^^^^^
File "C:\Miniconda3\envs\test\Lib\site-packages\pluggy\_callers.py", line 102, in _multicall
res = hook_impl.function(*args)
^^^^^^^^^^^^^^^^^^^^^^^^^
File "C:\Miniconda3\envs\test\Lib\site-packages\_pytest\runner.py", line 182, in pytest_runtest_call
raise e
File "C:\Miniconda3\envs\test\Lib\site-packages\_pytest\runner.py", line 174, in pytest_runtest_call
item.runtest()
File "C:\Miniconda3\envs\test\Lib\site-packages\_pytest\python.py", line 1831, in runtest
self.ihook.pytest_pyfunc_call(pyfuncitem=self)
File "C:\Miniconda3\envs\test\Lib\site-packages\pluggy\_hooks.py", line 501, in __call__
return self._hookexec(self.name, self._hookimpls.copy(), kwargs, firstresult)
^^^^^^^^^^^^^^^^^^^^^^^^^^^^^^^^^^^^^^^^^^^^^^^^^^^^^^^^^^^^^^^^^^^^^^
File "C:\Miniconda3\envs\test\Lib\site-packages\pluggy\_manager.py", line 119, in _hookexec
return self._inner_hookexec(hook_name, methods, kwargs, firstresult)
^^^^^^^^^^^^^^^^^^^^^^^^^^^^^^^^^^^^^^^^^^^^^^^^^^^^^^^^^^^^^
File "C:\Miniconda3\envs\test\Lib\site-packages\pluggy\_callers.py", line 138, in _multicall
raise exception.with_traceback(exception.__traceback__)
File "C:\Miniconda3\envs\test\Lib\site-packages\pluggy\_callers.py", line 102, in _multicall
res = hook_impl.function(*args)
^^^^^^^^^^^^^^^^^^^^^^^^^
File "C:\Miniconda3\envs\test\Lib\site-packages\_pytest\python.py", line 194, in pytest_pyfunc_call
result = testfunction(**testargs)
^^^^^^^^^^^^^^^^^^^^^^^^
File "C:\Miniconda3\envs\test\Lib\unittest\mock.py", line 1387, in patched
return func(*newargs, **newkeywargs)
^^^^^^^^^^^^^^^^^^^^^^^^^^^^^
File "C:\Miniconda3\envs\test\Lib\site-packages\obspy\clients\fdsn\tests\test_client.py", line 1488, in test_not_implemented_exception
self.client.get_stations()
File "C:\Miniconda3\envs\test\Lib\site-packages\obspy\clients\fdsn\client.py", line 748, in get_stations
data_stream = self._download(url)
^^^^^^^^^^^^^^^^^^^
File "C:\Miniconda3\envs\test\Lib\site-packages\obspy\clients\fdsn\client.py", line 1486, in _download
raise_on_error(code, data)
File "C:\Miniconda3\envs\test\Lib\site-packages\obspy\clients\fdsn\client.py", line 1802, in raise_on_error
server_info = data.decode('ASCII', errors='ignore')
^^^^^^^^^^^
AttributeError: 'NoneType' object has no attribute 'decode'
Traceback (most recent call last):
File "C:\Miniconda3\envs\test\Lib\site-packages\_pytest\runner.py", line 346, in from_call
result: Optional[TResult] = func()
^^^^^^
File "C:\Miniconda3\envs\test\Lib\site-packages\_pytest\runner.py", line 267, in <lambda>
lambda: ihook(item=item, **kwds), when=when, reraise=reraise
^^^^^^^^^^^^^^^^^^^^^^^^
File "C:\Miniconda3\envs\test\Lib\site-packages\pluggy\_hooks.py", line 501, in __call__
return self._hookexec(self.name, self._hookimpls.copy(), kwargs, firstresult)
^^^^^^^^^^^^^^^^^^^^^^^^^^^^^^^^^^^^^^^^^^^^^^^^^^^^^^^^^^^^^^^^^^^^^^
File "C:\Miniconda3\envs\test\Lib\site-packages\pluggy\_manager.py", line 119, in _hookexec
return self._inner_hookexec(hook_name, methods, kwargs, firstresult)
^^^^^^^^^^^^^^^^^^^^^^^^^^^^^^^^^^^^^^^^^^^^^^^^^^^^^^^^^^^^^
File "C:\Miniconda3\envs\test\Lib\site-packages\pluggy\_callers.py", line 181, in _multicall
return outcome.get_result()
^^^^^^^^^^^^^^^^^^^^
File "C:\Miniconda3\envs\test\Lib\site-packages\pluggy\_result.py", line 99, in get_result
raise exc.with_traceback(exc.__traceback__)
File "C:\Miniconda3\envs\test\Lib\site-packages\pluggy\_callers.py", line 166, in _multicall
teardown.throw(outcome._exception)
File "C:\Miniconda3\envs\test\Lib\site-packages\_pytest\threadexception.py", line 87, in pytest_runtest_call
yield from thread_exception_runtest_hook()
File "C:\Miniconda3\envs\test\Lib\site-packages\_pytest\threadexception.py", line 63, in thread_exception_runtest_hook
yield
File "C:\Miniconda3\envs\test\Lib\site-packages\pluggy\_callers.py", line 166, in _multicall
teardown.throw(outcome._exception)
File "C:\Miniconda3\envs\test\Lib\site-packages\_pytest\unraisableexception.py", line 90, in pytest_runtest_call
yield from unraisable_exception_runtest_hook()
File "C:\Miniconda3\envs\test\Lib\site-packages\_pytest\unraisableexception.py", line 65, in unraisable_exception_runtest_hook
yield
File "C:\Miniconda3\envs\test\Lib\site-packages\pluggy\_callers.py", line 166, in _multicall
teardown.throw(outcome._exception)
File "C:\Miniconda3\envs\test\Lib\site-packages\_pytest\logging.py", line 839, in pytest_runtest_call
yield from self._runtest_for(item, "call")
File "C:\Miniconda3\envs\test\Lib\site-packages\_pytest\logging.py", line 822, in _runtest_for
yield
File "C:\Miniconda3\envs\test\Lib\site-packages\pluggy\_callers.py", line 166, in _multicall
teardown.throw(outcome._exception)
File "C:\Miniconda3\envs\test\Lib\site-packages\_pytest\capture.py", line 882, in pytest_runtest_call
return (yield)
^^^^^
File "C:\Miniconda3\envs\test\Lib\site-packages\pluggy\_callers.py", line 166, in _multicall
teardown.throw(outcome._exception)
File "C:\Miniconda3\envs\test\Lib\site-packages\_pytest\skipping.py", line 256, in pytest_runtest_call
return (yield)
^^^^^
File "C:\Miniconda3\envs\test\Lib\site-packages\pluggy\_callers.py", line 102, in _multicall
res = hook_impl.function(*args)
^^^^^^^^^^^^^^^^^^^^^^^^^
File "C:\Miniconda3\envs\test\Lib\site-packages\_pytest\runner.py", line 182, in pytest_runtest_call
raise e
File "C:\Miniconda3\envs\test\Lib\site-packages\_pytest\runner.py", line 174, in pytest_runtest_call
item.runtest()
File "C:\Miniconda3\envs\test\Lib\site-packages\_pytest\python.py", line 1831, in runtest
self.ihook.pytest_pyfunc_call(pyfuncitem=self)
File "C:\Miniconda3\envs\test\Lib\site-packages\pluggy\_hooks.py", line 501, in __call__
return self._hookexec(self.name, self._hookimpls.copy(), kwargs, firstresult)
^^^^^^^^^^^^^^^^^^^^^^^^^^^^^^^^^^^^^^^^^^^^^^^^^^^^^^^^^^^^^^^^^^^^^^
File "C:\Miniconda3\envs\test\Lib\site-packages\pluggy\_manager.py", line 119, in _hookexec
return self._inner_hookexec(hook_name, methods, kwargs, firstresult)
^^^^^^^^^^^^^^^^^^^^^^^^^^^^^^^^^^^^^^^^^^^^^^^^^^^^^^^^^^^^^
File "C:\Miniconda3\envs\test\Lib\site-packages\pluggy\_callers.py", line 138, in _multicall
raise exception.with_traceback(exception.__traceback__)
File "C:\Miniconda3\envs\test\Lib\site-packages\pluggy\_callers.py", line 102, in _multicall
res = hook_impl.function(*args)
^^^^^^^^^^^^^^^^^^^^^^^^^
File "C:\Miniconda3\envs\test\Lib\site-packages\_pytest\python.py", line 194, in pytest_pyfunc_call
result = testfunction(**testargs)
^^^^^^^^^^^^^^^^^^^^^^^^
File "C:\Miniconda3\envs\test\Lib\unittest\mock.py", line 1387, in patched
return func(*newargs, **newkeywargs)
^^^^^^^^^^^^^^^^^^^^^^^^^^^^^
File "C:\Miniconda3\envs\test\Lib\site-packages\obspy\clients\fdsn\tests\test_client.py", line 1498, in test_bad_gateway_exception
self.client.get_stations()
File "C:\Miniconda3\envs\test\Lib\site-packages\obspy\clients\fdsn\client.py", line 748, in get_stations
data_stream = self._download(url)
^^^^^^^^^^^^^^^^^^^
File "C:\Miniconda3\envs\test\Lib\site-packages\obspy\clients\fdsn\client.py", line 1486, in _download
raise_on_error(code, data)
File "C:\Miniconda3\envs\test\Lib\site-packages\obspy\clients\fdsn\client.py", line 1802, in raise_on_error
server_info = data.decode('ASCII', errors='ignore')
^^^^^^^^^^^
AttributeError: 'NoneType' object has no attribute 'decode'
Traceback (most recent call last):
File "C:\Miniconda3\envs\test\Lib\site-packages\_pytest\runner.py", line 346, in from_call
result: Optional[TResult] = func()
^^^^^^
File "C:\Miniconda3\envs\test\Lib\site-packages\_pytest\runner.py", line 267, in <lambda>
lambda: ihook(item=item, **kwds), when=when, reraise=reraise
^^^^^^^^^^^^^^^^^^^^^^^^
File "C:\Miniconda3\envs\test\Lib\site-packages\pluggy\_hooks.py", line 501, in __call__
return self._hookexec(self.name, self._hookimpls.copy(), kwargs, firstresult)
^^^^^^^^^^^^^^^^^^^^^^^^^^^^^^^^^^^^^^^^^^^^^^^^^^^^^^^^^^^^^^^^^^^^^^
File "C:\Miniconda3\envs\test\Lib\site-packages\pluggy\_manager.py", line 119, in _hookexec
return self._inner_hookexec(hook_name, methods, kwargs, firstresult)
^^^^^^^^^^^^^^^^^^^^^^^^^^^^^^^^^^^^^^^^^^^^^^^^^^^^^^^^^^^^^
File "C:\Miniconda3\envs\test\Lib\site-packages\pluggy\_callers.py", line 181, in _multicall
return outcome.get_result()
^^^^^^^^^^^^^^^^^^^^
File "C:\Miniconda3\envs\test\Lib\site-packages\pluggy\_result.py", line 99, in get_result
raise exc.with_traceback(exc.__traceback__)
File "C:\Miniconda3\envs\test\Lib\site-packages\pluggy\_callers.py", line 166, in _multicall
teardown.throw(outcome._exception)
File "C:\Miniconda3\envs\test\Lib\site-packages\_pytest\threadexception.py", line 87, in pytest_runtest_call
yield from thread_exception_runtest_hook()
File "C:\Miniconda3\envs\test\Lib\site-packages\_pytest\threadexception.py", line 63, in thread_exception_runtest_hook
yield
File "C:\Miniconda3\envs\test\Lib\site-packages\pluggy\_callers.py", line 166, in _multicall
teardown.throw(outcome._exception)
File "C:\Miniconda3\envs\test\Lib\site-packages\_pytest\unraisableexception.py", line 90, in pytest_runtest_call
yield from unraisable_exception_runtest_hook()
File "C:\Miniconda3\envs\test\Lib\site-packages\_pytest\unraisableexception.py", line 65, in unraisable_exception_runtest_hook
yield
File "C:\Miniconda3\envs\test\Lib\site-packages\pluggy\_callers.py", line 166, in _multicall
teardown.throw(outcome._exception)
File "C:\Miniconda3\envs\test\Lib\site-packages\_pytest\logging.py", line 839, in pytest_runtest_call
yield from self._runtest_for(item, "call")
File "C:\Miniconda3\envs\test\Lib\site-packages\_pytest\logging.py", line 822, in _runtest_for
yield
File "C:\Miniconda3\envs\test\Lib\site-packages\pluggy\_callers.py", line 166, in _multicall
teardown.throw(outcome._exception)
File "C:\Miniconda3\envs\test\Lib\site-packages\_pytest\capture.py", line 882, in pytest_runtest_call
return (yield)
^^^^^
File "C:\Miniconda3\envs\test\Lib\site-packages\pluggy\_callers.py", line 166, in _multicall
teardown.throw(outcome._exception)
File "C:\Miniconda3\envs\test\Lib\site-packages\_pytest\skipping.py", line 256, in pytest_runtest_call
return (yield)
^^^^^
File "C:\Miniconda3\envs\test\Lib\site-packages\pluggy\_callers.py", line 102, in _multicall
res = hook_impl.function(*args)
^^^^^^^^^^^^^^^^^^^^^^^^^
File "C:\Miniconda3\envs\test\Lib\site-packages\_pytest\runner.py", line 182, in pytest_runtest_call
raise e
File "C:\Miniconda3\envs\test\Lib\site-packages\_pytest\runner.py", line 174, in pytest_runtest_call
item.runtest()
File "C:\Miniconda3\envs\test\Lib\site-packages\_pytest\python.py", line 1831, in runtest
self.ihook.pytest_pyfunc_call(pyfuncitem=self)
File "C:\Miniconda3\envs\test\Lib\site-packages\pluggy\_hooks.py", line 501, in __call__
return self._hookexec(self.name, self._hookimpls.copy(), kwargs, firstresult)
^^^^^^^^^^^^^^^^^^^^^^^^^^^^^^^^^^^^^^^^^^^^^^^^^^^^^^^^^^^^^^^^^^^^^^
File "C:\Miniconda3\envs\test\Lib\site-packages\pluggy\_manager.py", line 119, in _hookexec
return self._inner_hookexec(hook_name, methods, kwargs, firstresult)
^^^^^^^^^^^^^^^^^^^^^^^^^^^^^^^^^^^^^^^^^^^^^^^^^^^^^^^^^^^^^
File "C:\Miniconda3\envs\test\Lib\site-packages\pluggy\_callers.py", line 138, in _multicall
raise exception.with_traceback(exception.__traceback__)
File "C:\Miniconda3\envs\test\Lib\site-packages\pluggy\_callers.py", line 102, in _multicall
res = hook_impl.function(*args)
^^^^^^^^^^^^^^^^^^^^^^^^^
File "C:\Miniconda3\envs\test\Lib\site-packages\_pytest\python.py", line 194, in pytest_pyfunc_call
result = testfunction(**testargs)
^^^^^^^^^^^^^^^^^^^^^^^^
File "C:\Miniconda3\envs\test\Lib\unittest\mock.py", line 1387, in patched
return func(*newargs, **newkeywargs)
^^^^^^^^^^^^^^^^^^^^^^^^^^^^^
File "C:\Miniconda3\envs\test\Lib\site-packages\obspy\clients\fdsn\tests\test_client.py", line 1508, in test_service_unavailable_exception
self.client.get_stations()
File "C:\Miniconda3\envs\test\Lib\site-packages\obspy\clients\fdsn\client.py", line 748, in get_stations
data_stream = self._download(url)
^^^^^^^^^^^^^^^^^^^
File "C:\Miniconda3\envs\test\Lib\site-packages\obspy\clients\fdsn\client.py", line 1486, in _download
raise_on_error(code, data)
File "C:\Miniconda3\envs\test\Lib\site-packages\obspy\clients\fdsn\client.py", line 1802, in raise_on_error
server_info = data.decode('ASCII', errors='ignore')
^^^^^^^^^^^
AttributeError: 'NoneType' object has no attribute 'decode'
Traceback (most recent call last):
File "C:\Miniconda3\envs\test\Lib\site-packages\_pytest\runner.py", line 346, in from_call
result: Optional[TResult] = func()
^^^^^^
File "C:\Miniconda3\envs\test\Lib\site-packages\_pytest\runner.py", line 267, in <lambda>
lambda: ihook(item=item, **kwds), when=when, reraise=reraise
^^^^^^^^^^^^^^^^^^^^^^^^
File "C:\Miniconda3\envs\test\Lib\site-packages\pluggy\_hooks.py", line 501, in __call__
return self._hookexec(self.name, self._hookimpls.copy(), kwargs, firstresult)
^^^^^^^^^^^^^^^^^^^^^^^^^^^^^^^^^^^^^^^^^^^^^^^^^^^^^^^^^^^^^^^^^^^^^^
File "C:\Miniconda3\envs\test\Lib\site-packages\pluggy\_manager.py", line 119, in _hookexec
return self._inner_hookexec(hook_name, methods, kwargs, firstresult)
^^^^^^^^^^^^^^^^^^^^^^^^^^^^^^^^^^^^^^^^^^^^^^^^^^^^^^^^^^^^^
File "C:\Miniconda3\envs\test\Lib\site-packages\pluggy\_callers.py", line 181, in _multicall
return outcome.get_result()
^^^^^^^^^^^^^^^^^^^^
File "C:\Miniconda3\envs\test\Lib\site-packages\pluggy\_result.py", line 99, in get_result
raise exc.with_traceback(exc.__traceback__)
File "C:\Miniconda3\envs\test\Lib\site-packages\pluggy\_callers.py", line 166, in _multicall
teardown.throw(outcome._exception)
File "C:\Miniconda3\envs\test\Lib\site-packages\_pytest\threadexception.py", line 87, in pytest_runtest_call
yield from thread_exception_runtest_hook()
File "C:\Miniconda3\envs\test\Lib\site-packages\_pytest\threadexception.py", line 63, in thread_exception_runtest_hook
yield
File "C:\Miniconda3\envs\test\Lib\site-packages\pluggy\_callers.py", line 166, in _multicall
teardown.throw(outcome._exception)
File "C:\Miniconda3\envs\test\Lib\site-packages\_pytest\unraisableexception.py", line 90, in pytest_runtest_call
yield from unraisable_exception_runtest_hook()
File "C:\Miniconda3\envs\test\Lib\site-packages\_pytest\unraisableexception.py", line 65, in unraisable_exception_runtest_hook
yield
File "C:\Miniconda3\envs\test\Lib\site-packages\pluggy\_callers.py", line 166, in _multicall
teardown.throw(outcome._exception)
File "C:\Miniconda3\envs\test\Lib\site-packages\_pytest\logging.py", line 839, in pytest_runtest_call
yield from self._runtest_for(item, "call")
File "C:\Miniconda3\envs\test\Lib\site-packages\_pytest\logging.py", line 822, in _runtest_for
yield
File "C:\Miniconda3\envs\test\Lib\site-packages\pluggy\_callers.py", line 166, in _multicall
teardown.throw(outcome._exception)
File "C:\Miniconda3\envs\test\Lib\site-packages\_pytest\capture.py", line 882, in pytest_runtest_call
return (yield)
^^^^^
File "C:\Miniconda3\envs\test\Lib\site-packages\pluggy\_callers.py", line 166, in _multicall
teardown.throw(outcome._exception)
File "C:\Miniconda3\envs\test\Lib\site-packages\_pytest\skipping.py", line 256, in pytest_runtest_call
return (yield)
^^^^^
File "C:\Miniconda3\envs\test\Lib\site-packages\pluggy\_callers.py", line 102, in _multicall
res = hook_impl.function(*args)
^^^^^^^^^^^^^^^^^^^^^^^^^
File "C:\Miniconda3\envs\test\Lib\site-packages\_pytest\runner.py", line 182, in pytest_runtest_call
raise e
File "C:\Miniconda3\envs\test\Lib\site-packages\_pytest\runner.py", line 174, in pytest_runtest_call
item.runtest()
File "C:\Miniconda3\envs\test\Lib\site-packages\_pytest\python.py", line 1831, in runtest
self.ihook.pytest_pyfunc_call(pyfuncitem=self)
File "C:\Miniconda3\envs\test\Lib\site-packages\pluggy\_hooks.py", line 501, in __call__
return self._hookexec(self.name, self._hookimpls.copy(), kwargs, firstresult)
^^^^^^^^^^^^^^^^^^^^^^^^^^^^^^^^^^^^^^^^^^^^^^^^^^^^^^^^^^^^^^^^^^^^^^
File "C:\Miniconda3\envs\test\Lib\site-packages\pluggy\_manager.py", line 119, in _hookexec
return self._inner_hookexec(hook_name, methods, kwargs, firstresult)
^^^^^^^^^^^^^^^^^^^^^^^^^^^^^^^^^^^^^^^^^^^^^^^^^^^^^^^^^^^^^
File "C:\Miniconda3\envs\test\Lib\site-packages\pluggy\_callers.py", line 138, in _multicall
raise exception.with_traceback(exception.__traceback__)
File "C:\Miniconda3\envs\test\Lib\site-packages\pluggy\_callers.py", line 102, in _multicall
res = hook_impl.function(*args)
^^^^^^^^^^^^^^^^^^^^^^^^^
File "C:\Miniconda3\envs\test\Lib\site-packages\_pytest\python.py", line 194, in pytest_pyfunc_call
result = testfunction(**testargs)
^^^^^^^^^^^^^^^^^^^^^^^^
File "C:\Miniconda3\envs\test\Lib\unittest\mock.py", line 1387, in patched
return func(*newargs, **newkeywargs)
^^^^^^^^^^^^^^^^^^^^^^^^^^^^^
File "C:\Miniconda3\envs\test\Lib\site-packages\obspy\clients\fdsn\tests\test_client.py", line 1517, in test_bad_request_exception
self.client.get_stations()
File "C:\Miniconda3\envs\test\Lib\site-packages\obspy\clients\fdsn\client.py", line 748, in get_stations
data_stream = self._download(url)
^^^^^^^^^^^^^^^^^^^
File "C:\Miniconda3\envs\test\Lib\site-packages\obspy\clients\fdsn\client.py", line 1486, in _download
raise_on_error(code, data)
File "C:\Miniconda3\envs\test\Lib\site-packages\obspy\clients\fdsn\client.py", line 1802, in raise_on_error
server_info = data.decode('ASCII', errors='ignore')
^^^^^^^^^^^
AttributeError: '_io.BytesIO' object has no attribute 'decode'
Traceback (most recent call last):
File "C:\Miniconda3\envs\test\Lib\site-packages\_pytest\runner.py", line 346, in from_call
result: Optional[TResult] = func()
^^^^^^
File "C:\Miniconda3\envs\test\Lib\site-packages\_pytest\runner.py", line 267, in <lambda>
lambda: ihook(item=item, **kwds), when=when, reraise=reraise
^^^^^^^^^^^^^^^^^^^^^^^^
File "C:\Miniconda3\envs\test\Lib\site-packages\pluggy\_hooks.py", line 501, in __call__
return self._hookexec(self.name, self._hookimpls.copy(), kwargs, firstresult)
^^^^^^^^^^^^^^^^^^^^^^^^^^^^^^^^^^^^^^^^^^^^^^^^^^^^^^^^^^^^^^^^^^^^^^
File "C:\Miniconda3\envs\test\Lib\site-packages\pluggy\_manager.py", line 119, in _hookexec
return self._inner_hookexec(hook_name, methods, kwargs, firstresult)
^^^^^^^^^^^^^^^^^^^^^^^^^^^^^^^^^^^^^^^^^^^^^^^^^^^^^^^^^^^^^
File "C:\Miniconda3\envs\test\Lib\site-packages\pluggy\_callers.py", line 181, in _multicall
return outcome.get_result()
^^^^^^^^^^^^^^^^^^^^
File "C:\Miniconda3\envs\test\Lib\site-packages\pluggy\_result.py", line 99, in get_result
raise exc.with_traceback(exc.__traceback__)
File "C:\Miniconda3\envs\test\Lib\site-packages\pluggy\_callers.py", line 166, in _multicall
teardown.throw(outcome._exception)
File "C:\Miniconda3\envs\test\Lib\site-packages\_pytest\threadexception.py", line 87, in pytest_runtest_call
yield from thread_exception_runtest_hook()
File "C:\Miniconda3\envs\test\Lib\site-packages\_pytest\threadexception.py", line 63, in thread_exception_runtest_hook
yield
File "C:\Miniconda3\envs\test\Lib\site-packages\pluggy\_callers.py", line 166, in _multicall
teardown.throw(outcome._exception)
File "C:\Miniconda3\envs\test\Lib\site-packages\_pytest\unraisableexception.py", line 90, in pytest_runtest_call
yield from unraisable_exception_runtest_hook()
File "C:\Miniconda3\envs\test\Lib\site-packages\_pytest\unraisableexception.py", line 65, in unraisable_exception_runtest_hook
yield
File "C:\Miniconda3\envs\test\Lib\site-packages\pluggy\_callers.py", line 166, in _multicall
teardown.throw(outcome._exception)
File "C:\Miniconda3\envs\test\Lib\site-packages\_pytest\logging.py", line 839, in pytest_runtest_call
yield from self._runtest_for(item, "call")
File "C:\Miniconda3\envs\test\Lib\site-packages\_pytest\logging.py", line 822, in _runtest_for
yield
File "C:\Miniconda3\envs\test\Lib\site-packages\pluggy\_callers.py", line 166, in _multicall
teardown.throw(outcome._exception)
File "C:\Miniconda3\envs\test\Lib\site-packages\_pytest\capture.py", line 882, in pytest_runtest_call
return (yield)
^^^^^
File "C:\Miniconda3\envs\test\Lib\site-packages\pluggy\_callers.py", line 166, in _multicall
teardown.throw(outcome._exception)
File "C:\Miniconda3\envs\test\Lib\site-packages\_pytest\skipping.py", line 256, in pytest_runtest_call
return (yield)
^^^^^
File "C:\Miniconda3\envs\test\Lib\site-packages\pluggy\_callers.py", line 102, in _multicall
res = hook_impl.function(*args)
^^^^^^^^^^^^^^^^^^^^^^^^^
File "C:\Miniconda3\envs\test\Lib\site-packages\_pytest\runner.py", line 182, in pytest_runtest_call
raise e
File "C:\Miniconda3\envs\test\Lib\site-packages\_pytest\runner.py", line 174, in pytest_runtest_call
item.runtest()
File "C:\Miniconda3\envs\test\Lib\site-packages\_pytest\python.py", line 1831, in runtest
self.ihook.pytest_pyfunc_call(pyfuncitem=self)
File "C:\Miniconda3\envs\test\Lib\site-packages\pluggy\_hooks.py", line 501, in __call__
return self._hookexec(self.name, self._hookimpls.copy(), kwargs, firstresult)
^^^^^^^^^^^^^^^^^^^^^^^^^^^^^^^^^^^^^^^^^^^^^^^^^^^^^^^^^^^^^^^^^^^^^^
File "C:\Miniconda3\envs\test\Lib\site-packages\pluggy\_manager.py", line 119, in _hookexec
return self._inner_hookexec(hook_name, methods, kwargs, firstresult)
^^^^^^^^^^^^^^^^^^^^^^^^^^^^^^^^^^^^^^^^^^^^^^^^^^^^^^^^^^^^^
File "C:\Miniconda3\envs\test\Lib\site-packages\pluggy\_callers.py", line 138, in _multicall
raise exception.with_traceback(exception.__traceback__)
File "C:\Miniconda3\envs\test\Lib\site-packages\pluggy\_callers.py", line 102, in _multicall
res = hook_impl.function(*args)
^^^^^^^^^^^^^^^^^^^^^^^^^
File "C:\Miniconda3\envs\test\Lib\site-packages\_pytest\python.py", line 194, in pytest_pyfunc_call
result = testfunction(**testargs)
^^^^^^^^^^^^^^^^^^^^^^^^
File "C:\Miniconda3\envs\test\Lib\unittest\mock.py", line 1387, in patched
return func(*newargs, **newkeywargs)
^^^^^^^^^^^^^^^^^^^^^^^^^^^^^
File "C:\Miniconda3\envs\test\Lib\site-packages\obspy\clients\fdsn\tests\test_client.py", line 1526, in test_server_exception
self.client.get_stations()
File "C:\Miniconda3\envs\test\Lib\site-packages\obspy\clients\fdsn\client.py", line 748, in get_stations
data_stream = self._download(url)
^^^^^^^^^^^^^^^^^^^
File "C:\Miniconda3\envs\test\Lib\site-packages\obspy\clients\fdsn\client.py", line 1486, in _download
raise_on_error(code, data)
File "C:\Miniconda3\envs\test\Lib\site-packages\obspy\clients\fdsn\client.py", line 1802, in raise_on_error
server_info = data.decode('ASCII', errors='ignore')
^^^^^^^^^^^
AttributeError: 'NoneType' object has no attribute 'decode'
Traceback (most recent call last):
File "C:\Miniconda3\envs\test\Lib\site-packages\_pytest\runner.py", line 346, in from_call
result: Optional[TResult] = func()
^^^^^^
File "C:\Miniconda3\envs\test\Lib\site-packages\_pytest\runner.py", line 267, in <lambda>
lambda: ihook(item=item, **kwds), when=when, reraise=reraise
^^^^^^^^^^^^^^^^^^^^^^^^
File "C:\Miniconda3\envs\test\Lib\site-packages\pluggy\_hooks.py", line 501, in __call__
return self._hookexec(self.name, self._hookimpls.copy(), kwargs, firstresult)
^^^^^^^^^^^^^^^^^^^^^^^^^^^^^^^^^^^^^^^^^^^^^^^^^^^^^^^^^^^^^^^^^^^^^^
File "C:\Miniconda3\envs\test\Lib\site-packages\pluggy\_manager.py", line 119, in _hookexec
return self._inner_hookexec(hook_name, methods, kwargs, firstresult)
^^^^^^^^^^^^^^^^^^^^^^^^^^^^^^^^^^^^^^^^^^^^^^^^^^^^^^^^^^^^^
File "C:\Miniconda3\envs\test\Lib\site-packages\pluggy\_callers.py", line 181, in _multicall
return outcome.get_result()
^^^^^^^^^^^^^^^^^^^^
File "C:\Miniconda3\envs\test\Lib\site-packages\pluggy\_result.py", line 99, in get_result
raise exc.with_traceback(exc.__traceback__)
File "C:\Miniconda3\envs\test\Lib\site-packages\pluggy\_callers.py", line 166, in _multicall
teardown.throw(outcome._exception)
File "C:\Miniconda3\envs\test\Lib\site-packages\_pytest\threadexception.py", line 87, in pytest_runtest_call
yield from thread_exception_runtest_hook()
File "C:\Miniconda3\envs\test\Lib\site-packages\_pytest\threadexception.py", line 63, in thread_exception_runtest_hook
yield
File "C:\Miniconda3\envs\test\Lib\site-packages\pluggy\_callers.py", line 166, in _multicall
teardown.throw(outcome._exception)
File "C:\Miniconda3\envs\test\Lib\site-packages\_pytest\unraisableexception.py", line 90, in pytest_runtest_call
yield from unraisable_exception_runtest_hook()
File "C:\Miniconda3\envs\test\Lib\site-packages\_pytest\unraisableexception.py", line 65, in unraisable_exception_runtest_hook
yield
File "C:\Miniconda3\envs\test\Lib\site-packages\pluggy\_callers.py", line 166, in _multicall
teardown.throw(outcome._exception)
File "C:\Miniconda3\envs\test\Lib\site-packages\_pytest\logging.py", line 839, in pytest_runtest_call
yield from self._runtest_for(item, "call")
File "C:\Miniconda3\envs\test\Lib\site-packages\_pytest\logging.py", line 822, in _runtest_for
yield
File "C:\Miniconda3\envs\test\Lib\site-packages\pluggy\_callers.py", line 166, in _multicall
teardown.throw(outcome._exception)
File "C:\Miniconda3\envs\test\Lib\site-packages\_pytest\capture.py", line 882, in pytest_runtest_call
return (yield)
^^^^^
File "C:\Miniconda3\envs\test\Lib\site-packages\pluggy\_callers.py", line 166, in _multicall
teardown.throw(outcome._exception)
File "C:\Miniconda3\envs\test\Lib\site-packages\_pytest\skipping.py", line 256, in pytest_runtest_call
return (yield)
^^^^^
File "C:\Miniconda3\envs\test\Lib\site-packages\pluggy\_callers.py", line 102, in _multicall
res = hook_impl.function(*args)
^^^^^^^^^^^^^^^^^^^^^^^^^
File "C:\Miniconda3\envs\test\Lib\site-packages\_pytest\runner.py", line 182, in pytest_runtest_call
raise e
File "C:\Miniconda3\envs\test\Lib\site-packages\_pytest\runner.py", line 174, in pytest_runtest_call
item.runtest()
File "C:\Miniconda3\envs\test\Lib\site-packages\_pytest\python.py", line 1831, in runtest
self.ihook.pytest_pyfunc_call(pyfuncitem=self)
File "C:\Miniconda3\envs\test\Lib\site-packages\pluggy\_hooks.py", line 501, in __call__
return self._hookexec(self.name, self._hookimpls.copy(), kwargs, firstresult)
^^^^^^^^^^^^^^^^^^^^^^^^^^^^^^^^^^^^^^^^^^^^^^^^^^^^^^^^^^^^^^^^^^^^^^
File "C:\Miniconda3\envs\test\Lib\site-packages\pluggy\_manager.py", line 119, in _hookexec
return self._inner_hookexec(hook_name, methods, kwargs, firstresult)
^^^^^^^^^^^^^^^^^^^^^^^^^^^^^^^^^^^^^^^^^^^^^^^^^^^^^^^^^^^^^
File "C:\Miniconda3\envs\test\Lib\site-packages\pluggy\_callers.py", line 138, in _multicall
raise exception.with_traceback(exception.__traceback__)
File "C:\Miniconda3\envs\test\Lib\site-packages\pluggy\_callers.py", line 102, in _multicall
res = hook_impl.function(*args)
^^^^^^^^^^^^^^^^^^^^^^^^^
File "C:\Miniconda3\envs\test\Lib\site-packages\_pytest\python.py", line 194, in pytest_pyfunc_call
result = testfunction(**testargs)
^^^^^^^^^^^^^^^^^^^^^^^^
File "C:\Miniconda3\envs\test\Lib\unittest\mock.py", line 1387, in patched
return func(*newargs, **newkeywargs)
^^^^^^^^^^^^^^^^^^^^^^^^^^^^^
File "C:\Miniconda3\envs\test\Lib\site-packages\obspy\clients\fdsn\tests\test_client.py", line 1535, in test_too_many_requests_exception
self.client.get_stations()
File "C:\Miniconda3\envs\test\Lib\site-packages\obspy\clients\fdsn\client.py", line 748, in get_stations
data_stream = self._download(url)
^^^^^^^^^^^^^^^^^^^
File "C:\Miniconda3\envs\test\Lib\site-packages\obspy\clients\fdsn\client.py", line 1486, in _download
raise_on_error(code, data)
File "C:\Miniconda3\envs\test\Lib\site-packages\obspy\clients\fdsn\client.py", line 1802, in raise_on_error
server_info = data.decode('ASCII', errors='ignore')
^^^^^^^^^^^
AttributeError: 'NoneType' object has no attribute 'decode'
Traceback (most recent call last):
File "C:\Miniconda3\envs\test\Lib\site-packages\_pytest\runner.py", line 346, in from_call
result: Optional[TResult] = func()
^^^^^^
File "C:\Miniconda3\envs\test\Lib\site-packages\_pytest\runner.py", line 267, in <lambda>
lambda: ihook(item=item, **kwds), when=when, reraise=reraise
^^^^^^^^^^^^^^^^^^^^^^^^
File "C:\Miniconda3\envs\test\Lib\site-packages\pluggy\_hooks.py", line 501, in __call__
return self._hookexec(self.name, self._hookimpls.copy(), kwargs, firstresult)
^^^^^^^^^^^^^^^^^^^^^^^^^^^^^^^^^^^^^^^^^^^^^^^^^^^^^^^^^^^^^^^^^^^^^^
File "C:\Miniconda3\envs\test\Lib\site-packages\pluggy\_manager.py", line 119, in _hookexec
return self._inner_hookexec(hook_name, methods, kwargs, firstresult)
^^^^^^^^^^^^^^^^^^^^^^^^^^^^^^^^^^^^^^^^^^^^^^^^^^^^^^^^^^^^^
File "C:\Miniconda3\envs\test\Lib\site-packages\pluggy\_callers.py", line 181, in _multicall
return outcome.get_result()
^^^^^^^^^^^^^^^^^^^^
File "C:\Miniconda3\envs\test\Lib\site-packages\pluggy\_result.py", line 99, in get_result
raise exc.with_traceback(exc.__traceback__)
File "C:\Miniconda3\envs\test\Lib\site-packages\pluggy\_callers.py", line 166, in _multicall
teardown.throw(outcome._exception)
File "C:\Miniconda3\envs\test\Lib\site-packages\_pytest\threadexception.py", line 87, in pytest_runtest_call
yield from thread_exception_runtest_hook()
File "C:\Miniconda3\envs\test\Lib\site-packages\_pytest\threadexception.py", line 63, in thread_exception_runtest_hook
yield
File "C:\Miniconda3\envs\test\Lib\site-packages\pluggy\_callers.py", line 166, in _multicall
teardown.throw(outcome._exception)
File "C:\Miniconda3\envs\test\Lib\site-packages\_pytest\unraisableexception.py", line 90, in pytest_runtest_call
yield from unraisable_exception_runtest_hook()
File "C:\Miniconda3\envs\test\Lib\site-packages\_pytest\unraisableexception.py", line 65, in unraisable_exception_runtest_hook
yield
File "C:\Miniconda3\envs\test\Lib\site-packages\pluggy\_callers.py", line 166, in _multicall
teardown.throw(outcome._exception)
File "C:\Miniconda3\envs\test\Lib\site-packages\_pytest\logging.py", line 839, in pytest_runtest_call
yield from self._runtest_for(item, "call")
File "C:\Miniconda3\envs\test\Lib\site-packages\_pytest\logging.py", line 822, in _runtest_for
yield
File "C:\Miniconda3\envs\test\Lib\site-packages\pluggy\_callers.py", line 166, in _multicall
teardown.throw(outcome._exception)
File "C:\Miniconda3\envs\test\Lib\site-packages\_pytest\capture.py", line 882, in pytest_runtest_call
return (yield)
^^^^^
File "C:\Miniconda3\envs\test\Lib\site-packages\pluggy\_callers.py", line 166, in _multicall
teardown.throw(outcome._exception)
File "C:\Miniconda3\envs\test\Lib\site-packages\_pytest\skipping.py", line 256, in pytest_runtest_call
return (yield)
^^^^^
File "C:\Miniconda3\envs\test\Lib\site-packages\pluggy\_callers.py", line 102, in _multicall
res = hook_impl.function(*args)
^^^^^^^^^^^^^^^^^^^^^^^^^
File "C:\Miniconda3\envs\test\Lib\site-packages\_pytest\runner.py", line 182, in pytest_runtest_call
raise e
File "C:\Miniconda3\envs\test\Lib\site-packages\_pytest\runner.py", line 174, in pytest_runtest_call
item.runtest()
File "C:\Miniconda3\envs\test\Lib\site-packages\_pytest\python.py", line 1831, in runtest
self.ihook.pytest_pyfunc_call(pyfuncitem=self)
File "C:\Miniconda3\envs\test\Lib\site-packages\pluggy\_hooks.py", line 501, in __call__
return self._hookexec(self.name, self._hookimpls.copy(), kwargs, firstresult)
^^^^^^^^^^^^^^^^^^^^^^^^^^^^^^^^^^^^^^^^^^^^^^^^^^^^^^^^^^^^^^^^^^^^^^
File "C:\Miniconda3\envs\test\Lib\site-packages\pluggy\_manager.py", line 119, in _hookexec
return self._inner_hookexec(hook_name, methods, kwargs, firstresult)
^^^^^^^^^^^^^^^^^^^^^^^^^^^^^^^^^^^^^^^^^^^^^^^^^^^^^^^^^^^^^
File "C:\Miniconda3\envs\test\Lib\site-packages\pluggy\_callers.py", line 138, in _multicall
raise exception.with_traceback(exception.__traceback__)
File "C:\Miniconda3\envs\test\Lib\site-packages\pluggy\_callers.py", line 102, in _multicall
res = hook_impl.function(*args)
^^^^^^^^^^^^^^^^^^^^^^^^^
File "C:\Miniconda3\envs\test\Lib\site-packages\_pytest\python.py", line 194, in pytest_pyfunc_call
result = testfunction(**testargs)
^^^^^^^^^^^^^^^^^^^^^^^^
File "C:\Miniconda3\envs\test\Lib\site-packages\obspy\clients\fdsn\tests\test_eidaws_routing_client.py", line 135, in test_error_handling
self.client.get_waveforms(
File "C:\Miniconda3\envs\test\Lib\site-packages\decorator.py", line 232, in fun
return caller(func, *(extras + args), **kw)
^^^^^^^^^^^^^^^^^^^^^^^^^^^^^^^^^^^^
File "C:\Miniconda3\envs\test\Lib\site-packages\obspy\clients\fdsn\routing\routing_client.py", line 84, in _assert_filename_not_in_kwargs
return f(*args, **kwargs)
^^^^^^^^^^^^^^^^^^
File "C:\Miniconda3\envs\test\Lib\site-packages\decorator.py", line 232, in fun
return caller(func, *(extras + args), **kw)
^^^^^^^^^^^^^^^^^^^^^^^^^^^^^^^^^^^^
File "C:\Miniconda3\envs\test\Lib\site-packages\obspy\clients\fdsn\routing\routing_client.py", line 91, in _assert_attach_response_not_in_kwargs
return f(*args, **kwargs)
^^^^^^^^^^^^^^^^^^
File "C:\Miniconda3\envs\test\Lib\site-packages\obspy\clients\fdsn\routing\routing_client.py", line 335, in get_waveforms
return self.get_waveforms_bulk([bulk], **kwargs)
^^^^^^^^^^^^^^^^^^^^^^^^^^^^^^^^^^^^^^^^^
File "C:\Miniconda3\envs\test\Lib\site-packages\decorator.py", line 232, in fun
return caller(func, *(extras + args), **kw)
^^^^^^^^^^^^^^^^^^^^^^^^^^^^^^^^^^^^
File "C:\Miniconda3\envs\test\Lib\site-packages\obspy\clients\fdsn\routing\routing_client.py", line 84, in _assert_filename_not_in_kwargs
return f(*args, **kwargs)
^^^^^^^^^^^^^^^^^^
File "C:\Miniconda3\envs\test\Lib\site-packages\decorator.py", line 232, in fun
return caller(func, *(extras + args), **kw)
^^^^^^^^^^^^^^^^^^^^^^^^^^^^^^^^^^^^
File "C:\Miniconda3\envs\test\Lib\site-packages\obspy\clients\fdsn\routing\routing_client.py", line 91, in _assert_attach_response_not_in_kwargs
return f(*args, **kwargs)
^^^^^^^^^^^^^^^^^^
File "C:\Miniconda3\envs\test\Lib\site-packages\obspy\clients\fdsn\routing\eidaws_routing_client.py", line 99, in get_waveforms_bulk
inv = self.get_stations_bulk(_b, level="channel", **kwargs)
^^^^^^^^^^^^^^^^^^^^^^^^^^^^^^^^^^^^^^^^^^^^^^^^^^^^^
File "C:\Miniconda3\envs\test\Lib\site-packages\decorator.py", line 232, in fun
return caller(func, *(extras + args), **kw)
^^^^^^^^^^^^^^^^^^^^^^^^^^^^^^^^^^^^
File "C:\Miniconda3\envs\test\Lib\site-packages\obspy\clients\fdsn\routing\routing_client.py", line 77, in _assert_format_not_in_kwargs
return f(*args, **kwargs)
^^^^^^^^^^^^^^^^^^
File "C:\Miniconda3\envs\test\Lib\site-packages\decorator.py", line 232, in fun
return caller(func, *(extras + args), **kw)
^^^^^^^^^^^^^^^^^^^^^^^^^^^^^^^^^^^^
File "C:\Miniconda3\envs\test\Lib\site-packages\obspy\clients\fdsn\routing\routing_client.py", line 84, in _assert_filename_not_in_kwargs
return f(*args, **kwargs)
^^^^^^^^^^^^^^^^^^
File "C:\Miniconda3\envs\test\Lib\site-packages\obspy\clients\fdsn\routing\eidaws_routing_client.py", line 175, in get_stations_bulk
r = self._download(self._url + "/query", data=bulk_str,
^^^^^^^^^^^^^^^^^^^^^^^^^^^^^^^^^^^^^^^^^^^^^^^^^^^
File "C:\Miniconda3\envs\test\Lib\site-packages\obspy\clients\base.py", line 249, in _download
self._handle_requests_http_error(r)
File "C:\Miniconda3\envs\test\Lib\site-packages\obspy\clients\fdsn\routing\routing_client.py", line 304, in _handle_requests_http_error
raise_on_error(r.status_code, buf)
File "C:\Miniconda3\envs\test\Lib\site-packages\obspy\clients\fdsn\client.py", line 1802, in raise_on_error
server_info = data.decode('ASCII', errors='ignore')
^^^^^^^^^^^
AttributeError: '_io.BytesIO' object has no attribute 'decode'
Traceback (most recent call last):
File "C:\Miniconda3\envs\test\Lib\site-packages\obspy\clients\iris\client.py", line 331, in timeseries
data = self._fetch("timeseries", param_list=filter, **kwargs)
^^^^^^^^^^^^^^^^^^^^^^^^^^^^^^^^^^^^^^^^^^^^^^^^^^^^^^
File "C:\Miniconda3\envs\test\Lib\site-packages\obspy\clients\iris\client.py", line 124, in _fetch
response = urllib_request.urlopen(req, timeout=self.timeout)
^^^^^^^^^^^^^^^^^^^^^^^^^^^^^^^^^^^^^^^^^^^^^^^^^
File "C:\Miniconda3\envs\test\Lib\urllib\request.py", line 215, in urlopen
return opener.open(url, data, timeout)
^^^^^^^^^^^^^^^^^^^^^^^^^^^^^^^
File "C:\Miniconda3\envs\test\Lib\urllib\request.py", line 521, in open
response = meth(req, response)
^^^^^^^^^^^^^^^^^^^
File "C:\Miniconda3\envs\test\Lib\urllib\request.py", line 630, in http_response
response = self.parent.error(
^^^^^^^^^^^^^^^^^^
File "C:\Miniconda3\envs\test\Lib\urllib\request.py", line 559, in error
return self._call_chain(*args)
^^^^^^^^^^^^^^^^^^^^^^^
File "C:\Miniconda3\envs\test\Lib\urllib\request.py", line 492, in _call_chain
result = func(*args)
^^^^^^^^^^^
File "C:\Miniconda3\envs\test\Lib\urllib\request.py", line 639, in http_error_default
raise HTTPError(req.full_url, code, msg, hdrs, fp)
urllib.error.HTTPError: HTTP Error 500:
During handling of the above exception, another exception occurred:
Traceback (most recent call last):
File "C:\Miniconda3\envs\test\Lib\site-packages\_pytest\runner.py", line 346, in from_call
result: Optional[TResult] = func()
^^^^^^
File "C:\Miniconda3\envs\test\Lib\site-packages\_pytest\runner.py", line 267, in <lambda>
lambda: ihook(item=item, **kwds), when=when, reraise=reraise
^^^^^^^^^^^^^^^^^^^^^^^^
File "C:\Miniconda3\envs\test\Lib\site-packages\pluggy\_hooks.py", line 501, in __call__
return self._hookexec(self.name, self._hookimpls.copy(), kwargs, firstresult)
^^^^^^^^^^^^^^^^^^^^^^^^^^^^^^^^^^^^^^^^^^^^^^^^^^^^^^^^^^^^^^^^^^^^^^
File "C:\Miniconda3\envs\test\Lib\site-packages\pluggy\_manager.py", line 119, in _hookexec
return self._inner_hookexec(hook_name, methods, kwargs, firstresult)
^^^^^^^^^^^^^^^^^^^^^^^^^^^^^^^^^^^^^^^^^^^^^^^^^^^^^^^^^^^^^
File "C:\Miniconda3\envs\test\Lib\site-packages\pluggy\_callers.py", line 181, in _multicall
return outcome.get_result()
^^^^^^^^^^^^^^^^^^^^
File "C:\Miniconda3\envs\test\Lib\site-packages\pluggy\_result.py", line 99, in get_result
raise exc.with_traceback(exc.__traceback__)
File "C:\Miniconda3\envs\test\Lib\site-packages\pluggy\_callers.py", line 166, in _multicall
teardown.throw(outcome._exception)
File "C:\Miniconda3\envs\test\Lib\site-packages\_pytest\threadexception.py", line 87, in pytest_runtest_call
yield from thread_exception_runtest_hook()
File "C:\Miniconda3\envs\test\Lib\site-packages\_pytest\threadexception.py", line 63, in thread_exception_runtest_hook
yield
File "C:\Miniconda3\envs\test\Lib\site-packages\pluggy\_callers.py", line 166, in _multicall
teardown.throw(outcome._exception)
File "C:\Miniconda3\envs\test\Lib\site-packages\_pytest\unraisableexception.py", line 90, in pytest_runtest_call
yield from unraisable_exception_runtest_hook()
File "C:\Miniconda3\envs\test\Lib\site-packages\_pytest\unraisableexception.py", line 65, in unraisable_exception_runtest_hook
yield
File "C:\Miniconda3\envs\test\Lib\site-packages\pluggy\_callers.py", line 166, in _multicall
teardown.throw(outcome._exception)
File "C:\Miniconda3\envs\test\Lib\site-packages\_pytest\logging.py", line 839, in pytest_runtest_call
yield from self._runtest_for(item, "call")
File "C:\Miniconda3\envs\test\Lib\site-packages\_pytest\logging.py", line 822, in _runtest_for
yield
File "C:\Miniconda3\envs\test\Lib\site-packages\pluggy\_callers.py", line 166, in _multicall
teardown.throw(outcome._exception)
File "C:\Miniconda3\envs\test\Lib\site-packages\_pytest\capture.py", line 882, in pytest_runtest_call
return (yield)
^^^^^
File "C:\Miniconda3\envs\test\Lib\site-packages\pluggy\_callers.py", line 166, in _multicall
teardown.throw(outcome._exception)
File "C:\Miniconda3\envs\test\Lib\site-packages\_pytest\skipping.py", line 256, in pytest_runtest_call
return (yield)
^^^^^
File "C:\Miniconda3\envs\test\Lib\site-packages\pluggy\_callers.py", line 102, in _multicall
res = hook_impl.function(*args)
^^^^^^^^^^^^^^^^^^^^^^^^^
File "C:\Miniconda3\envs\test\Lib\site-packages\_pytest\runner.py", line 182, in pytest_runtest_call
raise e
File "C:\Miniconda3\envs\test\Lib\site-packages\_pytest\runner.py", line 174, in pytest_runtest_call
item.runtest()
File "C:\Miniconda3\envs\test\Lib\site-packages\_pytest\python.py", line 1831, in runtest
self.ihook.pytest_pyfunc_call(pyfuncitem=self)
File "C:\Miniconda3\envs\test\Lib\site-packages\pluggy\_hooks.py", line 501, in __call__
return self._hookexec(self.name, self._hookimpls.copy(), kwargs, firstresult)
^^^^^^^^^^^^^^^^^^^^^^^^^^^^^^^^^^^^^^^^^^^^^^^^^^^^^^^^^^^^^^^^^^^^^^
File "C:\Miniconda3\envs\test\Lib\site-packages\pluggy\_manager.py", line 119, in _hookexec
return self._inner_hookexec(hook_name, methods, kwargs, firstresult)
^^^^^^^^^^^^^^^^^^^^^^^^^^^^^^^^^^^^^^^^^^^^^^^^^^^^^^^^^^^^^
File "C:\Miniconda3\envs\test\Lib\site-packages\pluggy\_callers.py", line 138, in _multicall
raise exception.with_traceback(exception.__traceback__)
File "C:\Miniconda3\envs\test\Lib\site-packages\pluggy\_callers.py", line 102, in _multicall
res = hook_impl.function(*args)
^^^^^^^^^^^^^^^^^^^^^^^^^
File "C:\Miniconda3\envs\test\Lib\site-packages\_pytest\python.py", line 194, in pytest_pyfunc_call
result = testfunction(**testargs)
^^^^^^^^^^^^^^^^^^^^^^^^
File "C:\Miniconda3\envs\test\Lib\site-packages\obspy\clients\iris\tests\test_client.py", line 268, in test_timeseries
st2 = client.timeseries("IU", "ANMO", "00", "BHZ", t1, t2,
^^^^^^^^^^^^^^^^^^^^^^^^^^^^^^^^^^^^^^^^^^^^^^^^^^^^
File "C:\Miniconda3\envs\test\Lib\site-packages\obspy\clients\iris\client.py", line 335, in timeseries
raise Exception(msg)
Exception: No waveform data available (HTTPError: HTTP Error 500: )
200 Supports ``fnmatch`` wildcards, e.g. ``*`` and ``?``, in ``network``,
201 ``station``, ``location`` and ``channel``.
202
203 >>> client = Client('rtserver.ipgp.fr')
204 >>> info = client.get_info(station="FDFM")
205 >>> print(info)
206 [('G', 'FDFM')]
207 >>> info = client.get_info(station="FD?M", channel='*Z',
208 ... level='channel')
209 >>> print(info) # doctest: +NORMALIZE_WHITESPACE
Expected:
[('G', 'FDFM', '00', 'BHZ'), ('G', 'FDFM', '00', 'HHZ'),
('G', 'FDFM', '00', 'HNZ'), ('G', 'FDFM', '00', 'LHZ'),
('G', 'FDFM', '10', 'BHZ'), ('G', 'FDFM', '10', 'HHZ'),
('G', 'FDFM', '10', 'LHZ')]
Got:
[('G', 'FDFM', '00', 'BHZ'), ('G', 'FDFM', '00', 'HHZ'), ('G', 'FDFM', '00', 'HNZ'), ('G', 'FDFM', '00', 'LHZ')]
C:\Miniconda3\envs\test\Lib\site-packages\obspy\clients\seedlink\basic_client.py:209: DocTestFailure
078 >>> print(st) # doctest: +ELLIPSIS
079 1 Trace(s) in Stream:
080 G.FDFM.00.BHZ | 20... | 20.0 Hz, ... samples
081
082 Most servers support '?' single-character wildcard in location and
083 channel code fields:
084
085 >>> st = client.get_waveforms("G", "FDFM", "??", "B??", t, t + 5)
086 >>> st = st.sort(reverse=True)
087 >>> print(st) # doctest: +ELLIPSIS
Differences (unified diff with -expected +actual):
@@ -1,7 +1,4 @@
-6 Trace(s) in Stream:
-G.FDFM.10.BHZ | 20... | 20.0 Hz, ... samples
-G.FDFM.10.BHN | 20... | 20.0 Hz, ... samples
-G.FDFM.10.BHE | 20... | 20.0 Hz, ... samples
-G.FDFM.00.BHZ | 20... | 20.0 Hz, ... samples
-G.FDFM.00.BHN | 20... | 20.0 Hz, ... samples
-G.FDFM.00.BHE | 20... | 20.0 Hz, ... samples
+3 Trace(s) in Stream:
+G.FDFM.00.BHZ | 2024-02-23T12:32:09.950000Z - 2024-02-23T12:32:14.950000Z | 20.0 Hz, 101 samples
+G.FDFM.00.BHN | 2024-02-23T12:32:09.950000Z - 2024-02-23T12:32:14.950000Z | 20.0 Hz, 101 samples
+G.FDFM.00.BHE | 2024-02-23T12:32:09.950000Z - 2024-02-23T12:32:14.950000Z | 20.0 Hz, 101 samples
C:\Miniconda3\envs\test\Lib\site-packages\obspy\clients\seedlink\basic_client.py:87: DocTestFailure

Skipped tests (5)

Submodule Test Skip message
clients.fdsn clients/fdsn/tests/test_client.py::TestClient::test_trim_stream_after_get_waveform Skipped: data no longer available
clients.fdsn clients/fdsn/tests/test_client.py::TestClient::test_eida_token_resolution Skipped: Token is expired
clients.seedlink clients/seedlink/tests/test_slclient.py::TestSLClient::test_info Skipped: test must be started manually
clients.seedlink clients/seedlink/tests/test_slclient.py::TestSLClient::test_time_window Skipped: test must be started manually
clients.seedlink clients/seedlink/tests/test_slclient.py::TestSLClient::test_issue708 Skipped: test must be started manually

Slowest tests (20)

Runtime Test
12.921s clients/fdsn/tests/test_eidaws_routing_client.py::TestEIDAWSRoutingClient::test_get_waveforms_integration_test
9.036s clients/fdsn/tests/test_client.py::TestClient::test_irisph5_event
8.077s clients/syngine/tests/test_client.py::TestClient::test_get_available_models
7.736s clients/fdsn/tests/test_client.py::TestClient::test_dataselect_bulk
7.327s clients/fdsn/tests/test_mass_downloader.py::TestDownloadHelper::test_download_method
4.298s clients/fdsn/tests/test_client.py::TestClient::test_iris_example_queries_dataselect
4.065s clients/syngine/tests/test_client.py::TestClient::test_get_waveforms
3.876s clients/iris/tests/test_client.py::TestClient::test_evalresp
3.644s clients/fdsn/tests/test_client.py::TestClient::test_iris_example_queries_dataselect_discover_services_false
3.490s clients/nrl/client.py::obspy.clients.nrl.client.NRL.get_response
3.389s clients/iris/tests/test_client.py::TestClient::test_resp
3.133s clients/syngine/__init__.py::obspy.clients.syngine
3.095s clients/fdsn/tests/test_client.py::TestClient::test_redirection_auth
3.004s clients/fdsn/tests/test_client.py::TestClient::test_redirection
2.864s clients/fdsn/client.py::obspy.clients.fdsn.client.Client.get_waveforms
2.369s clients/seedlink/tests/test_basic_client.py::TestClient::test_multiple_waveform_requests_with_multiple_info_requests
2.279s clients/fdsn/client.py::obspy.clients.fdsn.client.Client.get_waveforms_bulk
2.114s clients/iris/tests/test_client.py::TestClient::test_flinnengdahl
2.073s clients/syngine/client.py::obspy.clients.syngine.client.Client.get_waveforms_bulk
2.027s clients/fdsn/tests/test_federator_routing_client.py::TestFederatorRoutingClient::test_get_waveforms_integration_test

Warnings (4)

Stage Filename Category Message
runtest C:\Miniconda3\envs\test\Lib\site-packages\obspy\clients\fdsn\routing\routing_client.py:99 UserWarning Failed to download data of type 'station' from 'https://orfeus-eu.org' due to: Traceback (most recent call last): File "C:\Miniconda3\envs\test\Lib\site-packages\obspy\clients\fdsn\routing\routing_client.py", line 96, in _try_download_bulk return _download_bulk(r) ^^^^^^^^^^^^^^^^^ File "C:\Miniconda3\envs\test\Lib\site-packages\obspy\clients\fdsn\routing\routing_client.py", line 139, in _download_bulk return fct(bulk_str + r["bulk_str"]) ^^^^^^^^^^^^^^^^^^^^^^^^^^^^^ File "C:\Miniconda3\envs\test\Lib\site-packages\obspy\clients\fdsn\client.py", line 1249, in get_stations_bulk data_stream = self._download( ^^^^^^^^^^^^^^^ File "C:\Miniconda3\envs\test\Lib\site-packages\obspy\clients\fdsn\client.py", line 1486, in _download raise_on_error(code, data) File "C:\Miniconda3\envs\test\Lib\site-packages\obspy\clients\fdsn\client.py", line 1802, in raise_on_error server_info = data.decode('ASCII', errors='ignore') ^^^^^^^^^^^ AttributeError: '_io.BytesIO' object has no attribute 'decode'
runtest C:\Miniconda3\envs\test\Lib\site-packages\obspy\clients\fdsn\routing\routing_client.py:99 UserWarning Failed to download data of type 'waveform' from 'https://webservices.ingv.it' due to: Traceback (most recent call last): File "C:\Miniconda3\envs\test\Lib\site-packages\obspy\clients\fdsn\routing\routing_client.py", line 96, in _try_download_bulk return _download_bulk(r) ^^^^^^^^^^^^^^^^^ File "C:\Miniconda3\envs\test\Lib\site-packages\obspy\clients\fdsn\routing\routing_client.py", line 139, in _download_bulk return fct(bulk_str + r["bulk_str"]) ^^^^^^^^^^^^^^^^^^^^^^^^^^^^^ File "C:\Miniconda3\envs\test\Lib\site-packages\obspy\clients\fdsn\client.py", line 1051, in get_waveforms_bulk data_stream = self._download( ^^^^^^^^^^^^^^^ File "C:\Miniconda3\envs\test\Lib\site-packages\obspy\clients\fdsn\client.py", line 1486, in _download raise_on_error(code, data) File "C:\Miniconda3\envs\test\Lib\site-packages\obspy\clients\fdsn\client.py", line 1802, in raise_on_error server_info = data.decode('ASCII', errors='ignore') ^^^^^^^^^^^ AttributeError: '_io.BytesIO' object has no attribute 'decode'
runtest C:\Miniconda3\envs\test\Lib\site-packages\obspy\clients\fdsn\routing\routing_client.py:99 UserWarning Failed to download data of type 'waveform' from 'https://eida-sc3.infp.ro' due to: Traceback (most recent call last): File "C:\Miniconda3\envs\test\Lib\site-packages\obspy\clients\fdsn\routing\routing_client.py", line 96, in _try_download_bulk return _download_bulk(r) ^^^^^^^^^^^^^^^^^ File "C:\Miniconda3\envs\test\Lib\site-packages\obspy\clients\fdsn\routing\routing_client.py", line 139, in _download_bulk return fct(bulk_str + r["bulk_str"]) ^^^^^^^^^^^^^^^^^^^^^^^^^^^^^ File "C:\Miniconda3\envs\test\Lib\site-packages\obspy\clients\fdsn\client.py", line 1051, in get_waveforms_bulk data_stream = self._download( ^^^^^^^^^^^^^^^ File "C:\Miniconda3\envs\test\Lib\site-packages\obspy\clients\fdsn\client.py", line 1486, in _download raise_on_error(code, data) File "C:\Miniconda3\envs\test\Lib\site-packages\obspy\clients\fdsn\client.py", line 1802, in raise_on_error server_info = data.decode('ASCII', errors='ignore') ^^^^^^^^^^^ AttributeError: '_io.BytesIO' object has no attribute 'decode'
runtest C:\Miniconda3\envs\test\Lib\site-packages\_pytest\threadexception.py:77 PytestUnhandledThreadExceptionWarning Exception in thread Thread-103 Traceback (most recent call last): File "C:\Miniconda3\envs\test\Lib\threading.py", line 1073, in _bootstrap_inner self.run() File "C:\Miniconda3\envs\test\Lib\site-packages\obspy\clients\fdsn\client.py", line 1543, in run code, data = download_url( ^^^^^^^^^^ ValueError: not enough values to unpack (expected 2, got 0)