#137726 Report by node gh-actions covering 200 tests from 60 modules resulted into 20 errors

Report

ObsPy version
1.0.3.post0+5438.g50396e06bc.…
GitHub Pull Request
-
Report file
JSON document
Total runtime
148.0 sec
Report date/time
March 16, 2024, 5:52 a.m.

System / Python

Architecture
64bit
Machine
AMD64
Node
gh-actions
Processor
AMD64 Family 25 Model 1 Stepping 1, AuthenticAMD
Python Compiler
MSC v.1937 64 bit (AMD64)
Python Implementation
CPython
Python Version
3.11.8
Release
10
System
Windows
Version
10.0.20348

Dependencies

cartopy
0.22.0
decorator
5.1.1
flake8
---
geographiclib
2.0
lxml
5.1.0
matplotlib
3.8.3
numpy
1.26.4
obspy
1.0.3.post0+5438.g50396e06bc.rizac.master
pyproj
3.6.1
pytest
8.1.1
pytest-json-report
1.5.0
requests
2.31.0
scipy
1.10.1
setuptools
69.2.0
shapefile
---
sqlalchemy
1.4.49

Modules (60)

Module Errors / Failures Tracebacks
obspy.clients.earthworm 1 1
obspy.clients.fdsn 15 2 3 4 5 6 7 8 9 10 11 12 13 14 15 16
obspy.clients.filesystem Not tested -
obspy.clients.iris 1 17
obspy.clients.neic - -
obspy.clients.nrl - -
obspy.clients.seedlink 2 18 19
obspy.clients.syngine 1 20
obspy.core - -
obspy.core.event Not tested -
obspy.core.inventory Not tested -
obspy.core.util Not tested -
obspy.geodetics Not tested -
obspy.imaging Not tested -
obspy.io.ah Not tested -
obspy.io.alsep Not tested -
obspy.io.arclink Not tested -
obspy.io.ascii Not tested -
obspy.io.cmtsolution Not tested -
obspy.io.cnv Not tested -
obspy.io.css Not tested -
obspy.io.csv Not tested -
obspy.io.dmx Not tested -
obspy.io.focmec Not tested -
obspy.io.gcf Not tested -
obspy.io.gse2 Not tested -
obspy.io.hypodd Not tested -
obspy.io.iaspei Not tested -
obspy.io.json Not tested -
obspy.io.kinemetrics Not tested -
obspy.io.kml Not tested -
obspy.io.mseed Not tested -
obspy.io.ndk Not tested -
obspy.io.nied Not tested -
obspy.io.nlloc Not tested -
obspy.io.nordic Not tested -
obspy.io.pdas Not tested -
obspy.io.pde Not tested -
obspy.io.quakeml Not tested -
obspy.io.reftek Not tested -
obspy.io.rg16 Not tested -
obspy.io.sac Not tested -
obspy.io.scardec Not tested -
obspy.io.seg2 Not tested -
obspy.io.segy Not tested -
obspy.io.seisan Not tested -
obspy.io.seiscomp Not tested -
obspy.io.sh Not tested -
obspy.io.shapefile Not tested -
obspy.io.stationtxt Not tested -
obspy.io.stationxml Not tested -
obspy.io.wav Not tested -
obspy.io.win Not tested -
obspy.io.xseed Not tested -
obspy.io.y Not tested -
obspy.io.zmap Not tested -
obspy.realtime Not tested -
obspy.scripts Not tested -
obspy.signal Not tested -
obspy.taup Not tested -
Summary 20 20

Tracebacks (20)

Traceback (most recent call last):
File "C:\Miniconda3\envs\test\Lib\site-packages\_pytest\runner.py", line 340, in from_call
result: Optional[TResult] = func()
^^^^^^
File "C:\Miniconda3\envs\test\Lib\site-packages\_pytest\runner.py", line 240, in <lambda>
lambda: runtest_hook(item=item, **kwds), when=when, reraise=reraise
^^^^^^^^^^^^^^^^^^^^^^^^^^^^^^^
File "C:\Miniconda3\envs\test\Lib\site-packages\pluggy\_hooks.py", line 501, in __call__
return self._hookexec(self.name, self._hookimpls.copy(), kwargs, firstresult)
^^^^^^^^^^^^^^^^^^^^^^^^^^^^^^^^^^^^^^^^^^^^^^^^^^^^^^^^^^^^^^^^^^^^^^
File "C:\Miniconda3\envs\test\Lib\site-packages\pluggy\_manager.py", line 119, in _hookexec
return self._inner_hookexec(hook_name, methods, kwargs, firstresult)
^^^^^^^^^^^^^^^^^^^^^^^^^^^^^^^^^^^^^^^^^^^^^^^^^^^^^^^^^^^^^
File "C:\Miniconda3\envs\test\Lib\site-packages\pluggy\_callers.py", line 181, in _multicall
return outcome.get_result()
^^^^^^^^^^^^^^^^^^^^
File "C:\Miniconda3\envs\test\Lib\site-packages\pluggy\_result.py", line 99, in get_result
raise exc.with_traceback(exc.__traceback__)
File "C:\Miniconda3\envs\test\Lib\site-packages\pluggy\_callers.py", line 166, in _multicall
teardown.throw(outcome._exception)
File "C:\Miniconda3\envs\test\Lib\site-packages\_pytest\threadexception.py", line 87, in pytest_runtest_call
yield from thread_exception_runtest_hook()
File "C:\Miniconda3\envs\test\Lib\site-packages\_pytest\threadexception.py", line 63, in thread_exception_runtest_hook
yield
File "C:\Miniconda3\envs\test\Lib\site-packages\pluggy\_callers.py", line 166, in _multicall
teardown.throw(outcome._exception)
File "C:\Miniconda3\envs\test\Lib\site-packages\_pytest\unraisableexception.py", line 90, in pytest_runtest_call
yield from unraisable_exception_runtest_hook()
File "C:\Miniconda3\envs\test\Lib\site-packages\_pytest\unraisableexception.py", line 65, in unraisable_exception_runtest_hook
yield
File "C:\Miniconda3\envs\test\Lib\site-packages\pluggy\_callers.py", line 166, in _multicall
teardown.throw(outcome._exception)
File "C:\Miniconda3\envs\test\Lib\site-packages\_pytest\logging.py", line 849, in pytest_runtest_call
yield from self._runtest_for(item, "call")
File "C:\Miniconda3\envs\test\Lib\site-packages\_pytest\logging.py", line 832, in _runtest_for
yield
File "C:\Miniconda3\envs\test\Lib\site-packages\pluggy\_callers.py", line 166, in _multicall
teardown.throw(outcome._exception)
File "C:\Miniconda3\envs\test\Lib\site-packages\_pytest\capture.py", line 883, in pytest_runtest_call
return (yield)
^^^^^
File "C:\Miniconda3\envs\test\Lib\site-packages\pluggy\_callers.py", line 166, in _multicall
teardown.throw(outcome._exception)
File "C:\Miniconda3\envs\test\Lib\site-packages\_pytest\skipping.py", line 256, in pytest_runtest_call
return (yield)
^^^^^
File "C:\Miniconda3\envs\test\Lib\site-packages\pluggy\_callers.py", line 102, in _multicall
res = hook_impl.function(*args)
^^^^^^^^^^^^^^^^^^^^^^^^^
File "C:\Miniconda3\envs\test\Lib\site-packages\_pytest\runner.py", line 182, in pytest_runtest_call
raise e
File "C:\Miniconda3\envs\test\Lib\site-packages\_pytest\runner.py", line 172, in pytest_runtest_call
item.runtest()
File "C:\Miniconda3\envs\test\Lib\site-packages\_pytest\python.py", line 1772, in runtest
self.ihook.pytest_pyfunc_call(pyfuncitem=self)
File "C:\Miniconda3\envs\test\Lib\site-packages\pluggy\_hooks.py", line 501, in __call__
return self._hookexec(self.name, self._hookimpls.copy(), kwargs, firstresult)
^^^^^^^^^^^^^^^^^^^^^^^^^^^^^^^^^^^^^^^^^^^^^^^^^^^^^^^^^^^^^^^^^^^^^^
File "C:\Miniconda3\envs\test\Lib\site-packages\pluggy\_manager.py", line 119, in _hookexec
return self._inner_hookexec(hook_name, methods, kwargs, firstresult)
^^^^^^^^^^^^^^^^^^^^^^^^^^^^^^^^^^^^^^^^^^^^^^^^^^^^^^^^^^^^^
File "C:\Miniconda3\envs\test\Lib\site-packages\pluggy\_callers.py", line 138, in _multicall
raise exception.with_traceback(exception.__traceback__)
File "C:\Miniconda3\envs\test\Lib\site-packages\pluggy\_callers.py", line 102, in _multicall
res = hook_impl.function(*args)
^^^^^^^^^^^^^^^^^^^^^^^^^
File "C:\Miniconda3\envs\test\Lib\site-packages\_pytest\python.py", line 195, in pytest_pyfunc_call
result = testfunction(**testargs)
^^^^^^^^^^^^^^^^^^^^^^^^
File "C:\Miniconda3\envs\test\Lib\site-packages\decorator.py", line 232, in fun
return caller(func, *(extras + args), **kw)
^^^^^^^^^^^^^^^^^^^^^^^^^^^^^^^^^^^^
File "C:\Miniconda3\envs\test\Lib\site-packages\obspy\core\util\decorator.py", line 119, in skip_on_network_error
return func(*args, **kwargs)
^^^^^^^^^^^^^^^^^^^^^
File "C:\Miniconda3\envs\test\Lib\site-packages\obspy\clients\earthworm\tests\test_client.py", line 111, in test_get_waveform_no_cleanup
assert len(ew_stream) >= 2
AssertionError: assert 1 >= 2
+ where 1 = len(<obspy.core.stream.Stream object at 0x000001CA280E9290>)
786 IU.ANMO.10.LHZ | 2010-02-27T06:30:00.069538Z - ... | 1.0 Hz, 5 samples
787
788 Use ``attach_response=True`` to automatically add response information
789 to each trace. This can be used to remove response using
790 :meth:`~obspy.core.stream.Stream.remove_response`.
791
792 >>> t = UTCDateTime("2012-12-14T10:36:01.6Z")
793 >>> st = client.get_waveforms("TA", "E42A", "*", "BH?", t+300, t+400,
794 ... attach_response=True)
795 >>> st.remove_response(output="VEL") # doctest: +ELLIPSIS
UNEXPECTED EXCEPTION: ValueError('No response information found. Use `inventory` parameter to specify an inventory with response information.')
Traceback (most recent call last):
File "C:\Miniconda3\envs\test\Lib\doctest.py", line 1355, in __run
exec(compile(example.source, filename, "single",
File "<doctest obspy.clients.fdsn.client.Client.get_waveforms[9]>", line 1, in <module>
File "C:\Miniconda3\envs\test\Lib\site-packages\obspy\core\stream.py", line 3253, in remove_response
tr.remove_response(*args, **kwargs)
File "C:\Miniconda3\envs\test\Lib\site-packages\decorator.py", line 232, in fun
return caller(func, *(extras + args), **kw)
^^^^^^^^^^^^^^^^^^^^^^^^^^^^^^^^^^^^
File "C:\Miniconda3\envs\test\Lib\site-packages\obspy\core\trace.py", line 282, in _add_processing_info
result = func(*args, **kwargs)
^^^^^^^^^^^^^^^^^^^^^
File "C:\Miniconda3\envs\test\Lib\site-packages\obspy\core\trace.py", line 2837, in remove_response
response = self._get_response(inventory)
^^^^^^^^^^^^^^^^^^^^^^^^^^^^^
File "C:\Miniconda3\envs\test\Lib\site-packages\obspy\core\trace.py", line 2629, in _get_response
raise ValueError(msg)
ValueError: No response information found. Use `inventory` parameter to specify an inventory with response information.
C:\Miniconda3\envs\test\Lib\site-packages\obspy\clients\fdsn\client.py:795: UnexpectedException
Traceback (most recent call last):
File "C:\Miniconda3\envs\test\Lib\site-packages\_pytest\runner.py", line 340, in from_call
result: Optional[TResult] = func()
^^^^^^
File "C:\Miniconda3\envs\test\Lib\site-packages\_pytest\runner.py", line 240, in <lambda>
lambda: runtest_hook(item=item, **kwds), when=when, reraise=reraise
^^^^^^^^^^^^^^^^^^^^^^^^^^^^^^^
File "C:\Miniconda3\envs\test\Lib\site-packages\pluggy\_hooks.py", line 501, in __call__
return self._hookexec(self.name, self._hookimpls.copy(), kwargs, firstresult)
^^^^^^^^^^^^^^^^^^^^^^^^^^^^^^^^^^^^^^^^^^^^^^^^^^^^^^^^^^^^^^^^^^^^^^
File "C:\Miniconda3\envs\test\Lib\site-packages\pluggy\_manager.py", line 119, in _hookexec
return self._inner_hookexec(hook_name, methods, kwargs, firstresult)
^^^^^^^^^^^^^^^^^^^^^^^^^^^^^^^^^^^^^^^^^^^^^^^^^^^^^^^^^^^^^
File "C:\Miniconda3\envs\test\Lib\site-packages\pluggy\_callers.py", line 181, in _multicall
return outcome.get_result()
^^^^^^^^^^^^^^^^^^^^
File "C:\Miniconda3\envs\test\Lib\site-packages\pluggy\_result.py", line 99, in get_result
raise exc.with_traceback(exc.__traceback__)
File "C:\Miniconda3\envs\test\Lib\site-packages\pluggy\_callers.py", line 166, in _multicall
teardown.throw(outcome._exception)
File "C:\Miniconda3\envs\test\Lib\site-packages\_pytest\threadexception.py", line 87, in pytest_runtest_call
yield from thread_exception_runtest_hook()
File "C:\Miniconda3\envs\test\Lib\site-packages\_pytest\threadexception.py", line 63, in thread_exception_runtest_hook
yield
File "C:\Miniconda3\envs\test\Lib\site-packages\pluggy\_callers.py", line 166, in _multicall
teardown.throw(outcome._exception)
File "C:\Miniconda3\envs\test\Lib\site-packages\_pytest\unraisableexception.py", line 90, in pytest_runtest_call
yield from unraisable_exception_runtest_hook()
File "C:\Miniconda3\envs\test\Lib\site-packages\_pytest\unraisableexception.py", line 65, in unraisable_exception_runtest_hook
yield
File "C:\Miniconda3\envs\test\Lib\site-packages\pluggy\_callers.py", line 166, in _multicall
teardown.throw(outcome._exception)
File "C:\Miniconda3\envs\test\Lib\site-packages\_pytest\logging.py", line 849, in pytest_runtest_call
yield from self._runtest_for(item, "call")
File "C:\Miniconda3\envs\test\Lib\site-packages\_pytest\logging.py", line 832, in _runtest_for
yield
File "C:\Miniconda3\envs\test\Lib\site-packages\pluggy\_callers.py", line 166, in _multicall
teardown.throw(outcome._exception)
File "C:\Miniconda3\envs\test\Lib\site-packages\_pytest\capture.py", line 883, in pytest_runtest_call
return (yield)
^^^^^
File "C:\Miniconda3\envs\test\Lib\site-packages\pluggy\_callers.py", line 166, in _multicall
teardown.throw(outcome._exception)
File "C:\Miniconda3\envs\test\Lib\site-packages\_pytest\skipping.py", line 256, in pytest_runtest_call
return (yield)
^^^^^
File "C:\Miniconda3\envs\test\Lib\site-packages\pluggy\_callers.py", line 102, in _multicall
res = hook_impl.function(*args)
^^^^^^^^^^^^^^^^^^^^^^^^^
File "C:\Miniconda3\envs\test\Lib\site-packages\_pytest\runner.py", line 182, in pytest_runtest_call
raise e
File "C:\Miniconda3\envs\test\Lib\site-packages\_pytest\runner.py", line 172, in pytest_runtest_call
item.runtest()
File "C:\Miniconda3\envs\test\Lib\site-packages\_pytest\python.py", line 1772, in runtest
self.ihook.pytest_pyfunc_call(pyfuncitem=self)
File "C:\Miniconda3\envs\test\Lib\site-packages\pluggy\_hooks.py", line 501, in __call__
return self._hookexec(self.name, self._hookimpls.copy(), kwargs, firstresult)
^^^^^^^^^^^^^^^^^^^^^^^^^^^^^^^^^^^^^^^^^^^^^^^^^^^^^^^^^^^^^^^^^^^^^^
File "C:\Miniconda3\envs\test\Lib\site-packages\pluggy\_manager.py", line 119, in _hookexec
return self._inner_hookexec(hook_name, methods, kwargs, firstresult)
^^^^^^^^^^^^^^^^^^^^^^^^^^^^^^^^^^^^^^^^^^^^^^^^^^^^^^^^^^^^^
File "C:\Miniconda3\envs\test\Lib\site-packages\pluggy\_callers.py", line 138, in _multicall
raise exception.with_traceback(exception.__traceback__)
File "C:\Miniconda3\envs\test\Lib\site-packages\pluggy\_callers.py", line 102, in _multicall
res = hook_impl.function(*args)
^^^^^^^^^^^^^^^^^^^^^^^^^
File "C:\Miniconda3\envs\test\Lib\site-packages\_pytest\python.py", line 195, in pytest_pyfunc_call
result = testfunction(**testargs)
^^^^^^^^^^^^^^^^^^^^^^^^
File "C:\Miniconda3\envs\test\Lib\site-packages\obspy\clients\fdsn\tests\test_client.py", line 382, in test_iris_event_catalog_availability
assert {*self.client.services["available_event_catalogs"]} == \
AssertionError: assert {'GCMT\n ', '...'NEIC PDE\n '} == {'GCMT', 'ISC', 'NEIC PDE'}
Extra items in the left set:
'ISC\n '
'GCMT\n '
'NEIC PDE\n '
Extra items in the right set:
'GCMT'
'ISC'
'NEIC PDE'
Full diff:
{
- 'GCMT',
? -
+ 'GCMT\n'
? ++
+ ' ',
- 'ISC',
? -
+ 'ISC\n'
? ++
+ ' ',
- 'NEIC PDE',
? -
+ 'NEIC PDE\n'
? ++
+ ' ',
}
Traceback (most recent call last):
File "C:\Miniconda3\envs\test\Lib\site-packages\_pytest\runner.py", line 340, in from_call
result: Optional[TResult] = func()
^^^^^^
File "C:\Miniconda3\envs\test\Lib\site-packages\_pytest\runner.py", line 240, in <lambda>
lambda: runtest_hook(item=item, **kwds), when=when, reraise=reraise
^^^^^^^^^^^^^^^^^^^^^^^^^^^^^^^
File "C:\Miniconda3\envs\test\Lib\site-packages\pluggy\_hooks.py", line 501, in __call__
return self._hookexec(self.name, self._hookimpls.copy(), kwargs, firstresult)
^^^^^^^^^^^^^^^^^^^^^^^^^^^^^^^^^^^^^^^^^^^^^^^^^^^^^^^^^^^^^^^^^^^^^^
File "C:\Miniconda3\envs\test\Lib\site-packages\pluggy\_manager.py", line 119, in _hookexec
return self._inner_hookexec(hook_name, methods, kwargs, firstresult)
^^^^^^^^^^^^^^^^^^^^^^^^^^^^^^^^^^^^^^^^^^^^^^^^^^^^^^^^^^^^^
File "C:\Miniconda3\envs\test\Lib\site-packages\pluggy\_callers.py", line 181, in _multicall
return outcome.get_result()
^^^^^^^^^^^^^^^^^^^^
File "C:\Miniconda3\envs\test\Lib\site-packages\pluggy\_result.py", line 99, in get_result
raise exc.with_traceback(exc.__traceback__)
File "C:\Miniconda3\envs\test\Lib\site-packages\pluggy\_callers.py", line 166, in _multicall
teardown.throw(outcome._exception)
File "C:\Miniconda3\envs\test\Lib\site-packages\_pytest\threadexception.py", line 87, in pytest_runtest_call
yield from thread_exception_runtest_hook()
File "C:\Miniconda3\envs\test\Lib\site-packages\_pytest\threadexception.py", line 63, in thread_exception_runtest_hook
yield
File "C:\Miniconda3\envs\test\Lib\site-packages\pluggy\_callers.py", line 166, in _multicall
teardown.throw(outcome._exception)
File "C:\Miniconda3\envs\test\Lib\site-packages\_pytest\unraisableexception.py", line 90, in pytest_runtest_call
yield from unraisable_exception_runtest_hook()
File "C:\Miniconda3\envs\test\Lib\site-packages\_pytest\unraisableexception.py", line 65, in unraisable_exception_runtest_hook
yield
File "C:\Miniconda3\envs\test\Lib\site-packages\pluggy\_callers.py", line 166, in _multicall
teardown.throw(outcome._exception)
File "C:\Miniconda3\envs\test\Lib\site-packages\_pytest\logging.py", line 849, in pytest_runtest_call
yield from self._runtest_for(item, "call")
File "C:\Miniconda3\envs\test\Lib\site-packages\_pytest\logging.py", line 832, in _runtest_for
yield
File "C:\Miniconda3\envs\test\Lib\site-packages\pluggy\_callers.py", line 166, in _multicall
teardown.throw(outcome._exception)
File "C:\Miniconda3\envs\test\Lib\site-packages\_pytest\capture.py", line 883, in pytest_runtest_call
return (yield)
^^^^^
File "C:\Miniconda3\envs\test\Lib\site-packages\pluggy\_callers.py", line 166, in _multicall
teardown.throw(outcome._exception)
File "C:\Miniconda3\envs\test\Lib\site-packages\_pytest\skipping.py", line 256, in pytest_runtest_call
return (yield)
^^^^^
File "C:\Miniconda3\envs\test\Lib\site-packages\pluggy\_callers.py", line 102, in _multicall
res = hook_impl.function(*args)
^^^^^^^^^^^^^^^^^^^^^^^^^
File "C:\Miniconda3\envs\test\Lib\site-packages\_pytest\runner.py", line 182, in pytest_runtest_call
raise e
File "C:\Miniconda3\envs\test\Lib\site-packages\_pytest\runner.py", line 172, in pytest_runtest_call
item.runtest()
File "C:\Miniconda3\envs\test\Lib\site-packages\_pytest\python.py", line 1772, in runtest
self.ihook.pytest_pyfunc_call(pyfuncitem=self)
File "C:\Miniconda3\envs\test\Lib\site-packages\pluggy\_hooks.py", line 501, in __call__
return self._hookexec(self.name, self._hookimpls.copy(), kwargs, firstresult)
^^^^^^^^^^^^^^^^^^^^^^^^^^^^^^^^^^^^^^^^^^^^^^^^^^^^^^^^^^^^^^^^^^^^^^
File "C:\Miniconda3\envs\test\Lib\site-packages\pluggy\_manager.py", line 119, in _hookexec
return self._inner_hookexec(hook_name, methods, kwargs, firstresult)
^^^^^^^^^^^^^^^^^^^^^^^^^^^^^^^^^^^^^^^^^^^^^^^^^^^^^^^^^^^^^
File "C:\Miniconda3\envs\test\Lib\site-packages\pluggy\_callers.py", line 138, in _multicall
raise exception.with_traceback(exception.__traceback__)
File "C:\Miniconda3\envs\test\Lib\site-packages\pluggy\_callers.py", line 102, in _multicall
res = hook_impl.function(*args)
^^^^^^^^^^^^^^^^^^^^^^^^^
File "C:\Miniconda3\envs\test\Lib\site-packages\_pytest\python.py", line 195, in pytest_pyfunc_call
result = testfunction(**testargs)
^^^^^^^^^^^^^^^^^^^^^^^^
File "C:\Miniconda3\envs\test\Lib\site-packages\obspy\clients\fdsn\tests\test_client.py", line 814, in test_help_function_with_iris
assert got[-2].startswith('Available catalogs:')
AssertionError: assert False
+ where False = <built-in method startswith of str object at 0x000001CA2BAEF6F0>('Available catalogs:')
+ where <built-in method startswith of str object at 0x000001CA2BAEF6F0> = 'SNM'.startswith
Traceback (most recent call last):
File "C:\Miniconda3\envs\test\Lib\site-packages\_pytest\runner.py", line 340, in from_call
result: Optional[TResult] = func()
^^^^^^
File "C:\Miniconda3\envs\test\Lib\site-packages\_pytest\runner.py", line 240, in <lambda>
lambda: runtest_hook(item=item, **kwds), when=when, reraise=reraise
^^^^^^^^^^^^^^^^^^^^^^^^^^^^^^^
File "C:\Miniconda3\envs\test\Lib\site-packages\pluggy\_hooks.py", line 501, in __call__
return self._hookexec(self.name, self._hookimpls.copy(), kwargs, firstresult)
^^^^^^^^^^^^^^^^^^^^^^^^^^^^^^^^^^^^^^^^^^^^^^^^^^^^^^^^^^^^^^^^^^^^^^
File "C:\Miniconda3\envs\test\Lib\site-packages\pluggy\_manager.py", line 119, in _hookexec
return self._inner_hookexec(hook_name, methods, kwargs, firstresult)
^^^^^^^^^^^^^^^^^^^^^^^^^^^^^^^^^^^^^^^^^^^^^^^^^^^^^^^^^^^^^
File "C:\Miniconda3\envs\test\Lib\site-packages\pluggy\_callers.py", line 181, in _multicall
return outcome.get_result()
^^^^^^^^^^^^^^^^^^^^
File "C:\Miniconda3\envs\test\Lib\site-packages\pluggy\_result.py", line 99, in get_result
raise exc.with_traceback(exc.__traceback__)
File "C:\Miniconda3\envs\test\Lib\site-packages\pluggy\_callers.py", line 166, in _multicall
teardown.throw(outcome._exception)
File "C:\Miniconda3\envs\test\Lib\site-packages\_pytest\threadexception.py", line 87, in pytest_runtest_call
yield from thread_exception_runtest_hook()
File "C:\Miniconda3\envs\test\Lib\site-packages\_pytest\threadexception.py", line 63, in thread_exception_runtest_hook
yield
File "C:\Miniconda3\envs\test\Lib\site-packages\pluggy\_callers.py", line 166, in _multicall
teardown.throw(outcome._exception)
File "C:\Miniconda3\envs\test\Lib\site-packages\_pytest\unraisableexception.py", line 90, in pytest_runtest_call
yield from unraisable_exception_runtest_hook()
File "C:\Miniconda3\envs\test\Lib\site-packages\_pytest\unraisableexception.py", line 65, in unraisable_exception_runtest_hook
yield
File "C:\Miniconda3\envs\test\Lib\site-packages\pluggy\_callers.py", line 166, in _multicall
teardown.throw(outcome._exception)
File "C:\Miniconda3\envs\test\Lib\site-packages\_pytest\logging.py", line 849, in pytest_runtest_call
yield from self._runtest_for(item, "call")
File "C:\Miniconda3\envs\test\Lib\site-packages\_pytest\logging.py", line 832, in _runtest_for
yield
File "C:\Miniconda3\envs\test\Lib\site-packages\pluggy\_callers.py", line 166, in _multicall
teardown.throw(outcome._exception)
File "C:\Miniconda3\envs\test\Lib\site-packages\_pytest\capture.py", line 883, in pytest_runtest_call
return (yield)
^^^^^
File "C:\Miniconda3\envs\test\Lib\site-packages\pluggy\_callers.py", line 166, in _multicall
teardown.throw(outcome._exception)
File "C:\Miniconda3\envs\test\Lib\site-packages\_pytest\skipping.py", line 256, in pytest_runtest_call
return (yield)
^^^^^
File "C:\Miniconda3\envs\test\Lib\site-packages\pluggy\_callers.py", line 102, in _multicall
res = hook_impl.function(*args)
^^^^^^^^^^^^^^^^^^^^^^^^^
File "C:\Miniconda3\envs\test\Lib\site-packages\_pytest\runner.py", line 182, in pytest_runtest_call
raise e
File "C:\Miniconda3\envs\test\Lib\site-packages\_pytest\runner.py", line 172, in pytest_runtest_call
item.runtest()
File "C:\Miniconda3\envs\test\Lib\site-packages\_pytest\python.py", line 1772, in runtest
self.ihook.pytest_pyfunc_call(pyfuncitem=self)
File "C:\Miniconda3\envs\test\Lib\site-packages\pluggy\_hooks.py", line 501, in __call__
return self._hookexec(self.name, self._hookimpls.copy(), kwargs, firstresult)
^^^^^^^^^^^^^^^^^^^^^^^^^^^^^^^^^^^^^^^^^^^^^^^^^^^^^^^^^^^^^^^^^^^^^^
File "C:\Miniconda3\envs\test\Lib\site-packages\pluggy\_manager.py", line 119, in _hookexec
return self._inner_hookexec(hook_name, methods, kwargs, firstresult)
^^^^^^^^^^^^^^^^^^^^^^^^^^^^^^^^^^^^^^^^^^^^^^^^^^^^^^^^^^^^^
File "C:\Miniconda3\envs\test\Lib\site-packages\pluggy\_callers.py", line 138, in _multicall
raise exception.with_traceback(exception.__traceback__)
File "C:\Miniconda3\envs\test\Lib\site-packages\pluggy\_callers.py", line 102, in _multicall
res = hook_impl.function(*args)
^^^^^^^^^^^^^^^^^^^^^^^^^
File "C:\Miniconda3\envs\test\Lib\site-packages\_pytest\python.py", line 195, in pytest_pyfunc_call
result = testfunction(**testargs)
^^^^^^^^^^^^^^^^^^^^^^^^
File "C:\Miniconda3\envs\test\Lib\unittest\mock.py", line 1375, in patched
return func(*newargs, **newkeywargs)
^^^^^^^^^^^^^^^^^^^^^^^^^^^^^
File "C:\Miniconda3\envs\test\Lib\site-packages\obspy\clients\fdsn\tests\test_client.py", line 1428, in test_no_data_exception
self.client.get_stations()
File "C:\Miniconda3\envs\test\Lib\site-packages\obspy\clients\fdsn\client.py", line 748, in get_stations
data_stream = self._download(url)
^^^^^^^^^^^^^^^^^^^
File "C:\Miniconda3\envs\test\Lib\site-packages\obspy\clients\fdsn\client.py", line 1486, in _download
raise_on_error(code, data)
File "C:\Miniconda3\envs\test\Lib\site-packages\obspy\clients\fdsn\client.py", line 1802, in raise_on_error
server_info = data.decode('ASCII', errors='ignore')
^^^^^^^^^^^
AttributeError: 'NoneType' object has no attribute 'decode'
Traceback (most recent call last):
File "C:\Miniconda3\envs\test\Lib\site-packages\_pytest\runner.py", line 340, in from_call
result: Optional[TResult] = func()
^^^^^^
File "C:\Miniconda3\envs\test\Lib\site-packages\_pytest\runner.py", line 240, in <lambda>
lambda: runtest_hook(item=item, **kwds), when=when, reraise=reraise
^^^^^^^^^^^^^^^^^^^^^^^^^^^^^^^
File "C:\Miniconda3\envs\test\Lib\site-packages\pluggy\_hooks.py", line 501, in __call__
return self._hookexec(self.name, self._hookimpls.copy(), kwargs, firstresult)
^^^^^^^^^^^^^^^^^^^^^^^^^^^^^^^^^^^^^^^^^^^^^^^^^^^^^^^^^^^^^^^^^^^^^^
File "C:\Miniconda3\envs\test\Lib\site-packages\pluggy\_manager.py", line 119, in _hookexec
return self._inner_hookexec(hook_name, methods, kwargs, firstresult)
^^^^^^^^^^^^^^^^^^^^^^^^^^^^^^^^^^^^^^^^^^^^^^^^^^^^^^^^^^^^^
File "C:\Miniconda3\envs\test\Lib\site-packages\pluggy\_callers.py", line 181, in _multicall
return outcome.get_result()
^^^^^^^^^^^^^^^^^^^^
File "C:\Miniconda3\envs\test\Lib\site-packages\pluggy\_result.py", line 99, in get_result
raise exc.with_traceback(exc.__traceback__)
File "C:\Miniconda3\envs\test\Lib\site-packages\pluggy\_callers.py", line 166, in _multicall
teardown.throw(outcome._exception)
File "C:\Miniconda3\envs\test\Lib\site-packages\_pytest\threadexception.py", line 87, in pytest_runtest_call
yield from thread_exception_runtest_hook()
File "C:\Miniconda3\envs\test\Lib\site-packages\_pytest\threadexception.py", line 63, in thread_exception_runtest_hook
yield
File "C:\Miniconda3\envs\test\Lib\site-packages\pluggy\_callers.py", line 166, in _multicall
teardown.throw(outcome._exception)
File "C:\Miniconda3\envs\test\Lib\site-packages\_pytest\unraisableexception.py", line 90, in pytest_runtest_call
yield from unraisable_exception_runtest_hook()
File "C:\Miniconda3\envs\test\Lib\site-packages\_pytest\unraisableexception.py", line 65, in unraisable_exception_runtest_hook
yield
File "C:\Miniconda3\envs\test\Lib\site-packages\pluggy\_callers.py", line 166, in _multicall
teardown.throw(outcome._exception)
File "C:\Miniconda3\envs\test\Lib\site-packages\_pytest\logging.py", line 849, in pytest_runtest_call
yield from self._runtest_for(item, "call")
File "C:\Miniconda3\envs\test\Lib\site-packages\_pytest\logging.py", line 832, in _runtest_for
yield
File "C:\Miniconda3\envs\test\Lib\site-packages\pluggy\_callers.py", line 166, in _multicall
teardown.throw(outcome._exception)
File "C:\Miniconda3\envs\test\Lib\site-packages\_pytest\capture.py", line 883, in pytest_runtest_call
return (yield)
^^^^^
File "C:\Miniconda3\envs\test\Lib\site-packages\pluggy\_callers.py", line 166, in _multicall
teardown.throw(outcome._exception)
File "C:\Miniconda3\envs\test\Lib\site-packages\_pytest\skipping.py", line 256, in pytest_runtest_call
return (yield)
^^^^^
File "C:\Miniconda3\envs\test\Lib\site-packages\pluggy\_callers.py", line 102, in _multicall
res = hook_impl.function(*args)
^^^^^^^^^^^^^^^^^^^^^^^^^
File "C:\Miniconda3\envs\test\Lib\site-packages\_pytest\runner.py", line 182, in pytest_runtest_call
raise e
File "C:\Miniconda3\envs\test\Lib\site-packages\_pytest\runner.py", line 172, in pytest_runtest_call
item.runtest()
File "C:\Miniconda3\envs\test\Lib\site-packages\_pytest\python.py", line 1772, in runtest
self.ihook.pytest_pyfunc_call(pyfuncitem=self)
File "C:\Miniconda3\envs\test\Lib\site-packages\pluggy\_hooks.py", line 501, in __call__
return self._hookexec(self.name, self._hookimpls.copy(), kwargs, firstresult)
^^^^^^^^^^^^^^^^^^^^^^^^^^^^^^^^^^^^^^^^^^^^^^^^^^^^^^^^^^^^^^^^^^^^^^
File "C:\Miniconda3\envs\test\Lib\site-packages\pluggy\_manager.py", line 119, in _hookexec
return self._inner_hookexec(hook_name, methods, kwargs, firstresult)
^^^^^^^^^^^^^^^^^^^^^^^^^^^^^^^^^^^^^^^^^^^^^^^^^^^^^^^^^^^^^
File "C:\Miniconda3\envs\test\Lib\site-packages\pluggy\_callers.py", line 138, in _multicall
raise exception.with_traceback(exception.__traceback__)
File "C:\Miniconda3\envs\test\Lib\site-packages\pluggy\_callers.py", line 102, in _multicall
res = hook_impl.function(*args)
^^^^^^^^^^^^^^^^^^^^^^^^^
File "C:\Miniconda3\envs\test\Lib\site-packages\_pytest\python.py", line 195, in pytest_pyfunc_call
result = testfunction(**testargs)
^^^^^^^^^^^^^^^^^^^^^^^^
File "C:\Miniconda3\envs\test\Lib\unittest\mock.py", line 1375, in patched
return func(*newargs, **newkeywargs)
^^^^^^^^^^^^^^^^^^^^^^^^^^^^^
File "C:\Miniconda3\envs\test\Lib\site-packages\obspy\clients\fdsn\tests\test_client.py", line 1438, in test_request_too_large_exception
self.client.get_stations()
File "C:\Miniconda3\envs\test\Lib\site-packages\obspy\clients\fdsn\client.py", line 748, in get_stations
data_stream = self._download(url)
^^^^^^^^^^^^^^^^^^^
File "C:\Miniconda3\envs\test\Lib\site-packages\obspy\clients\fdsn\client.py", line 1486, in _download
raise_on_error(code, data)
File "C:\Miniconda3\envs\test\Lib\site-packages\obspy\clients\fdsn\client.py", line 1802, in raise_on_error
server_info = data.decode('ASCII', errors='ignore')
^^^^^^^^^^^
AttributeError: 'NoneType' object has no attribute 'decode'
Traceback (most recent call last):
File "C:\Miniconda3\envs\test\Lib\site-packages\_pytest\runner.py", line 340, in from_call
result: Optional[TResult] = func()
^^^^^^
File "C:\Miniconda3\envs\test\Lib\site-packages\_pytest\runner.py", line 240, in <lambda>
lambda: runtest_hook(item=item, **kwds), when=when, reraise=reraise
^^^^^^^^^^^^^^^^^^^^^^^^^^^^^^^
File "C:\Miniconda3\envs\test\Lib\site-packages\pluggy\_hooks.py", line 501, in __call__
return self._hookexec(self.name, self._hookimpls.copy(), kwargs, firstresult)
^^^^^^^^^^^^^^^^^^^^^^^^^^^^^^^^^^^^^^^^^^^^^^^^^^^^^^^^^^^^^^^^^^^^^^
File "C:\Miniconda3\envs\test\Lib\site-packages\pluggy\_manager.py", line 119, in _hookexec
return self._inner_hookexec(hook_name, methods, kwargs, firstresult)
^^^^^^^^^^^^^^^^^^^^^^^^^^^^^^^^^^^^^^^^^^^^^^^^^^^^^^^^^^^^^
File "C:\Miniconda3\envs\test\Lib\site-packages\pluggy\_callers.py", line 181, in _multicall
return outcome.get_result()
^^^^^^^^^^^^^^^^^^^^
File "C:\Miniconda3\envs\test\Lib\site-packages\pluggy\_result.py", line 99, in get_result
raise exc.with_traceback(exc.__traceback__)
File "C:\Miniconda3\envs\test\Lib\site-packages\pluggy\_callers.py", line 166, in _multicall
teardown.throw(outcome._exception)
File "C:\Miniconda3\envs\test\Lib\site-packages\_pytest\threadexception.py", line 87, in pytest_runtest_call
yield from thread_exception_runtest_hook()
File "C:\Miniconda3\envs\test\Lib\site-packages\_pytest\threadexception.py", line 63, in thread_exception_runtest_hook
yield
File "C:\Miniconda3\envs\test\Lib\site-packages\pluggy\_callers.py", line 166, in _multicall
teardown.throw(outcome._exception)
File "C:\Miniconda3\envs\test\Lib\site-packages\_pytest\unraisableexception.py", line 90, in pytest_runtest_call
yield from unraisable_exception_runtest_hook()
File "C:\Miniconda3\envs\test\Lib\site-packages\_pytest\unraisableexception.py", line 65, in unraisable_exception_runtest_hook
yield
File "C:\Miniconda3\envs\test\Lib\site-packages\pluggy\_callers.py", line 166, in _multicall
teardown.throw(outcome._exception)
File "C:\Miniconda3\envs\test\Lib\site-packages\_pytest\logging.py", line 849, in pytest_runtest_call
yield from self._runtest_for(item, "call")
File "C:\Miniconda3\envs\test\Lib\site-packages\_pytest\logging.py", line 832, in _runtest_for
yield
File "C:\Miniconda3\envs\test\Lib\site-packages\pluggy\_callers.py", line 166, in _multicall
teardown.throw(outcome._exception)
File "C:\Miniconda3\envs\test\Lib\site-packages\_pytest\capture.py", line 883, in pytest_runtest_call
return (yield)
^^^^^
File "C:\Miniconda3\envs\test\Lib\site-packages\pluggy\_callers.py", line 166, in _multicall
teardown.throw(outcome._exception)
File "C:\Miniconda3\envs\test\Lib\site-packages\_pytest\skipping.py", line 256, in pytest_runtest_call
return (yield)
^^^^^
File "C:\Miniconda3\envs\test\Lib\site-packages\pluggy\_callers.py", line 102, in _multicall
res = hook_impl.function(*args)
^^^^^^^^^^^^^^^^^^^^^^^^^
File "C:\Miniconda3\envs\test\Lib\site-packages\_pytest\runner.py", line 182, in pytest_runtest_call
raise e
File "C:\Miniconda3\envs\test\Lib\site-packages\_pytest\runner.py", line 172, in pytest_runtest_call
item.runtest()
File "C:\Miniconda3\envs\test\Lib\site-packages\_pytest\python.py", line 1772, in runtest
self.ihook.pytest_pyfunc_call(pyfuncitem=self)
File "C:\Miniconda3\envs\test\Lib\site-packages\pluggy\_hooks.py", line 501, in __call__
return self._hookexec(self.name, self._hookimpls.copy(), kwargs, firstresult)
^^^^^^^^^^^^^^^^^^^^^^^^^^^^^^^^^^^^^^^^^^^^^^^^^^^^^^^^^^^^^^^^^^^^^^
File "C:\Miniconda3\envs\test\Lib\site-packages\pluggy\_manager.py", line 119, in _hookexec
return self._inner_hookexec(hook_name, methods, kwargs, firstresult)
^^^^^^^^^^^^^^^^^^^^^^^^^^^^^^^^^^^^^^^^^^^^^^^^^^^^^^^^^^^^^
File "C:\Miniconda3\envs\test\Lib\site-packages\pluggy\_callers.py", line 138, in _multicall
raise exception.with_traceback(exception.__traceback__)
File "C:\Miniconda3\envs\test\Lib\site-packages\pluggy\_callers.py", line 102, in _multicall
res = hook_impl.function(*args)
^^^^^^^^^^^^^^^^^^^^^^^^^
File "C:\Miniconda3\envs\test\Lib\site-packages\_pytest\python.py", line 195, in pytest_pyfunc_call
result = testfunction(**testargs)
^^^^^^^^^^^^^^^^^^^^^^^^
File "C:\Miniconda3\envs\test\Lib\unittest\mock.py", line 1375, in patched
return func(*newargs, **newkeywargs)
^^^^^^^^^^^^^^^^^^^^^^^^^^^^^
File "C:\Miniconda3\envs\test\Lib\site-packages\obspy\clients\fdsn\tests\test_client.py", line 1450, in test_authentication_exceptions
Client(eida_token="TEST")
File "C:\Miniconda3\envs\test\Lib\site-packages\obspy\clients\fdsn\client.py", line 277, in __init__
self._discover_services()
File "C:\Miniconda3\envs\test\Lib\site-packages\obspy\clients\fdsn\client.py", line 1638, in _discover_services
raise FDSNNoServiceException(msg)
obspy.clients.fdsn.header.FDSNNoServiceException: No FDSN services could be discovered at 'http://service.iris.edu'. This could be due to a temporary service outage or an invalid FDSN service address.
Traceback (most recent call last):
File "C:\Miniconda3\envs\test\Lib\site-packages\_pytest\runner.py", line 340, in from_call
result: Optional[TResult] = func()
^^^^^^
File "C:\Miniconda3\envs\test\Lib\site-packages\_pytest\runner.py", line 240, in <lambda>
lambda: runtest_hook(item=item, **kwds), when=when, reraise=reraise
^^^^^^^^^^^^^^^^^^^^^^^^^^^^^^^
File "C:\Miniconda3\envs\test\Lib\site-packages\pluggy\_hooks.py", line 501, in __call__
return self._hookexec(self.name, self._hookimpls.copy(), kwargs, firstresult)
^^^^^^^^^^^^^^^^^^^^^^^^^^^^^^^^^^^^^^^^^^^^^^^^^^^^^^^^^^^^^^^^^^^^^^
File "C:\Miniconda3\envs\test\Lib\site-packages\pluggy\_manager.py", line 119, in _hookexec
return self._inner_hookexec(hook_name, methods, kwargs, firstresult)
^^^^^^^^^^^^^^^^^^^^^^^^^^^^^^^^^^^^^^^^^^^^^^^^^^^^^^^^^^^^^
File "C:\Miniconda3\envs\test\Lib\site-packages\pluggy\_callers.py", line 181, in _multicall
return outcome.get_result()
^^^^^^^^^^^^^^^^^^^^
File "C:\Miniconda3\envs\test\Lib\site-packages\pluggy\_result.py", line 99, in get_result
raise exc.with_traceback(exc.__traceback__)
File "C:\Miniconda3\envs\test\Lib\site-packages\pluggy\_callers.py", line 166, in _multicall
teardown.throw(outcome._exception)
File "C:\Miniconda3\envs\test\Lib\site-packages\_pytest\threadexception.py", line 87, in pytest_runtest_call
yield from thread_exception_runtest_hook()
File "C:\Miniconda3\envs\test\Lib\site-packages\_pytest\threadexception.py", line 63, in thread_exception_runtest_hook
yield
File "C:\Miniconda3\envs\test\Lib\site-packages\pluggy\_callers.py", line 166, in _multicall
teardown.throw(outcome._exception)
File "C:\Miniconda3\envs\test\Lib\site-packages\_pytest\unraisableexception.py", line 90, in pytest_runtest_call
yield from unraisable_exception_runtest_hook()
File "C:\Miniconda3\envs\test\Lib\site-packages\_pytest\unraisableexception.py", line 65, in unraisable_exception_runtest_hook
yield
File "C:\Miniconda3\envs\test\Lib\site-packages\pluggy\_callers.py", line 166, in _multicall
teardown.throw(outcome._exception)
File "C:\Miniconda3\envs\test\Lib\site-packages\_pytest\logging.py", line 849, in pytest_runtest_call
yield from self._runtest_for(item, "call")
File "C:\Miniconda3\envs\test\Lib\site-packages\_pytest\logging.py", line 832, in _runtest_for
yield
File "C:\Miniconda3\envs\test\Lib\site-packages\pluggy\_callers.py", line 166, in _multicall
teardown.throw(outcome._exception)
File "C:\Miniconda3\envs\test\Lib\site-packages\_pytest\capture.py", line 883, in pytest_runtest_call
return (yield)
^^^^^
File "C:\Miniconda3\envs\test\Lib\site-packages\pluggy\_callers.py", line 166, in _multicall
teardown.throw(outcome._exception)
File "C:\Miniconda3\envs\test\Lib\site-packages\_pytest\skipping.py", line 256, in pytest_runtest_call
return (yield)
^^^^^
File "C:\Miniconda3\envs\test\Lib\site-packages\pluggy\_callers.py", line 102, in _multicall
res = hook_impl.function(*args)
^^^^^^^^^^^^^^^^^^^^^^^^^
File "C:\Miniconda3\envs\test\Lib\site-packages\_pytest\runner.py", line 182, in pytest_runtest_call
raise e
File "C:\Miniconda3\envs\test\Lib\site-packages\_pytest\runner.py", line 172, in pytest_runtest_call
item.runtest()
File "C:\Miniconda3\envs\test\Lib\site-packages\_pytest\python.py", line 1772, in runtest
self.ihook.pytest_pyfunc_call(pyfuncitem=self)
File "C:\Miniconda3\envs\test\Lib\site-packages\pluggy\_hooks.py", line 501, in __call__
return self._hookexec(self.name, self._hookimpls.copy(), kwargs, firstresult)
^^^^^^^^^^^^^^^^^^^^^^^^^^^^^^^^^^^^^^^^^^^^^^^^^^^^^^^^^^^^^^^^^^^^^^
File "C:\Miniconda3\envs\test\Lib\site-packages\pluggy\_manager.py", line 119, in _hookexec
return self._inner_hookexec(hook_name, methods, kwargs, firstresult)
^^^^^^^^^^^^^^^^^^^^^^^^^^^^^^^^^^^^^^^^^^^^^^^^^^^^^^^^^^^^^
File "C:\Miniconda3\envs\test\Lib\site-packages\pluggy\_callers.py", line 138, in _multicall
raise exception.with_traceback(exception.__traceback__)
File "C:\Miniconda3\envs\test\Lib\site-packages\pluggy\_callers.py", line 102, in _multicall
res = hook_impl.function(*args)
^^^^^^^^^^^^^^^^^^^^^^^^^
File "C:\Miniconda3\envs\test\Lib\site-packages\_pytest\python.py", line 195, in pytest_pyfunc_call
result = testfunction(**testargs)
^^^^^^^^^^^^^^^^^^^^^^^^
File "C:\Miniconda3\envs\test\Lib\unittest\mock.py", line 1375, in patched
return func(*newargs, **newkeywargs)
^^^^^^^^^^^^^^^^^^^^^^^^^^^^^
File "C:\Miniconda3\envs\test\Lib\site-packages\obspy\clients\fdsn\tests\test_client.py", line 1470, in test_timeout_exception
self.client.get_stations()
File "C:\Miniconda3\envs\test\Lib\site-packages\obspy\clients\fdsn\client.py", line 748, in get_stations
data_stream = self._download(url)
^^^^^^^^^^^^^^^^^^^
File "C:\Miniconda3\envs\test\Lib\site-packages\obspy\clients\fdsn\client.py", line 1486, in _download
raise_on_error(code, data)
File "C:\Miniconda3\envs\test\Lib\site-packages\obspy\clients\fdsn\client.py", line 1802, in raise_on_error
server_info = data.decode('ASCII', errors='ignore')
^^^^^^^^^^^
AttributeError: 'str' object has no attribute 'decode'
Traceback (most recent call last):
File "C:\Miniconda3\envs\test\Lib\site-packages\_pytest\runner.py", line 340, in from_call
result: Optional[TResult] = func()
^^^^^^
File "C:\Miniconda3\envs\test\Lib\site-packages\_pytest\runner.py", line 240, in <lambda>
lambda: runtest_hook(item=item, **kwds), when=when, reraise=reraise
^^^^^^^^^^^^^^^^^^^^^^^^^^^^^^^
File "C:\Miniconda3\envs\test\Lib\site-packages\pluggy\_hooks.py", line 501, in __call__
return self._hookexec(self.name, self._hookimpls.copy(), kwargs, firstresult)
^^^^^^^^^^^^^^^^^^^^^^^^^^^^^^^^^^^^^^^^^^^^^^^^^^^^^^^^^^^^^^^^^^^^^^
File "C:\Miniconda3\envs\test\Lib\site-packages\pluggy\_manager.py", line 119, in _hookexec
return self._inner_hookexec(hook_name, methods, kwargs, firstresult)
^^^^^^^^^^^^^^^^^^^^^^^^^^^^^^^^^^^^^^^^^^^^^^^^^^^^^^^^^^^^^
File "C:\Miniconda3\envs\test\Lib\site-packages\pluggy\_callers.py", line 181, in _multicall
return outcome.get_result()
^^^^^^^^^^^^^^^^^^^^
File "C:\Miniconda3\envs\test\Lib\site-packages\pluggy\_result.py", line 99, in get_result
raise exc.with_traceback(exc.__traceback__)
File "C:\Miniconda3\envs\test\Lib\site-packages\pluggy\_callers.py", line 166, in _multicall
teardown.throw(outcome._exception)
File "C:\Miniconda3\envs\test\Lib\site-packages\_pytest\threadexception.py", line 87, in pytest_runtest_call
yield from thread_exception_runtest_hook()
File "C:\Miniconda3\envs\test\Lib\site-packages\_pytest\threadexception.py", line 63, in thread_exception_runtest_hook
yield
File "C:\Miniconda3\envs\test\Lib\site-packages\pluggy\_callers.py", line 166, in _multicall
teardown.throw(outcome._exception)
File "C:\Miniconda3\envs\test\Lib\site-packages\_pytest\unraisableexception.py", line 90, in pytest_runtest_call
yield from unraisable_exception_runtest_hook()
File "C:\Miniconda3\envs\test\Lib\site-packages\_pytest\unraisableexception.py", line 65, in unraisable_exception_runtest_hook
yield
File "C:\Miniconda3\envs\test\Lib\site-packages\pluggy\_callers.py", line 166, in _multicall
teardown.throw(outcome._exception)
File "C:\Miniconda3\envs\test\Lib\site-packages\_pytest\logging.py", line 849, in pytest_runtest_call
yield from self._runtest_for(item, "call")
File "C:\Miniconda3\envs\test\Lib\site-packages\_pytest\logging.py", line 832, in _runtest_for
yield
File "C:\Miniconda3\envs\test\Lib\site-packages\pluggy\_callers.py", line 166, in _multicall
teardown.throw(outcome._exception)
File "C:\Miniconda3\envs\test\Lib\site-packages\_pytest\capture.py", line 883, in pytest_runtest_call
return (yield)
^^^^^
File "C:\Miniconda3\envs\test\Lib\site-packages\pluggy\_callers.py", line 166, in _multicall
teardown.throw(outcome._exception)
File "C:\Miniconda3\envs\test\Lib\site-packages\_pytest\skipping.py", line 256, in pytest_runtest_call
return (yield)
^^^^^
File "C:\Miniconda3\envs\test\Lib\site-packages\pluggy\_callers.py", line 102, in _multicall
res = hook_impl.function(*args)
^^^^^^^^^^^^^^^^^^^^^^^^^
File "C:\Miniconda3\envs\test\Lib\site-packages\_pytest\runner.py", line 182, in pytest_runtest_call
raise e
File "C:\Miniconda3\envs\test\Lib\site-packages\_pytest\runner.py", line 172, in pytest_runtest_call
item.runtest()
File "C:\Miniconda3\envs\test\Lib\site-packages\_pytest\python.py", line 1772, in runtest
self.ihook.pytest_pyfunc_call(pyfuncitem=self)
File "C:\Miniconda3\envs\test\Lib\site-packages\pluggy\_hooks.py", line 501, in __call__
return self._hookexec(self.name, self._hookimpls.copy(), kwargs, firstresult)
^^^^^^^^^^^^^^^^^^^^^^^^^^^^^^^^^^^^^^^^^^^^^^^^^^^^^^^^^^^^^^^^^^^^^^
File "C:\Miniconda3\envs\test\Lib\site-packages\pluggy\_manager.py", line 119, in _hookexec
return self._inner_hookexec(hook_name, methods, kwargs, firstresult)
^^^^^^^^^^^^^^^^^^^^^^^^^^^^^^^^^^^^^^^^^^^^^^^^^^^^^^^^^^^^^
File "C:\Miniconda3\envs\test\Lib\site-packages\pluggy\_callers.py", line 138, in _multicall
raise exception.with_traceback(exception.__traceback__)
File "C:\Miniconda3\envs\test\Lib\site-packages\pluggy\_callers.py", line 102, in _multicall
res = hook_impl.function(*args)
^^^^^^^^^^^^^^^^^^^^^^^^^
File "C:\Miniconda3\envs\test\Lib\site-packages\_pytest\python.py", line 195, in pytest_pyfunc_call
result = testfunction(**testargs)
^^^^^^^^^^^^^^^^^^^^^^^^
File "C:\Miniconda3\envs\test\Lib\unittest\mock.py", line 1375, in patched
return func(*newargs, **newkeywargs)
^^^^^^^^^^^^^^^^^^^^^^^^^^^^^
File "C:\Miniconda3\envs\test\Lib\site-packages\obspy\clients\fdsn\tests\test_client.py", line 1488, in test_not_implemented_exception
self.client.get_stations()
File "C:\Miniconda3\envs\test\Lib\site-packages\obspy\clients\fdsn\client.py", line 748, in get_stations
data_stream = self._download(url)
^^^^^^^^^^^^^^^^^^^
File "C:\Miniconda3\envs\test\Lib\site-packages\obspy\clients\fdsn\client.py", line 1486, in _download
raise_on_error(code, data)
File "C:\Miniconda3\envs\test\Lib\site-packages\obspy\clients\fdsn\client.py", line 1802, in raise_on_error
server_info = data.decode('ASCII', errors='ignore')
^^^^^^^^^^^
AttributeError: 'NoneType' object has no attribute 'decode'
Traceback (most recent call last):
File "C:\Miniconda3\envs\test\Lib\site-packages\_pytest\runner.py", line 340, in from_call
result: Optional[TResult] = func()
^^^^^^
File "C:\Miniconda3\envs\test\Lib\site-packages\_pytest\runner.py", line 240, in <lambda>
lambda: runtest_hook(item=item, **kwds), when=when, reraise=reraise
^^^^^^^^^^^^^^^^^^^^^^^^^^^^^^^
File "C:\Miniconda3\envs\test\Lib\site-packages\pluggy\_hooks.py", line 501, in __call__
return self._hookexec(self.name, self._hookimpls.copy(), kwargs, firstresult)
^^^^^^^^^^^^^^^^^^^^^^^^^^^^^^^^^^^^^^^^^^^^^^^^^^^^^^^^^^^^^^^^^^^^^^
File "C:\Miniconda3\envs\test\Lib\site-packages\pluggy\_manager.py", line 119, in _hookexec
return self._inner_hookexec(hook_name, methods, kwargs, firstresult)
^^^^^^^^^^^^^^^^^^^^^^^^^^^^^^^^^^^^^^^^^^^^^^^^^^^^^^^^^^^^^
File "C:\Miniconda3\envs\test\Lib\site-packages\pluggy\_callers.py", line 181, in _multicall
return outcome.get_result()
^^^^^^^^^^^^^^^^^^^^
File "C:\Miniconda3\envs\test\Lib\site-packages\pluggy\_result.py", line 99, in get_result
raise exc.with_traceback(exc.__traceback__)
File "C:\Miniconda3\envs\test\Lib\site-packages\pluggy\_callers.py", line 166, in _multicall
teardown.throw(outcome._exception)
File "C:\Miniconda3\envs\test\Lib\site-packages\_pytest\threadexception.py", line 87, in pytest_runtest_call
yield from thread_exception_runtest_hook()
File "C:\Miniconda3\envs\test\Lib\site-packages\_pytest\threadexception.py", line 63, in thread_exception_runtest_hook
yield
File "C:\Miniconda3\envs\test\Lib\site-packages\pluggy\_callers.py", line 166, in _multicall
teardown.throw(outcome._exception)
File "C:\Miniconda3\envs\test\Lib\site-packages\_pytest\unraisableexception.py", line 90, in pytest_runtest_call
yield from unraisable_exception_runtest_hook()
File "C:\Miniconda3\envs\test\Lib\site-packages\_pytest\unraisableexception.py", line 65, in unraisable_exception_runtest_hook
yield
File "C:\Miniconda3\envs\test\Lib\site-packages\pluggy\_callers.py", line 166, in _multicall
teardown.throw(outcome._exception)
File "C:\Miniconda3\envs\test\Lib\site-packages\_pytest\logging.py", line 849, in pytest_runtest_call
yield from self._runtest_for(item, "call")
File "C:\Miniconda3\envs\test\Lib\site-packages\_pytest\logging.py", line 832, in _runtest_for
yield
File "C:\Miniconda3\envs\test\Lib\site-packages\pluggy\_callers.py", line 166, in _multicall
teardown.throw(outcome._exception)
File "C:\Miniconda3\envs\test\Lib\site-packages\_pytest\capture.py", line 883, in pytest_runtest_call
return (yield)
^^^^^
File "C:\Miniconda3\envs\test\Lib\site-packages\pluggy\_callers.py", line 166, in _multicall
teardown.throw(outcome._exception)
File "C:\Miniconda3\envs\test\Lib\site-packages\_pytest\skipping.py", line 256, in pytest_runtest_call
return (yield)
^^^^^
File "C:\Miniconda3\envs\test\Lib\site-packages\pluggy\_callers.py", line 102, in _multicall
res = hook_impl.function(*args)
^^^^^^^^^^^^^^^^^^^^^^^^^
File "C:\Miniconda3\envs\test\Lib\site-packages\_pytest\runner.py", line 182, in pytest_runtest_call
raise e
File "C:\Miniconda3\envs\test\Lib\site-packages\_pytest\runner.py", line 172, in pytest_runtest_call
item.runtest()
File "C:\Miniconda3\envs\test\Lib\site-packages\_pytest\python.py", line 1772, in runtest
self.ihook.pytest_pyfunc_call(pyfuncitem=self)
File "C:\Miniconda3\envs\test\Lib\site-packages\pluggy\_hooks.py", line 501, in __call__
return self._hookexec(self.name, self._hookimpls.copy(), kwargs, firstresult)
^^^^^^^^^^^^^^^^^^^^^^^^^^^^^^^^^^^^^^^^^^^^^^^^^^^^^^^^^^^^^^^^^^^^^^
File "C:\Miniconda3\envs\test\Lib\site-packages\pluggy\_manager.py", line 119, in _hookexec
return self._inner_hookexec(hook_name, methods, kwargs, firstresult)
^^^^^^^^^^^^^^^^^^^^^^^^^^^^^^^^^^^^^^^^^^^^^^^^^^^^^^^^^^^^^
File "C:\Miniconda3\envs\test\Lib\site-packages\pluggy\_callers.py", line 138, in _multicall
raise exception.with_traceback(exception.__traceback__)
File "C:\Miniconda3\envs\test\Lib\site-packages\pluggy\_callers.py", line 102, in _multicall
res = hook_impl.function(*args)
^^^^^^^^^^^^^^^^^^^^^^^^^
File "C:\Miniconda3\envs\test\Lib\site-packages\_pytest\python.py", line 195, in pytest_pyfunc_call
result = testfunction(**testargs)
^^^^^^^^^^^^^^^^^^^^^^^^
File "C:\Miniconda3\envs\test\Lib\unittest\mock.py", line 1375, in patched
return func(*newargs, **newkeywargs)
^^^^^^^^^^^^^^^^^^^^^^^^^^^^^
File "C:\Miniconda3\envs\test\Lib\site-packages\obspy\clients\fdsn\tests\test_client.py", line 1498, in test_bad_gateway_exception
self.client.get_stations()
File "C:\Miniconda3\envs\test\Lib\site-packages\obspy\clients\fdsn\client.py", line 748, in get_stations
data_stream = self._download(url)
^^^^^^^^^^^^^^^^^^^
File "C:\Miniconda3\envs\test\Lib\site-packages\obspy\clients\fdsn\client.py", line 1486, in _download
raise_on_error(code, data)
File "C:\Miniconda3\envs\test\Lib\site-packages\obspy\clients\fdsn\client.py", line 1802, in raise_on_error
server_info = data.decode('ASCII', errors='ignore')
^^^^^^^^^^^
AttributeError: 'NoneType' object has no attribute 'decode'
Traceback (most recent call last):
File "C:\Miniconda3\envs\test\Lib\site-packages\_pytest\runner.py", line 340, in from_call
result: Optional[TResult] = func()
^^^^^^
File "C:\Miniconda3\envs\test\Lib\site-packages\_pytest\runner.py", line 240, in <lambda>
lambda: runtest_hook(item=item, **kwds), when=when, reraise=reraise
^^^^^^^^^^^^^^^^^^^^^^^^^^^^^^^
File "C:\Miniconda3\envs\test\Lib\site-packages\pluggy\_hooks.py", line 501, in __call__
return self._hookexec(self.name, self._hookimpls.copy(), kwargs, firstresult)
^^^^^^^^^^^^^^^^^^^^^^^^^^^^^^^^^^^^^^^^^^^^^^^^^^^^^^^^^^^^^^^^^^^^^^
File "C:\Miniconda3\envs\test\Lib\site-packages\pluggy\_manager.py", line 119, in _hookexec
return self._inner_hookexec(hook_name, methods, kwargs, firstresult)
^^^^^^^^^^^^^^^^^^^^^^^^^^^^^^^^^^^^^^^^^^^^^^^^^^^^^^^^^^^^^
File "C:\Miniconda3\envs\test\Lib\site-packages\pluggy\_callers.py", line 181, in _multicall
return outcome.get_result()
^^^^^^^^^^^^^^^^^^^^
File "C:\Miniconda3\envs\test\Lib\site-packages\pluggy\_result.py", line 99, in get_result
raise exc.with_traceback(exc.__traceback__)
File "C:\Miniconda3\envs\test\Lib\site-packages\pluggy\_callers.py", line 166, in _multicall
teardown.throw(outcome._exception)
File "C:\Miniconda3\envs\test\Lib\site-packages\_pytest\threadexception.py", line 87, in pytest_runtest_call
yield from thread_exception_runtest_hook()
File "C:\Miniconda3\envs\test\Lib\site-packages\_pytest\threadexception.py", line 63, in thread_exception_runtest_hook
yield
File "C:\Miniconda3\envs\test\Lib\site-packages\pluggy\_callers.py", line 166, in _multicall
teardown.throw(outcome._exception)
File "C:\Miniconda3\envs\test\Lib\site-packages\_pytest\unraisableexception.py", line 90, in pytest_runtest_call
yield from unraisable_exception_runtest_hook()
File "C:\Miniconda3\envs\test\Lib\site-packages\_pytest\unraisableexception.py", line 65, in unraisable_exception_runtest_hook
yield
File "C:\Miniconda3\envs\test\Lib\site-packages\pluggy\_callers.py", line 166, in _multicall
teardown.throw(outcome._exception)
File "C:\Miniconda3\envs\test\Lib\site-packages\_pytest\logging.py", line 849, in pytest_runtest_call
yield from self._runtest_for(item, "call")
File "C:\Miniconda3\envs\test\Lib\site-packages\_pytest\logging.py", line 832, in _runtest_for
yield
File "C:\Miniconda3\envs\test\Lib\site-packages\pluggy\_callers.py", line 166, in _multicall
teardown.throw(outcome._exception)
File "C:\Miniconda3\envs\test\Lib\site-packages\_pytest\capture.py", line 883, in pytest_runtest_call
return (yield)
^^^^^
File "C:\Miniconda3\envs\test\Lib\site-packages\pluggy\_callers.py", line 166, in _multicall
teardown.throw(outcome._exception)
File "C:\Miniconda3\envs\test\Lib\site-packages\_pytest\skipping.py", line 256, in pytest_runtest_call
return (yield)
^^^^^
File "C:\Miniconda3\envs\test\Lib\site-packages\pluggy\_callers.py", line 102, in _multicall
res = hook_impl.function(*args)
^^^^^^^^^^^^^^^^^^^^^^^^^
File "C:\Miniconda3\envs\test\Lib\site-packages\_pytest\runner.py", line 182, in pytest_runtest_call
raise e
File "C:\Miniconda3\envs\test\Lib\site-packages\_pytest\runner.py", line 172, in pytest_runtest_call
item.runtest()
File "C:\Miniconda3\envs\test\Lib\site-packages\_pytest\python.py", line 1772, in runtest
self.ihook.pytest_pyfunc_call(pyfuncitem=self)
File "C:\Miniconda3\envs\test\Lib\site-packages\pluggy\_hooks.py", line 501, in __call__
return self._hookexec(self.name, self._hookimpls.copy(), kwargs, firstresult)
^^^^^^^^^^^^^^^^^^^^^^^^^^^^^^^^^^^^^^^^^^^^^^^^^^^^^^^^^^^^^^^^^^^^^^
File "C:\Miniconda3\envs\test\Lib\site-packages\pluggy\_manager.py", line 119, in _hookexec
return self._inner_hookexec(hook_name, methods, kwargs, firstresult)
^^^^^^^^^^^^^^^^^^^^^^^^^^^^^^^^^^^^^^^^^^^^^^^^^^^^^^^^^^^^^
File "C:\Miniconda3\envs\test\Lib\site-packages\pluggy\_callers.py", line 138, in _multicall
raise exception.with_traceback(exception.__traceback__)
File "C:\Miniconda3\envs\test\Lib\site-packages\pluggy\_callers.py", line 102, in _multicall
res = hook_impl.function(*args)
^^^^^^^^^^^^^^^^^^^^^^^^^
File "C:\Miniconda3\envs\test\Lib\site-packages\_pytest\python.py", line 195, in pytest_pyfunc_call
result = testfunction(**testargs)
^^^^^^^^^^^^^^^^^^^^^^^^
File "C:\Miniconda3\envs\test\Lib\unittest\mock.py", line 1375, in patched
return func(*newargs, **newkeywargs)
^^^^^^^^^^^^^^^^^^^^^^^^^^^^^
File "C:\Miniconda3\envs\test\Lib\site-packages\obspy\clients\fdsn\tests\test_client.py", line 1508, in test_service_unavailable_exception
self.client.get_stations()
File "C:\Miniconda3\envs\test\Lib\site-packages\obspy\clients\fdsn\client.py", line 748, in get_stations
data_stream = self._download(url)
^^^^^^^^^^^^^^^^^^^
File "C:\Miniconda3\envs\test\Lib\site-packages\obspy\clients\fdsn\client.py", line 1486, in _download
raise_on_error(code, data)
File "C:\Miniconda3\envs\test\Lib\site-packages\obspy\clients\fdsn\client.py", line 1802, in raise_on_error
server_info = data.decode('ASCII', errors='ignore')
^^^^^^^^^^^
AttributeError: 'NoneType' object has no attribute 'decode'
Traceback (most recent call last):
File "C:\Miniconda3\envs\test\Lib\site-packages\_pytest\runner.py", line 340, in from_call
result: Optional[TResult] = func()
^^^^^^
File "C:\Miniconda3\envs\test\Lib\site-packages\_pytest\runner.py", line 240, in <lambda>
lambda: runtest_hook(item=item, **kwds), when=when, reraise=reraise
^^^^^^^^^^^^^^^^^^^^^^^^^^^^^^^
File "C:\Miniconda3\envs\test\Lib\site-packages\pluggy\_hooks.py", line 501, in __call__
return self._hookexec(self.name, self._hookimpls.copy(), kwargs, firstresult)
^^^^^^^^^^^^^^^^^^^^^^^^^^^^^^^^^^^^^^^^^^^^^^^^^^^^^^^^^^^^^^^^^^^^^^
File "C:\Miniconda3\envs\test\Lib\site-packages\pluggy\_manager.py", line 119, in _hookexec
return self._inner_hookexec(hook_name, methods, kwargs, firstresult)
^^^^^^^^^^^^^^^^^^^^^^^^^^^^^^^^^^^^^^^^^^^^^^^^^^^^^^^^^^^^^
File "C:\Miniconda3\envs\test\Lib\site-packages\pluggy\_callers.py", line 181, in _multicall
return outcome.get_result()
^^^^^^^^^^^^^^^^^^^^
File "C:\Miniconda3\envs\test\Lib\site-packages\pluggy\_result.py", line 99, in get_result
raise exc.with_traceback(exc.__traceback__)
File "C:\Miniconda3\envs\test\Lib\site-packages\pluggy\_callers.py", line 166, in _multicall
teardown.throw(outcome._exception)
File "C:\Miniconda3\envs\test\Lib\site-packages\_pytest\threadexception.py", line 87, in pytest_runtest_call
yield from thread_exception_runtest_hook()
File "C:\Miniconda3\envs\test\Lib\site-packages\_pytest\threadexception.py", line 63, in thread_exception_runtest_hook
yield
File "C:\Miniconda3\envs\test\Lib\site-packages\pluggy\_callers.py", line 166, in _multicall
teardown.throw(outcome._exception)
File "C:\Miniconda3\envs\test\Lib\site-packages\_pytest\unraisableexception.py", line 90, in pytest_runtest_call
yield from unraisable_exception_runtest_hook()
File "C:\Miniconda3\envs\test\Lib\site-packages\_pytest\unraisableexception.py", line 65, in unraisable_exception_runtest_hook
yield
File "C:\Miniconda3\envs\test\Lib\site-packages\pluggy\_callers.py", line 166, in _multicall
teardown.throw(outcome._exception)
File "C:\Miniconda3\envs\test\Lib\site-packages\_pytest\logging.py", line 849, in pytest_runtest_call
yield from self._runtest_for(item, "call")
File "C:\Miniconda3\envs\test\Lib\site-packages\_pytest\logging.py", line 832, in _runtest_for
yield
File "C:\Miniconda3\envs\test\Lib\site-packages\pluggy\_callers.py", line 166, in _multicall
teardown.throw(outcome._exception)
File "C:\Miniconda3\envs\test\Lib\site-packages\_pytest\capture.py", line 883, in pytest_runtest_call
return (yield)
^^^^^
File "C:\Miniconda3\envs\test\Lib\site-packages\pluggy\_callers.py", line 166, in _multicall
teardown.throw(outcome._exception)
File "C:\Miniconda3\envs\test\Lib\site-packages\_pytest\skipping.py", line 256, in pytest_runtest_call
return (yield)
^^^^^
File "C:\Miniconda3\envs\test\Lib\site-packages\pluggy\_callers.py", line 102, in _multicall
res = hook_impl.function(*args)
^^^^^^^^^^^^^^^^^^^^^^^^^
File "C:\Miniconda3\envs\test\Lib\site-packages\_pytest\runner.py", line 182, in pytest_runtest_call
raise e
File "C:\Miniconda3\envs\test\Lib\site-packages\_pytest\runner.py", line 172, in pytest_runtest_call
item.runtest()
File "C:\Miniconda3\envs\test\Lib\site-packages\_pytest\python.py", line 1772, in runtest
self.ihook.pytest_pyfunc_call(pyfuncitem=self)
File "C:\Miniconda3\envs\test\Lib\site-packages\pluggy\_hooks.py", line 501, in __call__
return self._hookexec(self.name, self._hookimpls.copy(), kwargs, firstresult)
^^^^^^^^^^^^^^^^^^^^^^^^^^^^^^^^^^^^^^^^^^^^^^^^^^^^^^^^^^^^^^^^^^^^^^
File "C:\Miniconda3\envs\test\Lib\site-packages\pluggy\_manager.py", line 119, in _hookexec
return self._inner_hookexec(hook_name, methods, kwargs, firstresult)
^^^^^^^^^^^^^^^^^^^^^^^^^^^^^^^^^^^^^^^^^^^^^^^^^^^^^^^^^^^^^
File "C:\Miniconda3\envs\test\Lib\site-packages\pluggy\_callers.py", line 138, in _multicall
raise exception.with_traceback(exception.__traceback__)
File "C:\Miniconda3\envs\test\Lib\site-packages\pluggy\_callers.py", line 102, in _multicall
res = hook_impl.function(*args)
^^^^^^^^^^^^^^^^^^^^^^^^^
File "C:\Miniconda3\envs\test\Lib\site-packages\_pytest\python.py", line 195, in pytest_pyfunc_call
result = testfunction(**testargs)
^^^^^^^^^^^^^^^^^^^^^^^^
File "C:\Miniconda3\envs\test\Lib\unittest\mock.py", line 1375, in patched
return func(*newargs, **newkeywargs)
^^^^^^^^^^^^^^^^^^^^^^^^^^^^^
File "C:\Miniconda3\envs\test\Lib\site-packages\obspy\clients\fdsn\tests\test_client.py", line 1517, in test_bad_request_exception
self.client.get_stations()
File "C:\Miniconda3\envs\test\Lib\site-packages\obspy\clients\fdsn\client.py", line 748, in get_stations
data_stream = self._download(url)
^^^^^^^^^^^^^^^^^^^
File "C:\Miniconda3\envs\test\Lib\site-packages\obspy\clients\fdsn\client.py", line 1486, in _download
raise_on_error(code, data)
File "C:\Miniconda3\envs\test\Lib\site-packages\obspy\clients\fdsn\client.py", line 1802, in raise_on_error
server_info = data.decode('ASCII', errors='ignore')
^^^^^^^^^^^
AttributeError: '_io.BytesIO' object has no attribute 'decode'
Traceback (most recent call last):
File "C:\Miniconda3\envs\test\Lib\site-packages\_pytest\runner.py", line 340, in from_call
result: Optional[TResult] = func()
^^^^^^
File "C:\Miniconda3\envs\test\Lib\site-packages\_pytest\runner.py", line 240, in <lambda>
lambda: runtest_hook(item=item, **kwds), when=when, reraise=reraise
^^^^^^^^^^^^^^^^^^^^^^^^^^^^^^^
File "C:\Miniconda3\envs\test\Lib\site-packages\pluggy\_hooks.py", line 501, in __call__
return self._hookexec(self.name, self._hookimpls.copy(), kwargs, firstresult)
^^^^^^^^^^^^^^^^^^^^^^^^^^^^^^^^^^^^^^^^^^^^^^^^^^^^^^^^^^^^^^^^^^^^^^
File "C:\Miniconda3\envs\test\Lib\site-packages\pluggy\_manager.py", line 119, in _hookexec
return self._inner_hookexec(hook_name, methods, kwargs, firstresult)
^^^^^^^^^^^^^^^^^^^^^^^^^^^^^^^^^^^^^^^^^^^^^^^^^^^^^^^^^^^^^
File "C:\Miniconda3\envs\test\Lib\site-packages\pluggy\_callers.py", line 181, in _multicall
return outcome.get_result()
^^^^^^^^^^^^^^^^^^^^
File "C:\Miniconda3\envs\test\Lib\site-packages\pluggy\_result.py", line 99, in get_result
raise exc.with_traceback(exc.__traceback__)
File "C:\Miniconda3\envs\test\Lib\site-packages\pluggy\_callers.py", line 166, in _multicall
teardown.throw(outcome._exception)
File "C:\Miniconda3\envs\test\Lib\site-packages\_pytest\threadexception.py", line 87, in pytest_runtest_call
yield from thread_exception_runtest_hook()
File "C:\Miniconda3\envs\test\Lib\site-packages\_pytest\threadexception.py", line 63, in thread_exception_runtest_hook
yield
File "C:\Miniconda3\envs\test\Lib\site-packages\pluggy\_callers.py", line 166, in _multicall
teardown.throw(outcome._exception)
File "C:\Miniconda3\envs\test\Lib\site-packages\_pytest\unraisableexception.py", line 90, in pytest_runtest_call
yield from unraisable_exception_runtest_hook()
File "C:\Miniconda3\envs\test\Lib\site-packages\_pytest\unraisableexception.py", line 65, in unraisable_exception_runtest_hook
yield
File "C:\Miniconda3\envs\test\Lib\site-packages\pluggy\_callers.py", line 166, in _multicall
teardown.throw(outcome._exception)
File "C:\Miniconda3\envs\test\Lib\site-packages\_pytest\logging.py", line 849, in pytest_runtest_call
yield from self._runtest_for(item, "call")
File "C:\Miniconda3\envs\test\Lib\site-packages\_pytest\logging.py", line 832, in _runtest_for
yield
File "C:\Miniconda3\envs\test\Lib\site-packages\pluggy\_callers.py", line 166, in _multicall
teardown.throw(outcome._exception)
File "C:\Miniconda3\envs\test\Lib\site-packages\_pytest\capture.py", line 883, in pytest_runtest_call
return (yield)
^^^^^
File "C:\Miniconda3\envs\test\Lib\site-packages\pluggy\_callers.py", line 166, in _multicall
teardown.throw(outcome._exception)
File "C:\Miniconda3\envs\test\Lib\site-packages\_pytest\skipping.py", line 256, in pytest_runtest_call
return (yield)
^^^^^
File "C:\Miniconda3\envs\test\Lib\site-packages\pluggy\_callers.py", line 102, in _multicall
res = hook_impl.function(*args)
^^^^^^^^^^^^^^^^^^^^^^^^^
File "C:\Miniconda3\envs\test\Lib\site-packages\_pytest\runner.py", line 182, in pytest_runtest_call
raise e
File "C:\Miniconda3\envs\test\Lib\site-packages\_pytest\runner.py", line 172, in pytest_runtest_call
item.runtest()
File "C:\Miniconda3\envs\test\Lib\site-packages\_pytest\python.py", line 1772, in runtest
self.ihook.pytest_pyfunc_call(pyfuncitem=self)
File "C:\Miniconda3\envs\test\Lib\site-packages\pluggy\_hooks.py", line 501, in __call__
return self._hookexec(self.name, self._hookimpls.copy(), kwargs, firstresult)
^^^^^^^^^^^^^^^^^^^^^^^^^^^^^^^^^^^^^^^^^^^^^^^^^^^^^^^^^^^^^^^^^^^^^^
File "C:\Miniconda3\envs\test\Lib\site-packages\pluggy\_manager.py", line 119, in _hookexec
return self._inner_hookexec(hook_name, methods, kwargs, firstresult)
^^^^^^^^^^^^^^^^^^^^^^^^^^^^^^^^^^^^^^^^^^^^^^^^^^^^^^^^^^^^^
File "C:\Miniconda3\envs\test\Lib\site-packages\pluggy\_callers.py", line 138, in _multicall
raise exception.with_traceback(exception.__traceback__)
File "C:\Miniconda3\envs\test\Lib\site-packages\pluggy\_callers.py", line 102, in _multicall
res = hook_impl.function(*args)
^^^^^^^^^^^^^^^^^^^^^^^^^
File "C:\Miniconda3\envs\test\Lib\site-packages\_pytest\python.py", line 195, in pytest_pyfunc_call
result = testfunction(**testargs)
^^^^^^^^^^^^^^^^^^^^^^^^
File "C:\Miniconda3\envs\test\Lib\unittest\mock.py", line 1375, in patched
return func(*newargs, **newkeywargs)
^^^^^^^^^^^^^^^^^^^^^^^^^^^^^
File "C:\Miniconda3\envs\test\Lib\site-packages\obspy\clients\fdsn\tests\test_client.py", line 1526, in test_server_exception
self.client.get_stations()
File "C:\Miniconda3\envs\test\Lib\site-packages\obspy\clients\fdsn\client.py", line 748, in get_stations
data_stream = self._download(url)
^^^^^^^^^^^^^^^^^^^
File "C:\Miniconda3\envs\test\Lib\site-packages\obspy\clients\fdsn\client.py", line 1486, in _download
raise_on_error(code, data)
File "C:\Miniconda3\envs\test\Lib\site-packages\obspy\clients\fdsn\client.py", line 1802, in raise_on_error
server_info = data.decode('ASCII', errors='ignore')
^^^^^^^^^^^
AttributeError: 'NoneType' object has no attribute 'decode'
Traceback (most recent call last):
File "C:\Miniconda3\envs\test\Lib\site-packages\_pytest\runner.py", line 340, in from_call
result: Optional[TResult] = func()
^^^^^^
File "C:\Miniconda3\envs\test\Lib\site-packages\_pytest\runner.py", line 240, in <lambda>
lambda: runtest_hook(item=item, **kwds), when=when, reraise=reraise
^^^^^^^^^^^^^^^^^^^^^^^^^^^^^^^
File "C:\Miniconda3\envs\test\Lib\site-packages\pluggy\_hooks.py", line 501, in __call__
return self._hookexec(self.name, self._hookimpls.copy(), kwargs, firstresult)
^^^^^^^^^^^^^^^^^^^^^^^^^^^^^^^^^^^^^^^^^^^^^^^^^^^^^^^^^^^^^^^^^^^^^^
File "C:\Miniconda3\envs\test\Lib\site-packages\pluggy\_manager.py", line 119, in _hookexec
return self._inner_hookexec(hook_name, methods, kwargs, firstresult)
^^^^^^^^^^^^^^^^^^^^^^^^^^^^^^^^^^^^^^^^^^^^^^^^^^^^^^^^^^^^^
File "C:\Miniconda3\envs\test\Lib\site-packages\pluggy\_callers.py", line 181, in _multicall
return outcome.get_result()
^^^^^^^^^^^^^^^^^^^^
File "C:\Miniconda3\envs\test\Lib\site-packages\pluggy\_result.py", line 99, in get_result
raise exc.with_traceback(exc.__traceback__)
File "C:\Miniconda3\envs\test\Lib\site-packages\pluggy\_callers.py", line 166, in _multicall
teardown.throw(outcome._exception)
File "C:\Miniconda3\envs\test\Lib\site-packages\_pytest\threadexception.py", line 87, in pytest_runtest_call
yield from thread_exception_runtest_hook()
File "C:\Miniconda3\envs\test\Lib\site-packages\_pytest\threadexception.py", line 63, in thread_exception_runtest_hook
yield
File "C:\Miniconda3\envs\test\Lib\site-packages\pluggy\_callers.py", line 166, in _multicall
teardown.throw(outcome._exception)
File "C:\Miniconda3\envs\test\Lib\site-packages\_pytest\unraisableexception.py", line 90, in pytest_runtest_call
yield from unraisable_exception_runtest_hook()
File "C:\Miniconda3\envs\test\Lib\site-packages\_pytest\unraisableexception.py", line 65, in unraisable_exception_runtest_hook
yield
File "C:\Miniconda3\envs\test\Lib\site-packages\pluggy\_callers.py", line 166, in _multicall
teardown.throw(outcome._exception)
File "C:\Miniconda3\envs\test\Lib\site-packages\_pytest\logging.py", line 849, in pytest_runtest_call
yield from self._runtest_for(item, "call")
File "C:\Miniconda3\envs\test\Lib\site-packages\_pytest\logging.py", line 832, in _runtest_for
yield
File "C:\Miniconda3\envs\test\Lib\site-packages\pluggy\_callers.py", line 166, in _multicall
teardown.throw(outcome._exception)
File "C:\Miniconda3\envs\test\Lib\site-packages\_pytest\capture.py", line 883, in pytest_runtest_call
return (yield)
^^^^^
File "C:\Miniconda3\envs\test\Lib\site-packages\pluggy\_callers.py", line 166, in _multicall
teardown.throw(outcome._exception)
File "C:\Miniconda3\envs\test\Lib\site-packages\_pytest\skipping.py", line 256, in pytest_runtest_call
return (yield)
^^^^^
File "C:\Miniconda3\envs\test\Lib\site-packages\pluggy\_callers.py", line 102, in _multicall
res = hook_impl.function(*args)
^^^^^^^^^^^^^^^^^^^^^^^^^
File "C:\Miniconda3\envs\test\Lib\site-packages\_pytest\runner.py", line 182, in pytest_runtest_call
raise e
File "C:\Miniconda3\envs\test\Lib\site-packages\_pytest\runner.py", line 172, in pytest_runtest_call
item.runtest()
File "C:\Miniconda3\envs\test\Lib\site-packages\_pytest\python.py", line 1772, in runtest
self.ihook.pytest_pyfunc_call(pyfuncitem=self)
File "C:\Miniconda3\envs\test\Lib\site-packages\pluggy\_hooks.py", line 501, in __call__
return self._hookexec(self.name, self._hookimpls.copy(), kwargs, firstresult)
^^^^^^^^^^^^^^^^^^^^^^^^^^^^^^^^^^^^^^^^^^^^^^^^^^^^^^^^^^^^^^^^^^^^^^
File "C:\Miniconda3\envs\test\Lib\site-packages\pluggy\_manager.py", line 119, in _hookexec
return self._inner_hookexec(hook_name, methods, kwargs, firstresult)
^^^^^^^^^^^^^^^^^^^^^^^^^^^^^^^^^^^^^^^^^^^^^^^^^^^^^^^^^^^^^
File "C:\Miniconda3\envs\test\Lib\site-packages\pluggy\_callers.py", line 138, in _multicall
raise exception.with_traceback(exception.__traceback__)
File "C:\Miniconda3\envs\test\Lib\site-packages\pluggy\_callers.py", line 102, in _multicall
res = hook_impl.function(*args)
^^^^^^^^^^^^^^^^^^^^^^^^^
File "C:\Miniconda3\envs\test\Lib\site-packages\_pytest\python.py", line 195, in pytest_pyfunc_call
result = testfunction(**testargs)
^^^^^^^^^^^^^^^^^^^^^^^^
File "C:\Miniconda3\envs\test\Lib\unittest\mock.py", line 1375, in patched
return func(*newargs, **newkeywargs)
^^^^^^^^^^^^^^^^^^^^^^^^^^^^^
File "C:\Miniconda3\envs\test\Lib\site-packages\obspy\clients\fdsn\tests\test_client.py", line 1535, in test_too_many_requests_exception
self.client.get_stations()
File "C:\Miniconda3\envs\test\Lib\site-packages\obspy\clients\fdsn\client.py", line 748, in get_stations
data_stream = self._download(url)
^^^^^^^^^^^^^^^^^^^
File "C:\Miniconda3\envs\test\Lib\site-packages\obspy\clients\fdsn\client.py", line 1486, in _download
raise_on_error(code, data)
File "C:\Miniconda3\envs\test\Lib\site-packages\obspy\clients\fdsn\client.py", line 1802, in raise_on_error
server_info = data.decode('ASCII', errors='ignore')
^^^^^^^^^^^
AttributeError: 'NoneType' object has no attribute 'decode'
Traceback (most recent call last):
File "C:\Miniconda3\envs\test\Lib\site-packages\_pytest\runner.py", line 340, in from_call
result: Optional[TResult] = func()
^^^^^^
File "C:\Miniconda3\envs\test\Lib\site-packages\_pytest\runner.py", line 240, in <lambda>
lambda: runtest_hook(item=item, **kwds), when=when, reraise=reraise
^^^^^^^^^^^^^^^^^^^^^^^^^^^^^^^
File "C:\Miniconda3\envs\test\Lib\site-packages\pluggy\_hooks.py", line 501, in __call__
return self._hookexec(self.name, self._hookimpls.copy(), kwargs, firstresult)
^^^^^^^^^^^^^^^^^^^^^^^^^^^^^^^^^^^^^^^^^^^^^^^^^^^^^^^^^^^^^^^^^^^^^^
File "C:\Miniconda3\envs\test\Lib\site-packages\pluggy\_manager.py", line 119, in _hookexec
return self._inner_hookexec(hook_name, methods, kwargs, firstresult)
^^^^^^^^^^^^^^^^^^^^^^^^^^^^^^^^^^^^^^^^^^^^^^^^^^^^^^^^^^^^^
File "C:\Miniconda3\envs\test\Lib\site-packages\pluggy\_callers.py", line 181, in _multicall
return outcome.get_result()
^^^^^^^^^^^^^^^^^^^^
File "C:\Miniconda3\envs\test\Lib\site-packages\pluggy\_result.py", line 99, in get_result
raise exc.with_traceback(exc.__traceback__)
File "C:\Miniconda3\envs\test\Lib\site-packages\pluggy\_callers.py", line 166, in _multicall
teardown.throw(outcome._exception)
File "C:\Miniconda3\envs\test\Lib\site-packages\_pytest\threadexception.py", line 87, in pytest_runtest_call
yield from thread_exception_runtest_hook()
File "C:\Miniconda3\envs\test\Lib\site-packages\_pytest\threadexception.py", line 63, in thread_exception_runtest_hook
yield
File "C:\Miniconda3\envs\test\Lib\site-packages\pluggy\_callers.py", line 166, in _multicall
teardown.throw(outcome._exception)
File "C:\Miniconda3\envs\test\Lib\site-packages\_pytest\unraisableexception.py", line 90, in pytest_runtest_call
yield from unraisable_exception_runtest_hook()
File "C:\Miniconda3\envs\test\Lib\site-packages\_pytest\unraisableexception.py", line 65, in unraisable_exception_runtest_hook
yield
File "C:\Miniconda3\envs\test\Lib\site-packages\pluggy\_callers.py", line 166, in _multicall
teardown.throw(outcome._exception)
File "C:\Miniconda3\envs\test\Lib\site-packages\_pytest\logging.py", line 849, in pytest_runtest_call
yield from self._runtest_for(item, "call")
File "C:\Miniconda3\envs\test\Lib\site-packages\_pytest\logging.py", line 832, in _runtest_for
yield
File "C:\Miniconda3\envs\test\Lib\site-packages\pluggy\_callers.py", line 166, in _multicall
teardown.throw(outcome._exception)
File "C:\Miniconda3\envs\test\Lib\site-packages\_pytest\capture.py", line 883, in pytest_runtest_call
return (yield)
^^^^^
File "C:\Miniconda3\envs\test\Lib\site-packages\pluggy\_callers.py", line 166, in _multicall
teardown.throw(outcome._exception)
File "C:\Miniconda3\envs\test\Lib\site-packages\_pytest\skipping.py", line 256, in pytest_runtest_call
return (yield)
^^^^^
File "C:\Miniconda3\envs\test\Lib\site-packages\pluggy\_callers.py", line 102, in _multicall
res = hook_impl.function(*args)
^^^^^^^^^^^^^^^^^^^^^^^^^
File "C:\Miniconda3\envs\test\Lib\site-packages\_pytest\runner.py", line 182, in pytest_runtest_call
raise e
File "C:\Miniconda3\envs\test\Lib\site-packages\_pytest\runner.py", line 172, in pytest_runtest_call
item.runtest()
File "C:\Miniconda3\envs\test\Lib\site-packages\_pytest\python.py", line 1772, in runtest
self.ihook.pytest_pyfunc_call(pyfuncitem=self)
File "C:\Miniconda3\envs\test\Lib\site-packages\pluggy\_hooks.py", line 501, in __call__
return self._hookexec(self.name, self._hookimpls.copy(), kwargs, firstresult)
^^^^^^^^^^^^^^^^^^^^^^^^^^^^^^^^^^^^^^^^^^^^^^^^^^^^^^^^^^^^^^^^^^^^^^
File "C:\Miniconda3\envs\test\Lib\site-packages\pluggy\_manager.py", line 119, in _hookexec
return self._inner_hookexec(hook_name, methods, kwargs, firstresult)
^^^^^^^^^^^^^^^^^^^^^^^^^^^^^^^^^^^^^^^^^^^^^^^^^^^^^^^^^^^^^
File "C:\Miniconda3\envs\test\Lib\site-packages\pluggy\_callers.py", line 138, in _multicall
raise exception.with_traceback(exception.__traceback__)
File "C:\Miniconda3\envs\test\Lib\site-packages\pluggy\_callers.py", line 102, in _multicall
res = hook_impl.function(*args)
^^^^^^^^^^^^^^^^^^^^^^^^^
File "C:\Miniconda3\envs\test\Lib\site-packages\_pytest\python.py", line 195, in pytest_pyfunc_call
result = testfunction(**testargs)
^^^^^^^^^^^^^^^^^^^^^^^^
File "C:\Miniconda3\envs\test\Lib\site-packages\obspy\clients\fdsn\tests\test_eidaws_routing_client.py", line 135, in test_error_handling
self.client.get_waveforms(
File "C:\Miniconda3\envs\test\Lib\site-packages\decorator.py", line 232, in fun
return caller(func, *(extras + args), **kw)
^^^^^^^^^^^^^^^^^^^^^^^^^^^^^^^^^^^^
File "C:\Miniconda3\envs\test\Lib\site-packages\obspy\clients\fdsn\routing\routing_client.py", line 84, in _assert_filename_not_in_kwargs
return f(*args, **kwargs)
^^^^^^^^^^^^^^^^^^
File "C:\Miniconda3\envs\test\Lib\site-packages\decorator.py", line 232, in fun
return caller(func, *(extras + args), **kw)
^^^^^^^^^^^^^^^^^^^^^^^^^^^^^^^^^^^^
File "C:\Miniconda3\envs\test\Lib\site-packages\obspy\clients\fdsn\routing\routing_client.py", line 91, in _assert_attach_response_not_in_kwargs
return f(*args, **kwargs)
^^^^^^^^^^^^^^^^^^
File "C:\Miniconda3\envs\test\Lib\site-packages\obspy\clients\fdsn\routing\routing_client.py", line 335, in get_waveforms
return self.get_waveforms_bulk([bulk], **kwargs)
^^^^^^^^^^^^^^^^^^^^^^^^^^^^^^^^^^^^^^^^^
File "C:\Miniconda3\envs\test\Lib\site-packages\decorator.py", line 232, in fun
return caller(func, *(extras + args), **kw)
^^^^^^^^^^^^^^^^^^^^^^^^^^^^^^^^^^^^
File "C:\Miniconda3\envs\test\Lib\site-packages\obspy\clients\fdsn\routing\routing_client.py", line 84, in _assert_filename_not_in_kwargs
return f(*args, **kwargs)
^^^^^^^^^^^^^^^^^^
File "C:\Miniconda3\envs\test\Lib\site-packages\decorator.py", line 232, in fun
return caller(func, *(extras + args), **kw)
^^^^^^^^^^^^^^^^^^^^^^^^^^^^^^^^^^^^
File "C:\Miniconda3\envs\test\Lib\site-packages\obspy\clients\fdsn\routing\routing_client.py", line 91, in _assert_attach_response_not_in_kwargs
return f(*args, **kwargs)
^^^^^^^^^^^^^^^^^^
File "C:\Miniconda3\envs\test\Lib\site-packages\obspy\clients\fdsn\routing\eidaws_routing_client.py", line 99, in get_waveforms_bulk
inv = self.get_stations_bulk(_b, level="channel", **kwargs)
^^^^^^^^^^^^^^^^^^^^^^^^^^^^^^^^^^^^^^^^^^^^^^^^^^^^^
File "C:\Miniconda3\envs\test\Lib\site-packages\decorator.py", line 232, in fun
return caller(func, *(extras + args), **kw)
^^^^^^^^^^^^^^^^^^^^^^^^^^^^^^^^^^^^
File "C:\Miniconda3\envs\test\Lib\site-packages\obspy\clients\fdsn\routing\routing_client.py", line 77, in _assert_format_not_in_kwargs
return f(*args, **kwargs)
^^^^^^^^^^^^^^^^^^
File "C:\Miniconda3\envs\test\Lib\site-packages\decorator.py", line 232, in fun
return caller(func, *(extras + args), **kw)
^^^^^^^^^^^^^^^^^^^^^^^^^^^^^^^^^^^^
File "C:\Miniconda3\envs\test\Lib\site-packages\obspy\clients\fdsn\routing\routing_client.py", line 84, in _assert_filename_not_in_kwargs
return f(*args, **kwargs)
^^^^^^^^^^^^^^^^^^
File "C:\Miniconda3\envs\test\Lib\site-packages\obspy\clients\fdsn\routing\eidaws_routing_client.py", line 175, in get_stations_bulk
r = self._download(self._url + "/query", data=bulk_str,
^^^^^^^^^^^^^^^^^^^^^^^^^^^^^^^^^^^^^^^^^^^^^^^^^^^
File "C:\Miniconda3\envs\test\Lib\site-packages\obspy\clients\base.py", line 249, in _download
self._handle_requests_http_error(r)
File "C:\Miniconda3\envs\test\Lib\site-packages\obspy\clients\fdsn\routing\routing_client.py", line 304, in _handle_requests_http_error
raise_on_error(r.status_code, buf)
File "C:\Miniconda3\envs\test\Lib\site-packages\obspy\clients\fdsn\client.py", line 1802, in raise_on_error
server_info = data.decode('ASCII', errors='ignore')
^^^^^^^^^^^
AttributeError: '_io.BytesIO' object has no attribute 'decode'
Traceback (most recent call last):
File "C:\Miniconda3\envs\test\Lib\site-packages\_pytest\runner.py", line 340, in from_call
result: Optional[TResult] = func()
^^^^^^
File "C:\Miniconda3\envs\test\Lib\site-packages\_pytest\runner.py", line 240, in <lambda>
lambda: runtest_hook(item=item, **kwds), when=when, reraise=reraise
^^^^^^^^^^^^^^^^^^^^^^^^^^^^^^^
File "C:\Miniconda3\envs\test\Lib\site-packages\pluggy\_hooks.py", line 501, in __call__
return self._hookexec(self.name, self._hookimpls.copy(), kwargs, firstresult)
^^^^^^^^^^^^^^^^^^^^^^^^^^^^^^^^^^^^^^^^^^^^^^^^^^^^^^^^^^^^^^^^^^^^^^
File "C:\Miniconda3\envs\test\Lib\site-packages\pluggy\_manager.py", line 119, in _hookexec
return self._inner_hookexec(hook_name, methods, kwargs, firstresult)
^^^^^^^^^^^^^^^^^^^^^^^^^^^^^^^^^^^^^^^^^^^^^^^^^^^^^^^^^^^^^
File "C:\Miniconda3\envs\test\Lib\site-packages\pluggy\_callers.py", line 181, in _multicall
return outcome.get_result()
^^^^^^^^^^^^^^^^^^^^
File "C:\Miniconda3\envs\test\Lib\site-packages\pluggy\_result.py", line 99, in get_result
raise exc.with_traceback(exc.__traceback__)
File "C:\Miniconda3\envs\test\Lib\site-packages\pluggy\_callers.py", line 166, in _multicall
teardown.throw(outcome._exception)
File "C:\Miniconda3\envs\test\Lib\site-packages\_pytest\threadexception.py", line 87, in pytest_runtest_call
yield from thread_exception_runtest_hook()
File "C:\Miniconda3\envs\test\Lib\site-packages\_pytest\threadexception.py", line 63, in thread_exception_runtest_hook
yield
File "C:\Miniconda3\envs\test\Lib\site-packages\pluggy\_callers.py", line 166, in _multicall
teardown.throw(outcome._exception)
File "C:\Miniconda3\envs\test\Lib\site-packages\_pytest\unraisableexception.py", line 90, in pytest_runtest_call
yield from unraisable_exception_runtest_hook()
File "C:\Miniconda3\envs\test\Lib\site-packages\_pytest\unraisableexception.py", line 65, in unraisable_exception_runtest_hook
yield
File "C:\Miniconda3\envs\test\Lib\site-packages\pluggy\_callers.py", line 166, in _multicall
teardown.throw(outcome._exception)
File "C:\Miniconda3\envs\test\Lib\site-packages\_pytest\logging.py", line 849, in pytest_runtest_call
yield from self._runtest_for(item, "call")
File "C:\Miniconda3\envs\test\Lib\site-packages\_pytest\logging.py", line 832, in _runtest_for
yield
File "C:\Miniconda3\envs\test\Lib\site-packages\pluggy\_callers.py", line 166, in _multicall
teardown.throw(outcome._exception)
File "C:\Miniconda3\envs\test\Lib\site-packages\_pytest\capture.py", line 883, in pytest_runtest_call
return (yield)
^^^^^
File "C:\Miniconda3\envs\test\Lib\site-packages\pluggy\_callers.py", line 166, in _multicall
teardown.throw(outcome._exception)
File "C:\Miniconda3\envs\test\Lib\site-packages\_pytest\skipping.py", line 256, in pytest_runtest_call
return (yield)
^^^^^
File "C:\Miniconda3\envs\test\Lib\site-packages\pluggy\_callers.py", line 102, in _multicall
res = hook_impl.function(*args)
^^^^^^^^^^^^^^^^^^^^^^^^^
File "C:\Miniconda3\envs\test\Lib\site-packages\_pytest\runner.py", line 182, in pytest_runtest_call
raise e
File "C:\Miniconda3\envs\test\Lib\site-packages\_pytest\runner.py", line 172, in pytest_runtest_call
item.runtest()
File "C:\Miniconda3\envs\test\Lib\site-packages\_pytest\python.py", line 1772, in runtest
self.ihook.pytest_pyfunc_call(pyfuncitem=self)
File "C:\Miniconda3\envs\test\Lib\site-packages\pluggy\_hooks.py", line 501, in __call__
return self._hookexec(self.name, self._hookimpls.copy(), kwargs, firstresult)
^^^^^^^^^^^^^^^^^^^^^^^^^^^^^^^^^^^^^^^^^^^^^^^^^^^^^^^^^^^^^^^^^^^^^^
File "C:\Miniconda3\envs\test\Lib\site-packages\pluggy\_manager.py", line 119, in _hookexec
return self._inner_hookexec(hook_name, methods, kwargs, firstresult)
^^^^^^^^^^^^^^^^^^^^^^^^^^^^^^^^^^^^^^^^^^^^^^^^^^^^^^^^^^^^^
File "C:\Miniconda3\envs\test\Lib\site-packages\pluggy\_callers.py", line 138, in _multicall
raise exception.with_traceback(exception.__traceback__)
File "C:\Miniconda3\envs\test\Lib\site-packages\pluggy\_callers.py", line 102, in _multicall
res = hook_impl.function(*args)
^^^^^^^^^^^^^^^^^^^^^^^^^
File "C:\Miniconda3\envs\test\Lib\site-packages\_pytest\python.py", line 195, in pytest_pyfunc_call
result = testfunction(**testargs)
^^^^^^^^^^^^^^^^^^^^^^^^
File "C:\Miniconda3\envs\test\Lib\site-packages\obspy\clients\fdsn\tests\test_federator_routing_client.py", line 337, in test_get_stations_integration_test
assert len(inv2) >= 1
AssertionError: assert 0 >= 1
+ where 0 = len(<obspy.core.inventory.inventory.Inventory object at 0x000001CA2BC11650>)
Traceback (most recent call last):
File "C:\Miniconda3\envs\test\Lib\site-packages\_pytest\runner.py", line 340, in from_call
result: Optional[TResult] = func()
^^^^^^
File "C:\Miniconda3\envs\test\Lib\site-packages\_pytest\runner.py", line 240, in <lambda>
lambda: runtest_hook(item=item, **kwds), when=when, reraise=reraise
^^^^^^^^^^^^^^^^^^^^^^^^^^^^^^^
File "C:\Miniconda3\envs\test\Lib\site-packages\pluggy\_hooks.py", line 501, in __call__
return self._hookexec(self.name, self._hookimpls.copy(), kwargs, firstresult)
^^^^^^^^^^^^^^^^^^^^^^^^^^^^^^^^^^^^^^^^^^^^^^^^^^^^^^^^^^^^^^^^^^^^^^
File "C:\Miniconda3\envs\test\Lib\site-packages\pluggy\_manager.py", line 119, in _hookexec
return self._inner_hookexec(hook_name, methods, kwargs, firstresult)
^^^^^^^^^^^^^^^^^^^^^^^^^^^^^^^^^^^^^^^^^^^^^^^^^^^^^^^^^^^^^
File "C:\Miniconda3\envs\test\Lib\site-packages\pluggy\_callers.py", line 181, in _multicall
return outcome.get_result()
^^^^^^^^^^^^^^^^^^^^
File "C:\Miniconda3\envs\test\Lib\site-packages\pluggy\_result.py", line 99, in get_result
raise exc.with_traceback(exc.__traceback__)
File "C:\Miniconda3\envs\test\Lib\site-packages\pluggy\_callers.py", line 166, in _multicall
teardown.throw(outcome._exception)
File "C:\Miniconda3\envs\test\Lib\site-packages\_pytest\threadexception.py", line 87, in pytest_runtest_call
yield from thread_exception_runtest_hook()
File "C:\Miniconda3\envs\test\Lib\site-packages\_pytest\threadexception.py", line 63, in thread_exception_runtest_hook
yield
File "C:\Miniconda3\envs\test\Lib\site-packages\pluggy\_callers.py", line 166, in _multicall
teardown.throw(outcome._exception)
File "C:\Miniconda3\envs\test\Lib\site-packages\_pytest\unraisableexception.py", line 90, in pytest_runtest_call
yield from unraisable_exception_runtest_hook()
File "C:\Miniconda3\envs\test\Lib\site-packages\_pytest\unraisableexception.py", line 65, in unraisable_exception_runtest_hook
yield
File "C:\Miniconda3\envs\test\Lib\site-packages\pluggy\_callers.py", line 166, in _multicall
teardown.throw(outcome._exception)
File "C:\Miniconda3\envs\test\Lib\site-packages\_pytest\logging.py", line 849, in pytest_runtest_call
yield from self._runtest_for(item, "call")
File "C:\Miniconda3\envs\test\Lib\site-packages\_pytest\logging.py", line 832, in _runtest_for
yield
File "C:\Miniconda3\envs\test\Lib\site-packages\pluggy\_callers.py", line 166, in _multicall
teardown.throw(outcome._exception)
File "C:\Miniconda3\envs\test\Lib\site-packages\_pytest\capture.py", line 883, in pytest_runtest_call
return (yield)
^^^^^
File "C:\Miniconda3\envs\test\Lib\site-packages\pluggy\_callers.py", line 166, in _multicall
teardown.throw(outcome._exception)
File "C:\Miniconda3\envs\test\Lib\site-packages\_pytest\skipping.py", line 256, in pytest_runtest_call
return (yield)
^^^^^
File "C:\Miniconda3\envs\test\Lib\site-packages\pluggy\_callers.py", line 102, in _multicall
res = hook_impl.function(*args)
^^^^^^^^^^^^^^^^^^^^^^^^^
File "C:\Miniconda3\envs\test\Lib\site-packages\_pytest\runner.py", line 182, in pytest_runtest_call
raise e
File "C:\Miniconda3\envs\test\Lib\site-packages\_pytest\runner.py", line 172, in pytest_runtest_call
item.runtest()
File "C:\Miniconda3\envs\test\Lib\site-packages\_pytest\python.py", line 1772, in runtest
self.ihook.pytest_pyfunc_call(pyfuncitem=self)
File "C:\Miniconda3\envs\test\Lib\site-packages\pluggy\_hooks.py", line 501, in __call__
return self._hookexec(self.name, self._hookimpls.copy(), kwargs, firstresult)
^^^^^^^^^^^^^^^^^^^^^^^^^^^^^^^^^^^^^^^^^^^^^^^^^^^^^^^^^^^^^^^^^^^^^^
File "C:\Miniconda3\envs\test\Lib\site-packages\pluggy\_manager.py", line 119, in _hookexec
return self._inner_hookexec(hook_name, methods, kwargs, firstresult)
^^^^^^^^^^^^^^^^^^^^^^^^^^^^^^^^^^^^^^^^^^^^^^^^^^^^^^^^^^^^^
File "C:\Miniconda3\envs\test\Lib\site-packages\pluggy\_callers.py", line 138, in _multicall
raise exception.with_traceback(exception.__traceback__)
File "C:\Miniconda3\envs\test\Lib\site-packages\pluggy\_callers.py", line 102, in _multicall
res = hook_impl.function(*args)
^^^^^^^^^^^^^^^^^^^^^^^^^
File "C:\Miniconda3\envs\test\Lib\site-packages\_pytest\python.py", line 195, in pytest_pyfunc_call
result = testfunction(**testargs)
^^^^^^^^^^^^^^^^^^^^^^^^
File "C:\Miniconda3\envs\test\Lib\site-packages\obspy\clients\iris\tests\test_client.py", line 147, in test_evalresp
client.evalresp(network="IU", station="ANMO", location="00",
File "C:\Miniconda3\envs\test\Lib\site-packages\obspy\clients\iris\client.py", line 970, in evalresp
data = self._fetch("evalresp", **kwargs)
^^^^^^^^^^^^^^^^^^^^^^^^^^^^^^^^^
File "C:\Miniconda3\envs\test\Lib\site-packages\obspy\clients\iris\client.py", line 124, in _fetch
response = urllib_request.urlopen(req, timeout=self.timeout)
^^^^^^^^^^^^^^^^^^^^^^^^^^^^^^^^^^^^^^^^^^^^^^^^^
File "C:\Miniconda3\envs\test\Lib\urllib\request.py", line 216, in urlopen
return opener.open(url, data, timeout)
^^^^^^^^^^^^^^^^^^^^^^^^^^^^^^^
File "C:\Miniconda3\envs\test\Lib\urllib\request.py", line 525, in open
response = meth(req, response)
^^^^^^^^^^^^^^^^^^^
File "C:\Miniconda3\envs\test\Lib\urllib\request.py", line 634, in http_response
response = self.parent.error(
^^^^^^^^^^^^^^^^^^
File "C:\Miniconda3\envs\test\Lib\urllib\request.py", line 563, in error
return self._call_chain(*args)
^^^^^^^^^^^^^^^^^^^^^^^
File "C:\Miniconda3\envs\test\Lib\urllib\request.py", line 496, in _call_chain
result = func(*args)
^^^^^^^^^^^
File "C:\Miniconda3\envs\test\Lib\urllib\request.py", line 643, in http_error_default
raise HTTPError(req.full_url, code, msg, hdrs, fp)
urllib.error.HTTPError: HTTP Error 500:
200 Supports ``fnmatch`` wildcards, e.g. ``*`` and ``?``, in ``network``,
201 ``station``, ``location`` and ``channel``.
202
203 >>> client = Client('rtserver.ipgp.fr')
204 >>> info = client.get_info(station="FDFM")
205 >>> print(info)
206 [('G', 'FDFM')]
207 >>> info = client.get_info(station="FD?M", channel='*Z',
208 ... level='channel')
209 >>> print(info) # doctest: +NORMALIZE_WHITESPACE
Expected:
[('G', 'FDFM', '00', 'BHZ'), ('G', 'FDFM', '00', 'HHZ'),
('G', 'FDFM', '00', 'HNZ'), ('G', 'FDFM', '00', 'LHZ'),
('G', 'FDFM', '10', 'BHZ'), ('G', 'FDFM', '10', 'HHZ'),
('G', 'FDFM', '10', 'LHZ')]
Got:
[('G', 'FDFM', '00', 'BHZ'), ('G', 'FDFM', '00', 'HHZ'), ('G', 'FDFM', '00', 'HNZ'), ('G', 'FDFM', '00', 'LHZ')]
C:\Miniconda3\envs\test\Lib\site-packages\obspy\clients\seedlink\basic_client.py:209: DocTestFailure
078 >>> print(st) # doctest: +ELLIPSIS
079 1 Trace(s) in Stream:
080 G.FDFM.00.BHZ | 20... | 20.0 Hz, ... samples
081
082 Most servers support '?' single-character wildcard in location and
083 channel code fields:
084
085 >>> st = client.get_waveforms("G", "FDFM", "??", "B??", t, t + 5)
086 >>> st = st.sort(reverse=True)
087 >>> print(st) # doctest: +ELLIPSIS
Differences (unified diff with -expected +actual):
@@ -1,7 +1,4 @@
-6 Trace(s) in Stream:
-G.FDFM.10.BHZ | 20... | 20.0 Hz, ... samples
-G.FDFM.10.BHN | 20... | 20.0 Hz, ... samples
-G.FDFM.10.BHE | 20... | 20.0 Hz, ... samples
-G.FDFM.00.BHZ | 20... | 20.0 Hz, ... samples
-G.FDFM.00.BHN | 20... | 20.0 Hz, ... samples
-G.FDFM.00.BHE | 20... | 20.0 Hz, ... samples
+3 Trace(s) in Stream:
+G.FDFM.00.BHZ | 2024-03-16T10:26:55.800000Z - 2024-03-16T10:27:00.800000Z | 20.0 Hz, 101 samples
+G.FDFM.00.BHN | 2024-03-16T10:26:55.800000Z - 2024-03-16T10:27:00.800000Z | 20.0 Hz, 101 samples
+G.FDFM.00.BHE | 2024-03-16T10:26:55.800000Z - 2024-03-16T10:27:00.800000Z | 20.0 Hz, 101 samples
C:\Miniconda3\envs\test\Lib\site-packages\obspy\clients\seedlink\basic_client.py:87: DocTestFailure
Traceback (most recent call last):
File "C:\Miniconda3\envs\test\Lib\site-packages\obspy\clients\syngine\client.py", line 183, in __read_to_stream
st = obspy.read(buf)
^^^^^^^^^^^^^^^
File "C:\Miniconda3\envs\test\Lib\site-packages\decorator.py", line 232, in fun
return caller(func, *(extras + args), **kw)
^^^^^^^^^^^^^^^^^^^^^^^^^^^^^^^^^^^^
File "C:\Miniconda3\envs\test\Lib\site-packages\obspy\core\util\decorator.py", line 298, in _map_example_filename
return func(*args, **kwargs)
^^^^^^^^^^^^^^^^^^^^^
File "C:\Miniconda3\envs\test\Lib\site-packages\obspy\core\stream.py", line 208, in read
st = _generic_reader(pathname_or_url, _read, **kwargs)
^^^^^^^^^^^^^^^^^^^^^^^^^^^^^^^^^^^^^^^^^^^^^^^^^
File "C:\Miniconda3\envs\test\Lib\site-packages\obspy\core\util\base.py", line 625, in _generic_reader
return callback_func(pathname_or_url, **kwargs)
^^^^^^^^^^^^^^^^^^^^^^^^^^^^^^^^^^^^^^^^
File "C:\Miniconda3\envs\test\Lib\site-packages\decorator.py", line 232, in fun
return caller(func, *(extras + args), **kw)
^^^^^^^^^^^^^^^^^^^^^^^^^^^^^^^^^^^^
File "C:\Miniconda3\envs\test\Lib\site-packages\obspy\core\util\decorator.py", line 143, in uncompress_file
return func(filename, *args, **kwargs)
^^^^^^^^^^^^^^^^^^^^^^^^^^^^^^^
File "C:\Miniconda3\envs\test\Lib\site-packages\obspy\core\stream.py", line 253, in _read
stream, format = _read_from_plugin('waveform', filename, format=format,
^^^^^^^^^^^^^^^^^^^^^^^^^^^^^^^^^^^^^^^^^^^^^^^^^^^^^^
File "C:\Miniconda3\envs\test\Lib\site-packages\obspy\core\util\base.py", line 406, in _read_from_plugin
raise TypeError('Unknown format for file %s' % filename)
TypeError: Unknown format for file <_io.BytesIO object at 0x000001CA303C5C60>
During handling of the above exception, another exception occurred:
Traceback (most recent call last):
File "C:\Miniconda3\envs\test\Lib\site-packages\_pytest\runner.py", line 340, in from_call
result: Optional[TResult] = func()
^^^^^^
File "C:\Miniconda3\envs\test\Lib\site-packages\_pytest\runner.py", line 240, in <lambda>
lambda: runtest_hook(item=item, **kwds), when=when, reraise=reraise
^^^^^^^^^^^^^^^^^^^^^^^^^^^^^^^
File "C:\Miniconda3\envs\test\Lib\site-packages\pluggy\_hooks.py", line 501, in __call__
return self._hookexec(self.name, self._hookimpls.copy(), kwargs, firstresult)
^^^^^^^^^^^^^^^^^^^^^^^^^^^^^^^^^^^^^^^^^^^^^^^^^^^^^^^^^^^^^^^^^^^^^^
File "C:\Miniconda3\envs\test\Lib\site-packages\pluggy\_manager.py", line 119, in _hookexec
return self._inner_hookexec(hook_name, methods, kwargs, firstresult)
^^^^^^^^^^^^^^^^^^^^^^^^^^^^^^^^^^^^^^^^^^^^^^^^^^^^^^^^^^^^^
File "C:\Miniconda3\envs\test\Lib\site-packages\pluggy\_callers.py", line 181, in _multicall
return outcome.get_result()
^^^^^^^^^^^^^^^^^^^^
File "C:\Miniconda3\envs\test\Lib\site-packages\pluggy\_result.py", line 99, in get_result
raise exc.with_traceback(exc.__traceback__)
File "C:\Miniconda3\envs\test\Lib\site-packages\pluggy\_callers.py", line 166, in _multicall
teardown.throw(outcome._exception)
File "C:\Miniconda3\envs\test\Lib\site-packages\_pytest\threadexception.py", line 87, in pytest_runtest_call
yield from thread_exception_runtest_hook()
File "C:\Miniconda3\envs\test\Lib\site-packages\_pytest\threadexception.py", line 63, in thread_exception_runtest_hook
yield
File "C:\Miniconda3\envs\test\Lib\site-packages\pluggy\_callers.py", line 166, in _multicall
teardown.throw(outcome._exception)
File "C:\Miniconda3\envs\test\Lib\site-packages\_pytest\unraisableexception.py", line 90, in pytest_runtest_call
yield from unraisable_exception_runtest_hook()
File "C:\Miniconda3\envs\test\Lib\site-packages\_pytest\unraisableexception.py", line 65, in unraisable_exception_runtest_hook
yield
File "C:\Miniconda3\envs\test\Lib\site-packages\pluggy\_callers.py", line 166, in _multicall
teardown.throw(outcome._exception)
File "C:\Miniconda3\envs\test\Lib\site-packages\_pytest\logging.py", line 849, in pytest_runtest_call
yield from self._runtest_for(item, "call")
File "C:\Miniconda3\envs\test\Lib\site-packages\_pytest\logging.py", line 832, in _runtest_for
yield
File "C:\Miniconda3\envs\test\Lib\site-packages\pluggy\_callers.py", line 166, in _multicall
teardown.throw(outcome._exception)
File "C:\Miniconda3\envs\test\Lib\site-packages\_pytest\capture.py", line 883, in pytest_runtest_call
return (yield)
^^^^^
File "C:\Miniconda3\envs\test\Lib\site-packages\pluggy\_callers.py", line 166, in _multicall
teardown.throw(outcome._exception)
File "C:\Miniconda3\envs\test\Lib\site-packages\_pytest\skipping.py", line 256, in pytest_runtest_call
return (yield)
^^^^^
File "C:\Miniconda3\envs\test\Lib\site-packages\pluggy\_callers.py", line 102, in _multicall
res = hook_impl.function(*args)
^^^^^^^^^^^^^^^^^^^^^^^^^
File "C:\Miniconda3\envs\test\Lib\site-packages\_pytest\runner.py", line 182, in pytest_runtest_call
raise e
File "C:\Miniconda3\envs\test\Lib\site-packages\_pytest\runner.py", line 172, in pytest_runtest_call
item.runtest()
File "C:\Miniconda3\envs\test\Lib\site-packages\_pytest\python.py", line 1772, in runtest
self.ihook.pytest_pyfunc_call(pyfuncitem=self)
File "C:\Miniconda3\envs\test\Lib\site-packages\pluggy\_hooks.py", line 501, in __call__
return self._hookexec(self.name, self._hookimpls.copy(), kwargs, firstresult)
^^^^^^^^^^^^^^^^^^^^^^^^^^^^^^^^^^^^^^^^^^^^^^^^^^^^^^^^^^^^^^^^^^^^^^
File "C:\Miniconda3\envs\test\Lib\site-packages\pluggy\_manager.py", line 119, in _hookexec
return self._inner_hookexec(hook_name, methods, kwargs, firstresult)
^^^^^^^^^^^^^^^^^^^^^^^^^^^^^^^^^^^^^^^^^^^^^^^^^^^^^^^^^^^^^
File "C:\Miniconda3\envs\test\Lib\site-packages\pluggy\_callers.py", line 138, in _multicall
raise exception.with_traceback(exception.__traceback__)
File "C:\Miniconda3\envs\test\Lib\site-packages\pluggy\_callers.py", line 102, in _multicall
res = hook_impl.function(*args)
^^^^^^^^^^^^^^^^^^^^^^^^^
File "C:\Miniconda3\envs\test\Lib\site-packages\_pytest\python.py", line 195, in pytest_pyfunc_call
result = testfunction(**testargs)
^^^^^^^^^^^^^^^^^^^^^^^^
File "C:\Miniconda3\envs\test\Lib\site-packages\obspy\clients\syngine\tests\test_client.py", line 437, in test_reading_saczip_files
st = self.c.get_waveforms(
^^^^^^^^^^^^^^^^^^^^^
File "C:\Miniconda3\envs\test\Lib\site-packages\obspy\clients\syngine\client.py", line 370, in get_waveforms
return self.__read_to_stream(r=r)
^^^^^^^^^^^^^^^^^^^^^^^^^^
File "C:\Miniconda3\envs\test\Lib\site-packages\obspy\clients\syngine\client.py", line 193, in __read_to_stream
with io.BytesIO(zip_obj.read(name)) as buf_2:
^^^^^^^^^^^^^^^^^^
File "C:\Miniconda3\envs\test\Lib\zipfile.py", line 1518, in read
with self.open(name, "r", pwd) as fp:
^^^^^^^^^^^^^^^^^^^^^^^^^
File "C:\Miniconda3\envs\test\Lib\zipfile.py", line 1576, in open
raise BadZipFile("Bad magic number for file header")
zipfile.BadZipFile: Bad magic number for file header

Skipped tests (5)

Submodule Test Skip message
clients.fdsn clients/fdsn/tests/test_client.py::TestClient::test_trim_stream_after_get_waveform Skipped: data no longer available
clients.fdsn clients/fdsn/tests/test_client.py::TestClient::test_eida_token_resolution Skipped: Token is expired
clients.seedlink clients/seedlink/tests/test_slclient.py::TestSLClient::test_info Skipped: test must be started manually
clients.seedlink clients/seedlink/tests/test_slclient.py::TestSLClient::test_time_window Skipped: test must be started manually
clients.seedlink clients/seedlink/tests/test_slclient.py::TestSLClient::test_issue708 Skipped: test must be started manually

Slowest tests (20)

Runtime Test
16.047s clients/fdsn/tests/test_eidaws_routing_client.py::TestEIDAWSRoutingClient::test_get_waveforms_integration_test
9.736s clients/fdsn/tests/test_client.py::TestClient::test_irisph5_event
8.047s clients/syngine/tests/test_client.py::TestClient::test_get_available_models
7.812s clients/fdsn/tests/test_client.py::TestClient::test_dataselect_bulk
5.098s clients/fdsn/tests/test_client.py::TestClient::test_iris_example_queries_dataselect
4.477s clients/fdsn/tests/test_client.py::TestClient::test_iris_example_queries_dataselect_discover_services_false
3.663s clients/seedlink/tests/test_basic_client.py::TestClient::test_multiple_waveform_requests_with_multiple_info_requests
3.281s clients/syngine/tests/test_client.py::TestClient::test_get_waveforms
2.815s clients/syngine/__init__.py::obspy.clients.syngine
2.575s clients/fdsn/client.py::obspy.clients.fdsn.client.Client.get_waveforms_bulk
2.563s clients/fdsn/tests/test_client.py::TestClient::test_redirection_auth
2.531s clients/fdsn/tests/test_eidaws_routing_client.py::TestEIDAWSRoutingClient::test_get_stations_integration_test
2.506s clients/nrl/client.py::obspy.clients.nrl.client.NRL.get_response
2.394s clients/fdsn/tests/test_client.py::TestClient::test_redirection
2.206s core/tests/test_stream.py::TestStream::test_read_url_via_network
2.024s clients/fdsn/tests/test_federator_routing_client.py::TestFederatorRoutingClient::test_get_waveforms_integration_test
1.600s clients/fdsn/tests/test_mass_downloader.py::TestDownloadHelper::test_download_method
1.528s clients/iris/tests/test_client.py::TestClient::test_resp
1.499s clients/fdsn/tests/test_client.py::TestClient::test_get_waveform_attach_response
1.389s clients/neic/tests/test_client.py::TestClient::test_get_waveform_nscl

Warnings (7)

Stage Filename Category Message
runtest C:\Miniconda3\envs\test\Lib\site-packages\obspy\clients\fdsn\routing\routing_client.py:99 UserWarning Failed to download data of type 'waveform' from 'https://eida-sc3.infp.ro' due to: Traceback (most recent call last): File "C:\Miniconda3\envs\test\Lib\site-packages\obspy\clients\fdsn\routing\routing_client.py", line 96, in _try_download_bulk return _download_bulk(r) ^^^^^^^^^^^^^^^^^ File "C:\Miniconda3\envs\test\Lib\site-packages\obspy\clients\fdsn\routing\routing_client.py", line 139, in _download_bulk return fct(bulk_str + r["bulk_str"]) ^^^^^^^^^^^^^^^^^^^^^^^^^^^^^ File "C:\Miniconda3\envs\test\Lib\site-packages\obspy\clients\fdsn\client.py", line 1051, in get_waveforms_bulk data_stream = self._download( ^^^^^^^^^^^^^^^ File "C:\Miniconda3\envs\test\Lib\site-packages\obspy\clients\fdsn\client.py", line 1486, in _download raise_on_error(code, data) File "C:\Miniconda3\envs\test\Lib\site-packages\obspy\clients\fdsn\client.py", line 1802, in raise_on_error server_info = data.decode('ASCII', errors='ignore') ^^^^^^^^^^^ AttributeError: '_io.BytesIO' object has no attribute 'decode'
runtest C:\Miniconda3\envs\test\Lib\site-packages\obspy\clients\fdsn\client.py:909 UserWarning Not a gzipped file (b'a\r')
runtest C:\Miniconda3\envs\test\Lib\site-packages\obspy\clients\fdsn\routing\routing_client.py:99 UserWarning Failed to download data of type 'station' from 'https://orfeus-eu.org' due to: Traceback (most recent call last): File "C:\Miniconda3\envs\test\Lib\site-packages\obspy\clients\fdsn\routing\routing_client.py", line 96, in _try_download_bulk return _download_bulk(r) ^^^^^^^^^^^^^^^^^ File "C:\Miniconda3\envs\test\Lib\site-packages\obspy\clients\fdsn\routing\routing_client.py", line 139, in _download_bulk return fct(bulk_str + r["bulk_str"]) ^^^^^^^^^^^^^^^^^^^^^^^^^^^^^ File "C:\Miniconda3\envs\test\Lib\site-packages\obspy\clients\fdsn\client.py", line 1249, in get_stations_bulk data_stream = self._download( ^^^^^^^^^^^^^^^ File "C:\Miniconda3\envs\test\Lib\site-packages\obspy\clients\fdsn\client.py", line 1486, in _download raise_on_error(code, data) File "C:\Miniconda3\envs\test\Lib\site-packages\obspy\clients\fdsn\client.py", line 1802, in raise_on_error server_info = data.decode('ASCII', errors='ignore') ^^^^^^^^^^^ AttributeError: '_io.BytesIO' object has no attribute 'decode'
runtest C:\Miniconda3\envs\test\Lib\site-packages\obspy\core\stream.py:3216 UserWarning No matching response information found.
runtest C:\Miniconda3\envs\test\Lib\site-packages\obspy\clients\fdsn\routing\routing_client.py:99 UserWarning Failed to download data of type 'waveform' from 'https://webservices.ingv.it' due to: Traceback (most recent call last): File "C:\Miniconda3\envs\test\Lib\site-packages\obspy\clients\fdsn\routing\routing_client.py", line 96, in _try_download_bulk return _download_bulk(r) ^^^^^^^^^^^^^^^^^ File "C:\Miniconda3\envs\test\Lib\site-packages\obspy\clients\fdsn\routing\routing_client.py", line 139, in _download_bulk return fct(bulk_str + r["bulk_str"]) ^^^^^^^^^^^^^^^^^^^^^^^^^^^^^ File "C:\Miniconda3\envs\test\Lib\site-packages\obspy\clients\fdsn\client.py", line 1051, in get_waveforms_bulk data_stream = self._download( ^^^^^^^^^^^^^^^ File "C:\Miniconda3\envs\test\Lib\site-packages\obspy\clients\fdsn\client.py", line 1486, in _download raise_on_error(code, data) File "C:\Miniconda3\envs\test\Lib\site-packages\obspy\clients\fdsn\client.py", line 1802, in raise_on_error server_info = data.decode('ASCII', errors='ignore') ^^^^^^^^^^^ AttributeError: '_io.BytesIO' object has no attribute 'decode'
runtest C:\Miniconda3\envs\test\Lib\site-packages\obspy\clients\fdsn\routing\routing_client.py:99 UserWarning Failed to download data of type 'station' from 'http://service.iris.edu' due to: Traceback (most recent call last): File "C:\Miniconda3\envs\test\Lib\site-packages\obspy\clients\fdsn\routing\routing_client.py", line 96, in _try_download_bulk return _download_bulk(r) ^^^^^^^^^^^^^^^^^ File "C:\Miniconda3\envs\test\Lib\site-packages\obspy\clients\fdsn\routing\routing_client.py", line 139, in _download_bulk return fct(bulk_str + r["bulk_str"]) ^^^^^^^^^^^^^^^^^^^^^^^^^^^^^ File "C:\Miniconda3\envs\test\Lib\site-packages\obspy\clients\fdsn\client.py", line 1249, in get_stations_bulk data_stream = self._download( ^^^^^^^^^^^^^^^ File "C:\Miniconda3\envs\test\Lib\site-packages\obspy\clients\fdsn\client.py", line 1482, in _download code, data = download_url( ^^^^^^^^^^^^^ File "C:\Miniconda3\envs\test\Lib\site-packages\obspy\clients\fdsn\client.py", line 1920, in download_url data = io.BytesIO(f.read()) ^^^^^^^^ File "C:\Miniconda3\envs\test\Lib\gzip.py", line 301, in read return self._buffer.read(size) ^^^^^^^^^^^^^^^^^^^^^^^ File "C:\Miniconda3\envs\test\Lib\_compression.py", line 118, in readall while data := self.read(sys.maxsize): ^^^^^^^^^^^^^^^^^^^^^^ File "C:\Miniconda3\envs\test\Lib\gzip.py", line 499, in read if not self._read_gzip_header(): ^^^^^^^^^^^^^^^^^^^^^^^^ File "C:\Miniconda3\envs\test\Lib\gzip.py", line 468, in _read_gzip_header last_mtime = _read_gzip_header(self._fp) ^^^^^^^^^^^^^^^^^^^^^^^^^^^ File "C:\Miniconda3\envs\test\Lib\gzip.py", line 428, in _read_gzip_header raise BadGzipFile('Not a gzipped file (%r)' % magic) gzip.BadGzipFile: Not a gzipped file (b'a\r')
runtest C:\Miniconda3\envs\test\Lib\site-packages\_pytest\threadexception.py:77 PytestUnhandledThreadExceptionWarning Exception in thread Thread-103 Traceback (most recent call last): File "C:\Miniconda3\envs\test\Lib\threading.py", line 1045, in _bootstrap_inner self.run() File "C:\Miniconda3\envs\test\Lib\site-packages\obspy\clients\fdsn\client.py", line 1543, in run code, data = download_url( ^^^^^^^^^^ ValueError: not enough values to unpack (expected 2, got 0)