#140622 Report by node gh-actions covering 202 tests from 61 modules resulted into 43 errors

Report

ObsPy version
1.4.1.post0+285.ge515aa8c61
GitHub Pull Request
https://github.com/obspy/obspy/pull/3461
Report file
JSON document
Total runtime
255.6 sec
Report date/time
June 5, 2024, 5:09 a.m.

System / Python

Architecture
64bit
Machine
arm64
Node
gh-actions
Processor
arm
Python Compiler
Clang 16.0.6
Python Implementation
CPython
Python Version
3.12.3
Release
23.5.0
System
Darwin
Version
Darwin Kernel Version 23.5.0: Wed May 1 20:12:39 PDT 2024; root:xnu-10063.121.3~5/RELEASE_ARM64_VMAPPLE

Dependencies

cartopy
0.23.0
decorator
5.1.1
flake8
---
geographiclib
2.0
lxml
5.2.2
matplotlib
3.8.4
numpy
1.26.4
obspy
1.4.1.post0+285.ge515aa8c61
pyproj
3.6.1
pytest
8.2.2
pytest-json-report
1.5.0
requests
2.32.3
scipy
1.13.1
setuptools
70.0.0
shapefile
---
sqlalchemy
1.4.49

Modules (61)

Module Errors / Failures Tracebacks
obspy.clients.earthworm 1 1
obspy.clients.fdsn 34 2 3 4 5 6 7 8 9 10 11 12 13 14 15 16 17 18 19 20 21 22 23 24 25 26 27 28 29 30 31 32 33 34 35
obspy.clients.filesystem Not tested -
obspy.clients.iris 8 36 37 38 39 40 41 42 43
obspy.clients.neic - -
obspy.clients.nrl - -
obspy.clients.seedlink - -
obspy.clients.syngine - -
obspy.core - -
obspy.core.event Not tested -
obspy.core.inventory Not tested -
obspy.core.util Not tested -
obspy.geodetics Not tested -
obspy.imaging Not tested -
obspy.io.ah Not tested -
obspy.io.alsep Not tested -
obspy.io.arclink Not tested -
obspy.io.ascii Not tested -
obspy.io.cmtsolution Not tested -
obspy.io.cnv Not tested -
obspy.io.css Not tested -
obspy.io.csv Not tested -
obspy.io.cybershake Not tested -
obspy.io.dmx Not tested -
obspy.io.focmec Not tested -
obspy.io.gcf Not tested -
obspy.io.gse2 Not tested -
obspy.io.hypodd Not tested -
obspy.io.iaspei Not tested -
obspy.io.json Not tested -
obspy.io.kinemetrics Not tested -
obspy.io.kml Not tested -
obspy.io.mseed Not tested -
obspy.io.ndk Not tested -
obspy.io.nied Not tested -
obspy.io.nlloc Not tested -
obspy.io.nordic Not tested -
obspy.io.pdas Not tested -
obspy.io.pde Not tested -
obspy.io.quakeml Not tested -
obspy.io.reftek Not tested -
obspy.io.rg16 Not tested -
obspy.io.sac Not tested -
obspy.io.scardec Not tested -
obspy.io.seg2 Not tested -
obspy.io.segy Not tested -
obspy.io.seisan Not tested -
obspy.io.seiscomp Not tested -
obspy.io.sh Not tested -
obspy.io.shapefile Not tested -
obspy.io.stationtxt Not tested -
obspy.io.stationxml Not tested -
obspy.io.wav Not tested -
obspy.io.win Not tested -
obspy.io.xseed Not tested -
obspy.io.y Not tested -
obspy.io.zmap Not tested -
obspy.realtime Not tested -
obspy.scripts Not tested -
obspy.signal Not tested -
obspy.taup Not tested -
Summary 43 43

Tracebacks (43)

Traceback (most recent call last):
File "/Users/runner/miniconda3/envs/test/lib/python3.12/site-packages/_pytest/runner.py", line 341, in from_call
result: Optional[TResult] = func()
^^^^^^
File "/Users/runner/miniconda3/envs/test/lib/python3.12/site-packages/_pytest/runner.py", line 241, in <lambda>
lambda: runtest_hook(item=item, **kwds), when=when, reraise=reraise
^^^^^^^^^^^^^^^^^^^^^^^^^^^^^^^
File "/Users/runner/miniconda3/envs/test/lib/python3.12/site-packages/pluggy/_hooks.py", line 513, in __call__
return self._hookexec(self.name, self._hookimpls.copy(), kwargs, firstresult)
^^^^^^^^^^^^^^^^^^^^^^^^^^^^^^^^^^^^^^^^^^^^^^^^^^^^^^^^^^^^^^^^^^^^^^
File "/Users/runner/miniconda3/envs/test/lib/python3.12/site-packages/pluggy/_manager.py", line 120, in _hookexec
return self._inner_hookexec(hook_name, methods, kwargs, firstresult)
^^^^^^^^^^^^^^^^^^^^^^^^^^^^^^^^^^^^^^^^^^^^^^^^^^^^^^^^^^^^^
File "/Users/runner/miniconda3/envs/test/lib/python3.12/site-packages/pluggy/_callers.py", line 182, in _multicall
return outcome.get_result()
^^^^^^^^^^^^^^^^^^^^
File "/Users/runner/miniconda3/envs/test/lib/python3.12/site-packages/pluggy/_result.py", line 100, in get_result
raise exc.with_traceback(exc.__traceback__)
File "/Users/runner/miniconda3/envs/test/lib/python3.12/site-packages/pluggy/_callers.py", line 167, in _multicall
teardown.throw(outcome._exception)
File "/Users/runner/miniconda3/envs/test/lib/python3.12/site-packages/_pytest/threadexception.py", line 87, in pytest_runtest_call
yield from thread_exception_runtest_hook()
File "/Users/runner/miniconda3/envs/test/lib/python3.12/site-packages/_pytest/threadexception.py", line 63, in thread_exception_runtest_hook
yield
File "/Users/runner/miniconda3/envs/test/lib/python3.12/site-packages/pluggy/_callers.py", line 167, in _multicall
teardown.throw(outcome._exception)
File "/Users/runner/miniconda3/envs/test/lib/python3.12/site-packages/_pytest/unraisableexception.py", line 90, in pytest_runtest_call
yield from unraisable_exception_runtest_hook()
File "/Users/runner/miniconda3/envs/test/lib/python3.12/site-packages/_pytest/unraisableexception.py", line 65, in unraisable_exception_runtest_hook
yield
File "/Users/runner/miniconda3/envs/test/lib/python3.12/site-packages/pluggy/_callers.py", line 167, in _multicall
teardown.throw(outcome._exception)
File "/Users/runner/miniconda3/envs/test/lib/python3.12/site-packages/_pytest/logging.py", line 850, in pytest_runtest_call
yield from self._runtest_for(item, "call")
File "/Users/runner/miniconda3/envs/test/lib/python3.12/site-packages/_pytest/logging.py", line 833, in _runtest_for
yield
File "/Users/runner/miniconda3/envs/test/lib/python3.12/site-packages/pluggy/_callers.py", line 167, in _multicall
teardown.throw(outcome._exception)
File "/Users/runner/miniconda3/envs/test/lib/python3.12/site-packages/_pytest/capture.py", line 878, in pytest_runtest_call
return (yield)
^^^^^
File "/Users/runner/miniconda3/envs/test/lib/python3.12/site-packages/pluggy/_callers.py", line 167, in _multicall
teardown.throw(outcome._exception)
File "/Users/runner/miniconda3/envs/test/lib/python3.12/site-packages/_pytest/skipping.py", line 257, in pytest_runtest_call
return (yield)
^^^^^
File "/Users/runner/miniconda3/envs/test/lib/python3.12/site-packages/pluggy/_callers.py", line 103, in _multicall
res = hook_impl.function(*args)
^^^^^^^^^^^^^^^^^^^^^^^^^
File "/Users/runner/miniconda3/envs/test/lib/python3.12/site-packages/_pytest/runner.py", line 183, in pytest_runtest_call
raise e
File "/Users/runner/miniconda3/envs/test/lib/python3.12/site-packages/_pytest/runner.py", line 173, in pytest_runtest_call
item.runtest()
File "/Users/runner/miniconda3/envs/test/lib/python3.12/site-packages/_pytest/python.py", line 1632, in runtest
self.ihook.pytest_pyfunc_call(pyfuncitem=self)
File "/Users/runner/miniconda3/envs/test/lib/python3.12/site-packages/pluggy/_hooks.py", line 513, in __call__
return self._hookexec(self.name, self._hookimpls.copy(), kwargs, firstresult)
^^^^^^^^^^^^^^^^^^^^^^^^^^^^^^^^^^^^^^^^^^^^^^^^^^^^^^^^^^^^^^^^^^^^^^
File "/Users/runner/miniconda3/envs/test/lib/python3.12/site-packages/pluggy/_manager.py", line 120, in _hookexec
return self._inner_hookexec(hook_name, methods, kwargs, firstresult)
^^^^^^^^^^^^^^^^^^^^^^^^^^^^^^^^^^^^^^^^^^^^^^^^^^^^^^^^^^^^^
File "/Users/runner/miniconda3/envs/test/lib/python3.12/site-packages/pluggy/_callers.py", line 139, in _multicall
raise exception.with_traceback(exception.__traceback__)
File "/Users/runner/miniconda3/envs/test/lib/python3.12/site-packages/pluggy/_callers.py", line 103, in _multicall
res = hook_impl.function(*args)
^^^^^^^^^^^^^^^^^^^^^^^^^
File "/Users/runner/miniconda3/envs/test/lib/python3.12/site-packages/_pytest/python.py", line 162, in pytest_pyfunc_call
result = testfunction(**testargs)
^^^^^^^^^^^^^^^^^^^^^^^^
File "/Users/runner/miniconda3/envs/test/lib/python3.12/site-packages/decorator.py", line 232, in fun
return caller(func, *(extras + args), **kw)
^^^^^^^^^^^^^^^^^^^^^^^^^^^^^^^^^^^^
File "/Users/runner/miniconda3/envs/test/lib/python3.12/site-packages/obspy/core/util/decorator.py", line 119, in skip_on_network_error
return func(*args, **kwargs)
^^^^^^^^^^^^^^^^^^^^^
File "/Users/runner/miniconda3/envs/test/lib/python3.12/site-packages/obspy/clients/earthworm/tests/test_client.py", line 111, in test_get_waveform_no_cleanup
assert len(ew_stream) >= 2
AssertionError: assert 1 >= 2
+ where 1 = len(<obspy.core.stream.Stream object at 0x116ba3c50>)
073 channel of station Albuquerque, New Mexico (``"ANMO"``) of the Global
074 Seismograph Network (``"IU"``) for an seismic event around 2010-02-27 06:45
075 (UTC). Results are returned as a :class:`~obspy.core.stream.Stream` object.
076 See the :meth:`~obspy.clients.fdsn.client.Client.get_waveforms_bulk()`
077 method for information on how to send multiple requests simultaneously to
078 avoid unnecessary network overhead.
079
080 >>> from obspy import UTCDateTime
081 >>> t = UTCDateTime("2010-02-27T06:45:00.000")
082 >>> st = client.get_waveforms("IU", "ANMO", "00", "LHZ", t, t + 60 * 60)
UNEXPECTED EXCEPTION: FDSNInternalServerException('Service responds: Internal server error\nHTTP Status code: 500\nDetailed response of server:\n\nError 500: Error calling internal metadata service, code 404 [<!doctype html>\n<html lang="en">\n <head>\n \n <title>\n \n NSF SAGE: \n 404 Page Not Found Error\n \n </title>\n \n <meta name="keywords" content="seismology, seismological data,\n earthquakes, iris dmc" />\n <!-- Forces IE to render in \'latest\' compatible mode -->\n <meta http-equiv="X-UA-Compatible" content="IE=Edge"/>\n <meta charset="utf-8" />\n <meta name="viewport" content="width=device-width, initial-scale=1" />\n \n \n <link rel="stylesheet" media="all" type="text/css" href="/static/css/iris.css" />\n <link rel="stylesheet" media="print" type="text/css" href="/static/css/print.css" />\n \n \n \n <link rel="shortcut icon" href="/static/img/favicon.ico" />\n \n \n <script type="text/javascript" src="//ajax.googleapis.com/ajax/libs/jquery/1.11.1/jquery.js"></script>\n <script type="text/javascript" src="//netdna.bootstrapcdn.com/bootstrap/3.4.1/js/bootstrap.min.js"></script>\n \n <!--\n <script type="text/javascript" src="//ajax.googleapis.com/ajax/libs/jqueryui/1.8.23/jquery-ui.min.js"></script>\n <script type="text/javascript" src="/static/libs/megamenu/megamenu_plugins.js"></script>\n <script type="text/javascript" src="/static/libs/megamenu/megamenu.min.js"></script>\n -->\n \n \n <!-- Global site tag (gtag.js) - Google Analytics -->\n <script async src="https://www.googletagmanager.com/gtag/js?id=UA-1860730-1"></script>\n <script>\n window.dataLayer = window.dataLayer || [];\n function gtag(){dataLayer.push(arguments);}\n gtag(\'js\', new Date());\n gtag(\'config\', \'UA-1860730-1\');\n </script>\n \n \n <link rel="stylesheet" type="text/css" href="/static/libs/qtip2/2.1.1/jquery.qtip.css" />\n <script type="text/javascript" src="/static/libs/qtip2/2.1.1/jquery.qtip.js"></script>\n <script>\n $(function() {\n /* Automatically set up popup help blocks like:\n * <div class="popup-help">\n * <span class="glyphicon glyphicon-question-sign"> </span>\n * <div>\n * Content to show in the popup.\n * </div>\n * </div>\n * Hovering over the icon shows the content in a popup.\n */\n $(".popup-help").each(function() {\n var content = $(this).children(\'div\').detach();\n var popupOnClick = $(this).hasClass(\'popup-on-click\');\n // Attach to the first element\n $(this).children().first().qtip({\n content: { text: content },\n style: { classes: \'qtip-bootstrap\' },\n hide: {\n delay: 100,\n fixed: true\n },\n show: {\n event: popupOnClick ? \'click\' : \'mouseenter\'\n },\n position: {\n viewport: $(window)\n },\n });\n });\n });\n </script>\n \n \n \n \n </head>\n <body>\n \n \n \n <div class="container blur">\n <div id="breadcrumbs">\n \n <ul class="breadcrumbs">\n \n \n <li>\n <a href="/">Web Services</a>\n </li>\n \n \n </ul>\n \n </div>\n \n \n \n \n \n <div id="page-content">\n \n \n \n \n \n \n \n \n <h1>\n \n \n 404 Page Not Found Error\n \n </h1>\n \n \n <div id="content">\n \n <p>We are sorry, but the page you are requesting does not exist.</p>\n <p>Please check the URL path you are requested and try again.</p>\n <p>If you believe the error to be ours, please\n <a href="//www.iris.edu/hq/contact">contact</a>\n us.</p>\n </div>\n \n </div>\n \n \n </div>\n \n \n </body>\n</html>\n]\nMore Details:\nhandler exited, code: 1 reason: Internal Server Error\nRequest:\nhttp://service.iris.edu/fdsnws/dataselect/1/query?starttime=2010-02-27T06%3A45%3A00.000000&endtime=2010-02-27T07%3A45%3A00.000000&network=IU&station=ANMO&location=00&channel=LHZ\nRequest Submitted:\n2024/06/05 10:05:43 UTC\nService version:\nService: fdsnws-dataselect version: 1.1.9')
Traceback (most recent call last):
File "/Users/runner/miniconda3/envs/test/lib/python3.12/doctest.py", line 1361, in __run
exec(compile(example.source, filename, "single",
File "<doctest obspy.clients.fdsn[6]>", line 1, in <module>
File "/Users/runner/miniconda3/envs/test/lib/python3.12/site-packages/obspy/clients/fdsn/client.py", line 879, in get_waveforms
data_stream = self._download(url, use_gzip=False)
^^^^^^^^^^^^^^^^^^^^^^^^^^^^^^^^^^^
File "/Users/runner/miniconda3/envs/test/lib/python3.12/site-packages/obspy/clients/fdsn/client.py", line 1493, in _download
raise_on_error(code, data)
File "/Users/runner/miniconda3/envs/test/lib/python3.12/site-packages/obspy/clients/fdsn/client.py", line 1868, in raise_on_error
raise FDSNInternalServerException("Service responds: Internal server "
obspy.clients.fdsn.header.FDSNInternalServerException: Service responds: Internal server error
HTTP Status code: 500
Detailed response of server:
Error 500: Error calling internal metadata service, code 404 [<!doctype html>
<html lang="en">
<head>
<title>
NSF SAGE:
404 Page Not Found Error
</title>
<meta name="keywords" content="seismology, seismological data,
earthquakes, iris dmc" />
<!-- Forces IE to render in 'latest' compatible mode -->
<meta http-equiv="X-UA-Compatible" content="IE=Edge"/>
<meta charset="utf-8" />
<meta name="viewport" content="width=device-width, initial-scale=1" />
<link rel="stylesheet" media="all" type="text/css" href="/static/css/iris.css" />
<link rel="stylesheet" media="print" type="text/css" href="/static/css/print.css" />
<link rel="shortcut icon" href="/static/img/favicon.ico" />
<script type="text/javascript" src="//ajax.googleapis.com/ajax/libs/jquery/1.11.1/jquery.js"></script>
<script type="text/javascript" src="//netdna.bootstrapcdn.com/bootstrap/3.4.1/js/bootstrap.min.js"></script>
<!--
<script type="text/javascript" src="//ajax.googleapis.com/ajax/libs/jqueryui/1.8.23/jquery-ui.min.js"></script>
<script type="text/javascript" src="/static/libs/megamenu/megamenu_plugins.js"></script>
<script type="text/javascript" src="/static/libs/megamenu/megamenu.min.js"></script>
-->
<!-- Global site tag (gtag.js) - Google Analytics -->
<script async src="https://www.googletagmanager.com/gtag/js?id=UA-1860730-1"></script>
<script>
window.dataLayer = window.dataLayer || [];
function gtag(){dataLayer.push(arguments);}
gtag('js', new Date());
gtag('config', 'UA-1860730-1');
</script>
<link rel="stylesheet" type="text/css" href="/static/libs/qtip2/2.1.1/jquery.qtip.css" />
<script type="text/javascript" src="/static/libs/qtip2/2.1.1/jquery.qtip.js"></script>
<script>
$(function() {
/* Automatically set up popup help blocks like:
* <div class="popup-help">
* <span class="glyphicon glyphicon-question-sign"> </span>
* <div>
* Content to show in the popup.
* </div>
* </div>
* Hovering over the icon shows the content in a popup.
*/
$(".popup-help").each(function() {
var content = $(this).children('div').detach();
var popupOnClick = $(this).hasClass('popup-on-click');
// Attach to the first element
$(this).children().first().qtip({
content: { text: content },
style: { classes: 'qtip-bootstrap' },
hide: {
delay: 100,
fixed: true
},
show: {
event: popupOnClick ? 'click' : 'mouseenter'
},
position: {
viewport: $(window)
},
});
});
});
</script>
</head>
<body>
<div class="container blur">
<div id="breadcrumbs">
<ul class="breadcrumbs">
<li>
<a href="/">Web Services</a>
</li>
</ul>
</div>
<div id="page-content">
<h1>
404 Page Not Found Error
</h1>
<div id="content">
<p>We are sorry, but the page you are requesting does not exist.</p>
<p>Please check the URL path you are requested and try again.</p>
<p>If you believe the error to be ours, please
<a href="//www.iris.edu/hq/contact">contact</a>
us.</p>
</div>
</div>
</div>
</body>
</html>
]
More Details:
handler exited, code: 1 reason: Internal Server Error
Request:
http://service.iris.edu/fdsnws/dataselect/1/query?starttime=2010-02-27T06%3A45%3A00.000000&endtime=2010-02-27T07%3A45%3A00.000000&network=IU&station=ANMO&location=00&channel=LHZ
Request Submitted:
2024/06/05 10:05:43 UTC
Service version:
Service: fdsnws-dataselect version: 1.1.9
/Users/runner/miniconda3/envs/test/lib/python3.12/site-packages/obspy/clients/fdsn/__init__.py:82: UnexpectedException
154
155 Initializes an FDSN Web Service client.
156
157 >>> client = Client("EARTHSCOPE")
158 >>> print(client) # doctest: +ELLIPSIS +NORMALIZE_WHITESPACE
Differences (unified diff with -expected +actual):
@@ -1,6 +1,5 @@
FDSN Webservice Client (base url: http://service.iris.edu)
-Available Services: 'dataselect' (v...), 'event' (v...),
-'station' (v...), 'available_event_catalogs',
-'available_event_contributors'
+Available Services: 'dataselect' (v1.1.9), 'event' (v1.1.13), 'available_event_catalogs', 'available_event_contributors'
+<BLANKLINE>
Use e.g. client.help('dataselect') for the
parameter description of the individual services
/Users/runner/miniconda3/envs/test/lib/python3.12/site-packages/obspy/clients/fdsn/client.py:158: DocTestFailure
576
577 Query the station service of the FDSN client.
578
579 >>> client = Client("EARTHSCOPE")
580 >>> starttime = UTCDateTime("2001-01-01")
581 >>> endtime = UTCDateTime("2001-01-02")
582 >>> inventory = client.get_stations(network="IU", station="A*",
UNEXPECTED EXCEPTION: ValueError('The current client does not have a station service.')
Traceback (most recent call last):
File "/Users/runner/miniconda3/envs/test/lib/python3.12/doctest.py", line 1361, in __run
exec(compile(example.source, filename, "single",
File "<doctest obspy.clients.fdsn.client.Client.get_stations[3]>", line 1, in <module>
File "/Users/runner/miniconda3/envs/test/lib/python3.12/site-packages/obspy/clients/fdsn/client.py", line 747, in get_stations
raise ValueError(msg)
ValueError: The current client does not have a station service.
/Users/runner/miniconda3/envs/test/lib/python3.12/site-packages/obspy/clients/fdsn/client.py:582: UnexpectedException
1100 - an open file handle (or file-like object) with the request
1101
1102 >>> client = Client("EARTHSCOPE")
1103 >>> t1 = UTCDateTime("2010-02-27T06:30:00.000")
1104 >>> t2 = t1 + 1
1105 >>> t3 = t1 + 3
1106 >>> bulk = [("IU", "ANMO", "*", "BHZ", t1, t2),
1107 ... ("IU", "AFI", "1?", "BHE", t1, t3),
1108 ... ("GR", "GRA1", "*", "BH*", t2, t3)]
1109 >>> inv = client.get_stations_bulk(bulk)
UNEXPECTED EXCEPTION: ValueError('The current client does not have a station service.')
Traceback (most recent call last):
File "/Users/runner/miniconda3/envs/test/lib/python3.12/doctest.py", line 1361, in __run
exec(compile(example.source, filename, "single",
File "<doctest obspy.clients.fdsn.client.Client.get_stations_bulk[5]>", line 1, in <module>
File "/Users/runner/miniconda3/envs/test/lib/python3.12/site-packages/obspy/clients/fdsn/client.py", line 1234, in get_stations_bulk
raise ValueError(msg)
ValueError: The current client does not have a station service.
/Users/runner/miniconda3/envs/test/lib/python3.12/site-packages/obspy/clients/fdsn/client.py:1109: UnexpectedException
775
776 Query the dataselect service of the client.
777
778 >>> client = Client("EARTHSCOPE")
779 >>> t1 = UTCDateTime("2010-02-27T06:30:00.000")
780 >>> t2 = t1 + 5
781 >>> st = client.get_waveforms("IU", "ANMO", "00", "LHZ", t1, t2)
UNEXPECTED EXCEPTION: FDSNInternalServerException('Service responds: Internal server error\nHTTP Status code: 500\nDetailed response of server:\n\nError 500: Error calling internal metadata service, code 404 [<!doctype html>\n<html lang="en">\n <head>\n \n <title>\n \n NSF SAGE: \n 404 Page Not Found Error\n \n </title>\n \n <meta name="keywords" content="seismology, seismological data,\n earthquakes, iris dmc" />\n <!-- Forces IE to render in \'latest\' compatible mode -->\n <meta http-equiv="X-UA-Compatible" content="IE=Edge"/>\n <meta charset="utf-8" />\n <meta name="viewport" content="width=device-width, initial-scale=1" />\n \n \n <link rel="stylesheet" media="all" type="text/css" href="/static/css/iris.css" />\n <link rel="stylesheet" media="print" type="text/css" href="/static/css/print.css" />\n \n \n \n <link rel="shortcut icon" href="/static/img/favicon.ico" />\n \n \n <script type="text/javascript" src="//ajax.googleapis.com/ajax/libs/jquery/1.11.1/jquery.js"></script>\n <script type="text/javascript" src="//netdna.bootstrapcdn.com/bootstrap/3.4.1/js/bootstrap.min.js"></script>\n \n <!--\n <script type="text/javascript" src="//ajax.googleapis.com/ajax/libs/jqueryui/1.8.23/jquery-ui.min.js"></script>\n <script type="text/javascript" src="/static/libs/megamenu/megamenu_plugins.js"></script>\n <script type="text/javascript" src="/static/libs/megamenu/megamenu.min.js"></script>\n -->\n \n \n <!-- Global site tag (gtag.js) - Google Analytics -->\n <script async src="https://www.googletagmanager.com/gtag/js?id=UA-1860730-1"></script>\n <script>\n window.dataLayer = window.dataLayer || [];\n function gtag(){dataLayer.push(arguments);}\n gtag(\'js\', new Date());\n gtag(\'config\', \'UA-1860730-1\');\n </script>\n \n \n <link rel="stylesheet" type="text/css" href="/static/libs/qtip2/2.1.1/jquery.qtip.css" />\n <script type="text/javascript" src="/static/libs/qtip2/2.1.1/jquery.qtip.js"></script>\n <script>\n $(function() {\n /* Automatically set up popup help blocks like:\n * <div class="popup-help">\n * <span class="glyphicon glyphicon-question-sign"> </span>\n * <div>\n * Content to show in the popup.\n * </div>\n * </div>\n * Hovering over the icon shows the content in a popup.\n */\n $(".popup-help").each(function() {\n var content = $(this).children(\'div\').detach();\n var popupOnClick = $(this).hasClass(\'popup-on-click\');\n // Attach to the first element\n $(this).children().first().qtip({\n content: { text: content },\n style: { classes: \'qtip-bootstrap\' },\n hide: {\n delay: 100,\n fixed: true\n },\n show: {\n event: popupOnClick ? \'click\' : \'mouseenter\'\n },\n position: {\n viewport: $(window)\n },\n });\n });\n });\n </script>\n \n \n \n \n </head>\n <body>\n \n \n \n <div class="container blur">\n <div id="breadcrumbs">\n \n <ul class="breadcrumbs">\n \n \n <li>\n <a href="/">Web Services</a>\n </li>\n \n \n </ul>\n \n </div>\n \n \n \n \n \n <div id="page-content">\n \n \n \n \n \n \n \n \n <h1>\n \n \n 404 Page Not Found Error\n \n </h1>\n \n \n <div id="content">\n \n <p>We are sorry, but the page you are requesting does not exist.</p>\n <p>Please check the URL path you are requested and try again.</p>\n <p>If you believe the error to be ours, please\n <a href="//www.iris.edu/hq/contact">contact</a>\n us.</p>\n </div>\n \n </div>\n \n \n </div>\n \n \n </body>\n</html>\n]\nMore Details:\nhandler exited, code: 1 reason: Internal Server Error\nRequest:\nhttp://service.iris.edu/fdsnws/dataselect/1/query?starttime=2010-02-27T06%3A30%3A00.000000&endtime=2010-02-27T06%3A30%3A05.000000&network=IU&station=ANMO&location=00&channel=LHZ\nRequest Submitted:\n2024/06/05 10:05:48 UTC\nService version:\nService: fdsnws-dataselect version: 1.1.9')
Traceback (most recent call last):
File "/Users/runner/miniconda3/envs/test/lib/python3.12/doctest.py", line 1361, in __run
exec(compile(example.source, filename, "single",
File "<doctest obspy.clients.fdsn.client.Client.get_waveforms[3]>", line 1, in <module>
File "/Users/runner/miniconda3/envs/test/lib/python3.12/site-packages/obspy/clients/fdsn/client.py", line 879, in get_waveforms
data_stream = self._download(url, use_gzip=False)
^^^^^^^^^^^^^^^^^^^^^^^^^^^^^^^^^^^
File "/Users/runner/miniconda3/envs/test/lib/python3.12/site-packages/obspy/clients/fdsn/client.py", line 1493, in _download
raise_on_error(code, data)
File "/Users/runner/miniconda3/envs/test/lib/python3.12/site-packages/obspy/clients/fdsn/client.py", line 1868, in raise_on_error
raise FDSNInternalServerException("Service responds: Internal server "
obspy.clients.fdsn.header.FDSNInternalServerException: Service responds: Internal server error
HTTP Status code: 500
Detailed response of server:
Error 500: Error calling internal metadata service, code 404 [<!doctype html>
<html lang="en">
<head>
<title>
NSF SAGE:
404 Page Not Found Error
</title>
<meta name="keywords" content="seismology, seismological data,
earthquakes, iris dmc" />
<!-- Forces IE to render in 'latest' compatible mode -->
<meta http-equiv="X-UA-Compatible" content="IE=Edge"/>
<meta charset="utf-8" />
<meta name="viewport" content="width=device-width, initial-scale=1" />
<link rel="stylesheet" media="all" type="text/css" href="/static/css/iris.css" />
<link rel="stylesheet" media="print" type="text/css" href="/static/css/print.css" />
<link rel="shortcut icon" href="/static/img/favicon.ico" />
<script type="text/javascript" src="//ajax.googleapis.com/ajax/libs/jquery/1.11.1/jquery.js"></script>
<script type="text/javascript" src="//netdna.bootstrapcdn.com/bootstrap/3.4.1/js/bootstrap.min.js"></script>
<!--
<script type="text/javascript" src="//ajax.googleapis.com/ajax/libs/jqueryui/1.8.23/jquery-ui.min.js"></script>
<script type="text/javascript" src="/static/libs/megamenu/megamenu_plugins.js"></script>
<script type="text/javascript" src="/static/libs/megamenu/megamenu.min.js"></script>
-->
<!-- Global site tag (gtag.js) - Google Analytics -->
<script async src="https://www.googletagmanager.com/gtag/js?id=UA-1860730-1"></script>
<script>
window.dataLayer = window.dataLayer || [];
function gtag(){dataLayer.push(arguments);}
gtag('js', new Date());
gtag('config', 'UA-1860730-1');
</script>
<link rel="stylesheet" type="text/css" href="/static/libs/qtip2/2.1.1/jquery.qtip.css" />
<script type="text/javascript" src="/static/libs/qtip2/2.1.1/jquery.qtip.js"></script>
<script>
$(function() {
/* Automatically set up popup help blocks like:
* <div class="popup-help">
* <span class="glyphicon glyphicon-question-sign"> </span>
* <div>
* Content to show in the popup.
* </div>
* </div>
* Hovering over the icon shows the content in a popup.
*/
$(".popup-help").each(function() {
var content = $(this).children('div').detach();
var popupOnClick = $(this).hasClass('popup-on-click');
// Attach to the first element
$(this).children().first().qtip({
content: { text: content },
style: { classes: 'qtip-bootstrap' },
hide: {
delay: 100,
fixed: true
},
show: {
event: popupOnClick ? 'click' : 'mouseenter'
},
position: {
viewport: $(window)
},
});
});
});
</script>
</head>
<body>
<div class="container blur">
<div id="breadcrumbs">
<ul class="breadcrumbs">
<li>
<a href="/">Web Services</a>
</li>
</ul>
</div>
<div id="page-content">
<h1>
404 Page Not Found Error
</h1>
<div id="content">
<p>We are sorry, but the page you are requesting does not exist.</p>
<p>Please check the URL path you are requested and try again.</p>
<p>If you believe the error to be ours, please
<a href="//www.iris.edu/hq/contact">contact</a>
us.</p>
</div>
</div>
</div>
</body>
</html>
]
More Details:
handler exited, code: 1 reason: Internal Server Error
Request:
http://service.iris.edu/fdsnws/dataselect/1/query?starttime=2010-02-27T06%3A30%3A00.000000&endtime=2010-02-27T06%3A30%3A05.000000&network=IU&station=ANMO&location=00&channel=LHZ
Request Submitted:
2024/06/05 10:05:48 UTC
Service version:
Service: fdsnws-dataselect version: 1.1.9
/Users/runner/miniconda3/envs/test/lib/python3.12/site-packages/obspy/clients/fdsn/client.py:781: UnexpectedException
943 - an open file handle (or file-like object) with the request
944
945 >>> client = Client("EARTHSCOPE")
946 >>> t1 = UTCDateTime("2010-02-27T06:30:00.000")
947 >>> t2 = t1 + 1
948 >>> t3 = t1 + 3
949 >>> bulk = [("IU", "ANMO", "*", "BHZ", t1, t2),
950 ... ("IU", "AFI", "1?", "BHE", t1, t3),
951 ... ("GR", "GRA1", "*", "BH*", t2, t3)]
952 >>> st = client.get_waveforms_bulk(bulk)
UNEXPECTED EXCEPTION: FDSNInternalServerException('Service responds: Internal server error\nHTTP Status code: 500\nDetailed response of server:\n\n\x1f\x08\x00\x00\x00\x00\x00\x00\x00Xmo6\x10_q\x15\n."Nsm\x17Av\x01hVl@Q\nt-$ehwdY.\x186#(\n)s\t\x18.l3I"\x08DQf<\x145\x0fP.EG\x10!\x04Ly\x05BdL\n\x12ES\x173w\x00Lbi\x00\x07h\x13_M}z\nWg.Ʀh#\x0fyNw \x1ahxS\x06\u05eb\\%ɧLO]ByG#hڂ<\x07\x11\x01 :-\n#\x10R(\x08\x05f=zyd\nP\x05\n$f!J\nz\tרtt\x05b .ϛ5vZ\x17\nޖb9u>ypˋE\x18˶\x13K4VrcNץUK݂YP\x10y\nʄ\x16<\x14Q\nT-\x14\x077[Bu*F$\x14C.\nf駮;\x02E\n\x12\x17S)M\x04\x19|;F:\x11\x14v\n5qh .H#K3ӣaaK\n(tۜkU\nJ\x06\x045<\x12q6Om\x1fK\\\x12嚍\x11_rg\x13V\n(C\nfܟVZ"\x083`\x13DmTd{*(\x7fe)ϗ+AY/UbD\x01M")#\x05\x01=\x19wI>F<~DO;\x00\x1at\x19e5)S5BYP\x19dr\x1a3Zj\t\'\x19?i6E81zb7zM.\\,WIkrtwU=aQf\x16y\x06F_\x7f\x11R}.\x18j꾞a\x05{תw\x04\x19\n%`jgBD$kޫvb.n%\x1f\x06Z\x14om8\x16"F\n\x02}06+\U00034fe1?oMbyj4P*]S\nP\x16P\x05=cL\n\'yp \x1178g0\t\x12+E\tӈ{Fܝe\x19\x056bQ.biy2fyJDT*Ќ.\nt*.Q]§cl;\x00KDi\nm\x06ZϺ\x19=|_\nkObd#\x0f\x03,l4UB\n \x16IH#+{\x03?}H\x18M<ofZ5e\x08nZc\n^e\x07\x1b\x18\x0e\x00cp\na8\x10Ri\x04j\tY5(Mƛ1|\x03\x13ƽ\n9\x0eTc\x194\x1aXfN\x1f@\t_a4\nuF\x16\x0e1hYH\x10Z}X\\Z\'v\x18~\nG cӼT|\x11zSVuװ9&*\n\x0e\n\x06o-ݶ}\x7f0wm\x0e˔wVMs1cZڬ\n\x17\x19myRfo[\x11\x00\\\x12b tٮV*\n!\nٽ\x0fyg.T9\\U\x015a+<a]C\'L:יÞӁ~vo(*tz\x0epg]=\nq\x03{Ĭ\x03&h\nq\x1fbPh>VAc7doy~IAa\x03\\"\\JwTn1~vLbU\x169]2r\n\x15\n#@\x15Մ\x18)/\x18ϟ\x13(\x18\x02\':\\\x03h30.\x17VxlcQ~)\x1f\x11RҵD=K\n%oݩ\x01y^7\nQJAa0&c8]\x11es\n\x7f_s\n2\x13\x13/\t\x16X.ǁ$ls\x12CSE,\x01i\x0e\x7f\x04|,B\x143FE,la\nW<\x15Ԏ\t\x1b`S!t\x04\x7f?w:\x00V&o:P)\n\x11\x02:?;߫4\x10\x00\x00')
Traceback (most recent call last):
File "/Users/runner/miniconda3/envs/test/lib/python3.12/doctest.py", line 1361, in __run
exec(compile(example.source, filename, "single",
File "<doctest obspy.clients.fdsn.client.Client.get_waveforms_bulk[5]>", line 1, in <module>
File "/Users/runner/miniconda3/envs/test/lib/python3.12/site-packages/obspy/clients/fdsn/client.py", line 1058, in get_waveforms_bulk
data_stream = self._download(
^^^^^^^^^^^^^^^
File "/Users/runner/miniconda3/envs/test/lib/python3.12/site-packages/obspy/clients/fdsn/client.py", line 1493, in _download
raise_on_error(code, data)
File "/Users/runner/miniconda3/envs/test/lib/python3.12/site-packages/obspy/clients/fdsn/client.py", line 1868, in raise_on_error
raise FDSNInternalServerException("Service responds: Internal server "
obspy.clients.fdsn.header.FDSNInternalServerException: Service responds: Internal server error
HTTP Status code: 500
Detailed response of server:
 Xmo6_q
."NsmAvhVl@Q
t-$ehwdY.6#(
)s	.l3I"DQf<5P.EG!LyBdL
ES3w Lbi h_M}z
Wg.Ʀh#yNw hxS׫\%ɧLO]ByG#hڂ< :-
#R(f=zyd
P
$f!J
z	רttb .ϛ5vZ
ޖb9u>ypˋE˶K4VrcNץUK݂YPy
ʄ<Q
T-7[Bu*F$C.
f駮;E
S)M|;F:v
5qh .H#K3ӣaaK
(tۜkU
J5<q6OmK\嚍_rgV
(C
fܟVZ"3`DmTd{*(e)ϗ+AY/UbDM")#=wI>F<~DO; te5)S5BYPdr3Zj	'?i6E81zb7zM.\,WIkrtwU=aQfyF_R}.j꾞a{תw
%`jgBD$kޫvb.n%Zom8"F
}06+𴿡?oMbyj4P*]S
PP=cL
'yp 78g0	+E	ӈ{Fܝe6bQ.biy2fyJDT*Ќ.
t*.Q]§cl; KDi
mZϺ=|_
kObd#,l4UB
IH#+{?}HM<ofZ5enZc
^e cp
a8Rij	Y5(Mƛ1|ƽ
9Tc4XfN@	_a4
uF1hYHZ}X\Z'v~
G cӼT|zSVuװ9&*

o-ݶ}0wm˔wVMs1cZڬ
myRfo[ \b tٮV*
!
ٽyg.T9\U5a+<a]C'L:יÞӁ~vo(*tzpg]=
q{Ĭ&h
qbPh>VAc7doy~IAa\"\JwTn1~vLbU9]2r

#@Մ)/ϟ(':\h30.VxlcQ~)RҵD=K
%oݩy^7
QJAa0&c8]es
_s
2/	X.ǁ$lsCSE,i|,B3FE,la
W<Ԏ	`S!t?w: V&o:P)
:?;߫4
/Users/runner/miniconda3/envs/test/lib/python3.12/site-packages/obspy/clients/fdsn/client.py:952: UnexpectedException
Traceback (most recent call last):
File "/Users/runner/miniconda3/envs/test/lib/python3.12/site-packages/_pytest/runner.py", line 341, in from_call
result: Optional[TResult] = func()
^^^^^^
File "/Users/runner/miniconda3/envs/test/lib/python3.12/site-packages/_pytest/runner.py", line 241, in <lambda>
lambda: runtest_hook(item=item, **kwds), when=when, reraise=reraise
^^^^^^^^^^^^^^^^^^^^^^^^^^^^^^^
File "/Users/runner/miniconda3/envs/test/lib/python3.12/site-packages/pluggy/_hooks.py", line 513, in __call__
return self._hookexec(self.name, self._hookimpls.copy(), kwargs, firstresult)
^^^^^^^^^^^^^^^^^^^^^^^^^^^^^^^^^^^^^^^^^^^^^^^^^^^^^^^^^^^^^^^^^^^^^^
File "/Users/runner/miniconda3/envs/test/lib/python3.12/site-packages/pluggy/_manager.py", line 120, in _hookexec
return self._inner_hookexec(hook_name, methods, kwargs, firstresult)
^^^^^^^^^^^^^^^^^^^^^^^^^^^^^^^^^^^^^^^^^^^^^^^^^^^^^^^^^^^^^
File "/Users/runner/miniconda3/envs/test/lib/python3.12/site-packages/pluggy/_callers.py", line 182, in _multicall
return outcome.get_result()
^^^^^^^^^^^^^^^^^^^^
File "/Users/runner/miniconda3/envs/test/lib/python3.12/site-packages/pluggy/_result.py", line 100, in get_result
raise exc.with_traceback(exc.__traceback__)
File "/Users/runner/miniconda3/envs/test/lib/python3.12/site-packages/pluggy/_callers.py", line 167, in _multicall
teardown.throw(outcome._exception)
File "/Users/runner/miniconda3/envs/test/lib/python3.12/site-packages/_pytest/threadexception.py", line 87, in pytest_runtest_call
yield from thread_exception_runtest_hook()
File "/Users/runner/miniconda3/envs/test/lib/python3.12/site-packages/_pytest/threadexception.py", line 63, in thread_exception_runtest_hook
yield
File "/Users/runner/miniconda3/envs/test/lib/python3.12/site-packages/pluggy/_callers.py", line 167, in _multicall
teardown.throw(outcome._exception)
File "/Users/runner/miniconda3/envs/test/lib/python3.12/site-packages/_pytest/unraisableexception.py", line 90, in pytest_runtest_call
yield from unraisable_exception_runtest_hook()
File "/Users/runner/miniconda3/envs/test/lib/python3.12/site-packages/_pytest/unraisableexception.py", line 65, in unraisable_exception_runtest_hook
yield
File "/Users/runner/miniconda3/envs/test/lib/python3.12/site-packages/pluggy/_callers.py", line 167, in _multicall
teardown.throw(outcome._exception)
File "/Users/runner/miniconda3/envs/test/lib/python3.12/site-packages/_pytest/logging.py", line 850, in pytest_runtest_call
yield from self._runtest_for(item, "call")
File "/Users/runner/miniconda3/envs/test/lib/python3.12/site-packages/_pytest/logging.py", line 833, in _runtest_for
yield
File "/Users/runner/miniconda3/envs/test/lib/python3.12/site-packages/pluggy/_callers.py", line 167, in _multicall
teardown.throw(outcome._exception)
File "/Users/runner/miniconda3/envs/test/lib/python3.12/site-packages/_pytest/capture.py", line 878, in pytest_runtest_call
return (yield)
^^^^^
File "/Users/runner/miniconda3/envs/test/lib/python3.12/site-packages/pluggy/_callers.py", line 167, in _multicall
teardown.throw(outcome._exception)
File "/Users/runner/miniconda3/envs/test/lib/python3.12/site-packages/_pytest/skipping.py", line 257, in pytest_runtest_call
return (yield)
^^^^^
File "/Users/runner/miniconda3/envs/test/lib/python3.12/site-packages/pluggy/_callers.py", line 103, in _multicall
res = hook_impl.function(*args)
^^^^^^^^^^^^^^^^^^^^^^^^^
File "/Users/runner/miniconda3/envs/test/lib/python3.12/site-packages/_pytest/runner.py", line 183, in pytest_runtest_call
raise e
File "/Users/runner/miniconda3/envs/test/lib/python3.12/site-packages/_pytest/runner.py", line 173, in pytest_runtest_call
item.runtest()
File "/Users/runner/miniconda3/envs/test/lib/python3.12/site-packages/_pytest/python.py", line 1632, in runtest
self.ihook.pytest_pyfunc_call(pyfuncitem=self)
File "/Users/runner/miniconda3/envs/test/lib/python3.12/site-packages/pluggy/_hooks.py", line 513, in __call__
return self._hookexec(self.name, self._hookimpls.copy(), kwargs, firstresult)
^^^^^^^^^^^^^^^^^^^^^^^^^^^^^^^^^^^^^^^^^^^^^^^^^^^^^^^^^^^^^^^^^^^^^^
File "/Users/runner/miniconda3/envs/test/lib/python3.12/site-packages/pluggy/_manager.py", line 120, in _hookexec
return self._inner_hookexec(hook_name, methods, kwargs, firstresult)
^^^^^^^^^^^^^^^^^^^^^^^^^^^^^^^^^^^^^^^^^^^^^^^^^^^^^^^^^^^^^
File "/Users/runner/miniconda3/envs/test/lib/python3.12/site-packages/pluggy/_callers.py", line 139, in _multicall
raise exception.with_traceback(exception.__traceback__)
File "/Users/runner/miniconda3/envs/test/lib/python3.12/site-packages/pluggy/_callers.py", line 103, in _multicall
res = hook_impl.function(*args)
^^^^^^^^^^^^^^^^^^^^^^^^^
File "/Users/runner/miniconda3/envs/test/lib/python3.12/site-packages/_pytest/python.py", line 162, in pytest_pyfunc_call
result = testfunction(**testargs)
^^^^^^^^^^^^^^^^^^^^^^^^
File "/Users/runner/miniconda3/envs/test/lib/python3.12/site-packages/obspy/clients/fdsn/tests/test_client.py", line 262, in test_location_parameters
assert "location=--" in \
File "/Users/runner/miniconda3/envs/test/lib/python3.12/site-packages/obspy/clients/fdsn/client.py", line 1284, in _create_url_from_parameters
service_params = self.services[service]
~~~~~~~~~~~~~^^^^^^^^^
KeyError: 'station'
Traceback (most recent call last):
File "/Users/runner/miniconda3/envs/test/lib/python3.12/site-packages/_pytest/runner.py", line 341, in from_call
result: Optional[TResult] = func()
^^^^^^
File "/Users/runner/miniconda3/envs/test/lib/python3.12/site-packages/_pytest/runner.py", line 241, in <lambda>
lambda: runtest_hook(item=item, **kwds), when=when, reraise=reraise
^^^^^^^^^^^^^^^^^^^^^^^^^^^^^^^
File "/Users/runner/miniconda3/envs/test/lib/python3.12/site-packages/pluggy/_hooks.py", line 513, in __call__
return self._hookexec(self.name, self._hookimpls.copy(), kwargs, firstresult)
^^^^^^^^^^^^^^^^^^^^^^^^^^^^^^^^^^^^^^^^^^^^^^^^^^^^^^^^^^^^^^^^^^^^^^
File "/Users/runner/miniconda3/envs/test/lib/python3.12/site-packages/pluggy/_manager.py", line 120, in _hookexec
return self._inner_hookexec(hook_name, methods, kwargs, firstresult)
^^^^^^^^^^^^^^^^^^^^^^^^^^^^^^^^^^^^^^^^^^^^^^^^^^^^^^^^^^^^^
File "/Users/runner/miniconda3/envs/test/lib/python3.12/site-packages/pluggy/_callers.py", line 182, in _multicall
return outcome.get_result()
^^^^^^^^^^^^^^^^^^^^
File "/Users/runner/miniconda3/envs/test/lib/python3.12/site-packages/pluggy/_result.py", line 100, in get_result
raise exc.with_traceback(exc.__traceback__)
File "/Users/runner/miniconda3/envs/test/lib/python3.12/site-packages/pluggy/_callers.py", line 167, in _multicall
teardown.throw(outcome._exception)
File "/Users/runner/miniconda3/envs/test/lib/python3.12/site-packages/_pytest/threadexception.py", line 87, in pytest_runtest_call
yield from thread_exception_runtest_hook()
File "/Users/runner/miniconda3/envs/test/lib/python3.12/site-packages/_pytest/threadexception.py", line 63, in thread_exception_runtest_hook
yield
File "/Users/runner/miniconda3/envs/test/lib/python3.12/site-packages/pluggy/_callers.py", line 167, in _multicall
teardown.throw(outcome._exception)
File "/Users/runner/miniconda3/envs/test/lib/python3.12/site-packages/_pytest/unraisableexception.py", line 90, in pytest_runtest_call
yield from unraisable_exception_runtest_hook()
File "/Users/runner/miniconda3/envs/test/lib/python3.12/site-packages/_pytest/unraisableexception.py", line 65, in unraisable_exception_runtest_hook
yield
File "/Users/runner/miniconda3/envs/test/lib/python3.12/site-packages/pluggy/_callers.py", line 167, in _multicall
teardown.throw(outcome._exception)
File "/Users/runner/miniconda3/envs/test/lib/python3.12/site-packages/_pytest/logging.py", line 850, in pytest_runtest_call
yield from self._runtest_for(item, "call")
File "/Users/runner/miniconda3/envs/test/lib/python3.12/site-packages/_pytest/logging.py", line 833, in _runtest_for
yield
File "/Users/runner/miniconda3/envs/test/lib/python3.12/site-packages/pluggy/_callers.py", line 167, in _multicall
teardown.throw(outcome._exception)
File "/Users/runner/miniconda3/envs/test/lib/python3.12/site-packages/_pytest/capture.py", line 878, in pytest_runtest_call
return (yield)
^^^^^
File "/Users/runner/miniconda3/envs/test/lib/python3.12/site-packages/pluggy/_callers.py", line 167, in _multicall
teardown.throw(outcome._exception)
File "/Users/runner/miniconda3/envs/test/lib/python3.12/site-packages/_pytest/skipping.py", line 257, in pytest_runtest_call
return (yield)
^^^^^
File "/Users/runner/miniconda3/envs/test/lib/python3.12/site-packages/pluggy/_callers.py", line 103, in _multicall
res = hook_impl.function(*args)
^^^^^^^^^^^^^^^^^^^^^^^^^
File "/Users/runner/miniconda3/envs/test/lib/python3.12/site-packages/_pytest/runner.py", line 183, in pytest_runtest_call
raise e
File "/Users/runner/miniconda3/envs/test/lib/python3.12/site-packages/_pytest/runner.py", line 173, in pytest_runtest_call
item.runtest()
File "/Users/runner/miniconda3/envs/test/lib/python3.12/site-packages/_pytest/python.py", line 1632, in runtest
self.ihook.pytest_pyfunc_call(pyfuncitem=self)
File "/Users/runner/miniconda3/envs/test/lib/python3.12/site-packages/pluggy/_hooks.py", line 513, in __call__
return self._hookexec(self.name, self._hookimpls.copy(), kwargs, firstresult)
^^^^^^^^^^^^^^^^^^^^^^^^^^^^^^^^^^^^^^^^^^^^^^^^^^^^^^^^^^^^^^^^^^^^^^
File "/Users/runner/miniconda3/envs/test/lib/python3.12/site-packages/pluggy/_manager.py", line 120, in _hookexec
return self._inner_hookexec(hook_name, methods, kwargs, firstresult)
^^^^^^^^^^^^^^^^^^^^^^^^^^^^^^^^^^^^^^^^^^^^^^^^^^^^^^^^^^^^^
File "/Users/runner/miniconda3/envs/test/lib/python3.12/site-packages/pluggy/_callers.py", line 139, in _multicall
raise exception.with_traceback(exception.__traceback__)
File "/Users/runner/miniconda3/envs/test/lib/python3.12/site-packages/pluggy/_callers.py", line 103, in _multicall
res = hook_impl.function(*args)
^^^^^^^^^^^^^^^^^^^^^^^^^
File "/Users/runner/miniconda3/envs/test/lib/python3.12/site-packages/_pytest/python.py", line 162, in pytest_pyfunc_call
result = testfunction(**testargs)
^^^^^^^^^^^^^^^^^^^^^^^^
File "/Users/runner/miniconda3/envs/test/lib/python3.12/site-packages/obspy/clients/fdsn/tests/test_client.py", line 343, in test_service_discovery_iris
assert {*client.services.keys()} == \
AssertionError: assert {'available_e...ect', 'event'} == {'available_e...t', 'station'}
Extra items in the right set:
'station'
Full diff:
{
'available_event_catalogs',
'available_event_contributors',
'dataselect',
'event',
- 'station',
}
Traceback (most recent call last):
File "/Users/runner/miniconda3/envs/test/lib/python3.12/site-packages/_pytest/runner.py", line 341, in from_call
result: Optional[TResult] = func()
^^^^^^
File "/Users/runner/miniconda3/envs/test/lib/python3.12/site-packages/_pytest/runner.py", line 241, in <lambda>
lambda: runtest_hook(item=item, **kwds), when=when, reraise=reraise
^^^^^^^^^^^^^^^^^^^^^^^^^^^^^^^
File "/Users/runner/miniconda3/envs/test/lib/python3.12/site-packages/pluggy/_hooks.py", line 513, in __call__
return self._hookexec(self.name, self._hookimpls.copy(), kwargs, firstresult)
^^^^^^^^^^^^^^^^^^^^^^^^^^^^^^^^^^^^^^^^^^^^^^^^^^^^^^^^^^^^^^^^^^^^^^
File "/Users/runner/miniconda3/envs/test/lib/python3.12/site-packages/pluggy/_manager.py", line 120, in _hookexec
return self._inner_hookexec(hook_name, methods, kwargs, firstresult)
^^^^^^^^^^^^^^^^^^^^^^^^^^^^^^^^^^^^^^^^^^^^^^^^^^^^^^^^^^^^^
File "/Users/runner/miniconda3/envs/test/lib/python3.12/site-packages/pluggy/_callers.py", line 182, in _multicall
return outcome.get_result()
^^^^^^^^^^^^^^^^^^^^
File "/Users/runner/miniconda3/envs/test/lib/python3.12/site-packages/pluggy/_result.py", line 100, in get_result
raise exc.with_traceback(exc.__traceback__)
File "/Users/runner/miniconda3/envs/test/lib/python3.12/site-packages/pluggy/_callers.py", line 167, in _multicall
teardown.throw(outcome._exception)
File "/Users/runner/miniconda3/envs/test/lib/python3.12/site-packages/_pytest/threadexception.py", line 87, in pytest_runtest_call
yield from thread_exception_runtest_hook()
File "/Users/runner/miniconda3/envs/test/lib/python3.12/site-packages/_pytest/threadexception.py", line 63, in thread_exception_runtest_hook
yield
File "/Users/runner/miniconda3/envs/test/lib/python3.12/site-packages/pluggy/_callers.py", line 167, in _multicall
teardown.throw(outcome._exception)
File "/Users/runner/miniconda3/envs/test/lib/python3.12/site-packages/_pytest/unraisableexception.py", line 90, in pytest_runtest_call
yield from unraisable_exception_runtest_hook()
File "/Users/runner/miniconda3/envs/test/lib/python3.12/site-packages/_pytest/unraisableexception.py", line 65, in unraisable_exception_runtest_hook
yield
File "/Users/runner/miniconda3/envs/test/lib/python3.12/site-packages/pluggy/_callers.py", line 167, in _multicall
teardown.throw(outcome._exception)
File "/Users/runner/miniconda3/envs/test/lib/python3.12/site-packages/_pytest/logging.py", line 850, in pytest_runtest_call
yield from self._runtest_for(item, "call")
File "/Users/runner/miniconda3/envs/test/lib/python3.12/site-packages/_pytest/logging.py", line 833, in _runtest_for
yield
File "/Users/runner/miniconda3/envs/test/lib/python3.12/site-packages/pluggy/_callers.py", line 167, in _multicall
teardown.throw(outcome._exception)
File "/Users/runner/miniconda3/envs/test/lib/python3.12/site-packages/_pytest/capture.py", line 878, in pytest_runtest_call
return (yield)
^^^^^
File "/Users/runner/miniconda3/envs/test/lib/python3.12/site-packages/pluggy/_callers.py", line 167, in _multicall
teardown.throw(outcome._exception)
File "/Users/runner/miniconda3/envs/test/lib/python3.12/site-packages/_pytest/skipping.py", line 257, in pytest_runtest_call
return (yield)
^^^^^
File "/Users/runner/miniconda3/envs/test/lib/python3.12/site-packages/pluggy/_callers.py", line 103, in _multicall
res = hook_impl.function(*args)
^^^^^^^^^^^^^^^^^^^^^^^^^
File "/Users/runner/miniconda3/envs/test/lib/python3.12/site-packages/_pytest/runner.py", line 183, in pytest_runtest_call
raise e
File "/Users/runner/miniconda3/envs/test/lib/python3.12/site-packages/_pytest/runner.py", line 173, in pytest_runtest_call
item.runtest()
File "/Users/runner/miniconda3/envs/test/lib/python3.12/site-packages/_pytest/python.py", line 1632, in runtest
self.ihook.pytest_pyfunc_call(pyfuncitem=self)
File "/Users/runner/miniconda3/envs/test/lib/python3.12/site-packages/pluggy/_hooks.py", line 513, in __call__
return self._hookexec(self.name, self._hookimpls.copy(), kwargs, firstresult)
^^^^^^^^^^^^^^^^^^^^^^^^^^^^^^^^^^^^^^^^^^^^^^^^^^^^^^^^^^^^^^^^^^^^^^
File "/Users/runner/miniconda3/envs/test/lib/python3.12/site-packages/pluggy/_manager.py", line 120, in _hookexec
return self._inner_hookexec(hook_name, methods, kwargs, firstresult)
^^^^^^^^^^^^^^^^^^^^^^^^^^^^^^^^^^^^^^^^^^^^^^^^^^^^^^^^^^^^^
File "/Users/runner/miniconda3/envs/test/lib/python3.12/site-packages/pluggy/_callers.py", line 139, in _multicall
raise exception.with_traceback(exception.__traceback__)
File "/Users/runner/miniconda3/envs/test/lib/python3.12/site-packages/pluggy/_callers.py", line 103, in _multicall
res = hook_impl.function(*args)
^^^^^^^^^^^^^^^^^^^^^^^^^
File "/Users/runner/miniconda3/envs/test/lib/python3.12/site-packages/_pytest/python.py", line 162, in pytest_pyfunc_call
result = testfunction(**testargs)
^^^^^^^^^^^^^^^^^^^^^^^^
File "/Users/runner/miniconda3/envs/test/lib/python3.12/site-packages/obspy/clients/fdsn/tests/test_client.py", line 501, in test_iris_example_queries_station
inv = client.get_stations(latitude=-56.1, longitude=-26.7,
^^^^^^^^^^^^^^^^^^^^^^^^^^^^^^^^^^^^^^^^^^^^^^^^^^^^
File "/Users/runner/miniconda3/envs/test/lib/python3.12/site-packages/obspy/clients/fdsn/client.py", line 747, in get_stations
raise ValueError(msg)
ValueError: The current client does not have a station service.
Traceback (most recent call last):
File "/Users/runner/miniconda3/envs/test/lib/python3.12/site-packages/_pytest/runner.py", line 341, in from_call
result: Optional[TResult] = func()
^^^^^^
File "/Users/runner/miniconda3/envs/test/lib/python3.12/site-packages/_pytest/runner.py", line 241, in <lambda>
lambda: runtest_hook(item=item, **kwds), when=when, reraise=reraise
^^^^^^^^^^^^^^^^^^^^^^^^^^^^^^^
File "/Users/runner/miniconda3/envs/test/lib/python3.12/site-packages/pluggy/_hooks.py", line 513, in __call__
return self._hookexec(self.name, self._hookimpls.copy(), kwargs, firstresult)
^^^^^^^^^^^^^^^^^^^^^^^^^^^^^^^^^^^^^^^^^^^^^^^^^^^^^^^^^^^^^^^^^^^^^^
File "/Users/runner/miniconda3/envs/test/lib/python3.12/site-packages/pluggy/_manager.py", line 120, in _hookexec
return self._inner_hookexec(hook_name, methods, kwargs, firstresult)
^^^^^^^^^^^^^^^^^^^^^^^^^^^^^^^^^^^^^^^^^^^^^^^^^^^^^^^^^^^^^
File "/Users/runner/miniconda3/envs/test/lib/python3.12/site-packages/pluggy/_callers.py", line 182, in _multicall
return outcome.get_result()
^^^^^^^^^^^^^^^^^^^^
File "/Users/runner/miniconda3/envs/test/lib/python3.12/site-packages/pluggy/_result.py", line 100, in get_result
raise exc.with_traceback(exc.__traceback__)
File "/Users/runner/miniconda3/envs/test/lib/python3.12/site-packages/pluggy/_callers.py", line 167, in _multicall
teardown.throw(outcome._exception)
File "/Users/runner/miniconda3/envs/test/lib/python3.12/site-packages/_pytest/threadexception.py", line 87, in pytest_runtest_call
yield from thread_exception_runtest_hook()
File "/Users/runner/miniconda3/envs/test/lib/python3.12/site-packages/_pytest/threadexception.py", line 63, in thread_exception_runtest_hook
yield
File "/Users/runner/miniconda3/envs/test/lib/python3.12/site-packages/pluggy/_callers.py", line 167, in _multicall
teardown.throw(outcome._exception)
File "/Users/runner/miniconda3/envs/test/lib/python3.12/site-packages/_pytest/unraisableexception.py", line 90, in pytest_runtest_call
yield from unraisable_exception_runtest_hook()
File "/Users/runner/miniconda3/envs/test/lib/python3.12/site-packages/_pytest/unraisableexception.py", line 65, in unraisable_exception_runtest_hook
yield
File "/Users/runner/miniconda3/envs/test/lib/python3.12/site-packages/pluggy/_callers.py", line 167, in _multicall
teardown.throw(outcome._exception)
File "/Users/runner/miniconda3/envs/test/lib/python3.12/site-packages/_pytest/logging.py", line 850, in pytest_runtest_call
yield from self._runtest_for(item, "call")
File "/Users/runner/miniconda3/envs/test/lib/python3.12/site-packages/_pytest/logging.py", line 833, in _runtest_for
yield
File "/Users/runner/miniconda3/envs/test/lib/python3.12/site-packages/pluggy/_callers.py", line 167, in _multicall
teardown.throw(outcome._exception)
File "/Users/runner/miniconda3/envs/test/lib/python3.12/site-packages/_pytest/capture.py", line 878, in pytest_runtest_call
return (yield)
^^^^^
File "/Users/runner/miniconda3/envs/test/lib/python3.12/site-packages/pluggy/_callers.py", line 167, in _multicall
teardown.throw(outcome._exception)
File "/Users/runner/miniconda3/envs/test/lib/python3.12/site-packages/_pytest/skipping.py", line 257, in pytest_runtest_call
return (yield)
^^^^^
File "/Users/runner/miniconda3/envs/test/lib/python3.12/site-packages/pluggy/_callers.py", line 103, in _multicall
res = hook_impl.function(*args)
^^^^^^^^^^^^^^^^^^^^^^^^^
File "/Users/runner/miniconda3/envs/test/lib/python3.12/site-packages/_pytest/runner.py", line 183, in pytest_runtest_call
raise e
File "/Users/runner/miniconda3/envs/test/lib/python3.12/site-packages/_pytest/runner.py", line 173, in pytest_runtest_call
item.runtest()
File "/Users/runner/miniconda3/envs/test/lib/python3.12/site-packages/_pytest/python.py", line 1632, in runtest
self.ihook.pytest_pyfunc_call(pyfuncitem=self)
File "/Users/runner/miniconda3/envs/test/lib/python3.12/site-packages/pluggy/_hooks.py", line 513, in __call__
return self._hookexec(self.name, self._hookimpls.copy(), kwargs, firstresult)
^^^^^^^^^^^^^^^^^^^^^^^^^^^^^^^^^^^^^^^^^^^^^^^^^^^^^^^^^^^^^^^^^^^^^^
File "/Users/runner/miniconda3/envs/test/lib/python3.12/site-packages/pluggy/_manager.py", line 120, in _hookexec
return self._inner_hookexec(hook_name, methods, kwargs, firstresult)
^^^^^^^^^^^^^^^^^^^^^^^^^^^^^^^^^^^^^^^^^^^^^^^^^^^^^^^^^^^^^
File "/Users/runner/miniconda3/envs/test/lib/python3.12/site-packages/pluggy/_callers.py", line 139, in _multicall
raise exception.with_traceback(exception.__traceback__)
File "/Users/runner/miniconda3/envs/test/lib/python3.12/site-packages/pluggy/_callers.py", line 103, in _multicall
res = hook_impl.function(*args)
^^^^^^^^^^^^^^^^^^^^^^^^^
File "/Users/runner/miniconda3/envs/test/lib/python3.12/site-packages/_pytest/python.py", line 162, in pytest_pyfunc_call
result = testfunction(**testargs)
^^^^^^^^^^^^^^^^^^^^^^^^
File "/Users/runner/miniconda3/envs/test/lib/python3.12/site-packages/obspy/clients/fdsn/tests/test_client.py", line 584, in test_iris_example_queries_dataselect
got = client.get_waveforms(*query)
^^^^^^^^^^^^^^^^^^^^^^^^^^^^
File "/Users/runner/miniconda3/envs/test/lib/python3.12/site-packages/obspy/clients/fdsn/client.py", line 879, in get_waveforms
data_stream = self._download(url, use_gzip=False)
^^^^^^^^^^^^^^^^^^^^^^^^^^^^^^^^^^^
File "/Users/runner/miniconda3/envs/test/lib/python3.12/site-packages/obspy/clients/fdsn/client.py", line 1493, in _download
raise_on_error(code, data)
File "/Users/runner/miniconda3/envs/test/lib/python3.12/site-packages/obspy/clients/fdsn/client.py", line 1868, in raise_on_error
raise FDSNInternalServerException("Service responds: Internal server "
obspy.clients.fdsn.header.FDSNInternalServerException: Service responds: Internal server error
HTTP Status code: 500
Detailed response of server:
Error 500: Error calling internal metadata service, code 404 [<!doctype html>
<html lang="en">
<head>
<title>
NSF SAGE:
404 Page Not Found Error
</title>
<meta name="keywords" content="seismology, seismological data,
earthquakes, iris dmc" />
<!-- Forces IE to render in 'latest' compatible mode -->
<meta http-equiv="X-UA-Compatible" content="IE=Edge"/>
<meta charset="utf-8" />
<meta name="viewport" content="width=device-width, initial-scale=1" />
<link rel="stylesheet" media="all" type="text/css" href="/static/css/iris.css" />
<link rel="stylesheet" media="print" type="text/css" href="/static/css/print.css" />
<link rel="shortcut icon" href="/static/img/favicon.ico" />
<script type="text/javascript" src="//ajax.googleapis.com/ajax/libs/jquery/1.11.1/jquery.js"></script>
<script type="text/javascript" src="//netdna.bootstrapcdn.com/bootstrap/3.4.1/js/bootstrap.min.js"></script>
<!--
<script type="text/javascript" src="//ajax.googleapis.com/ajax/libs/jqueryui/1.8.23/jquery-ui.min.js"></script>
<script type="text/javascript" src="/static/libs/megamenu/megamenu_plugins.js"></script>
<script type="text/javascript" src="/static/libs/megamenu/megamenu.min.js"></script>
-->
<!-- Global site tag (gtag.js) - Google Analytics -->
<script async src="https://www.googletagmanager.com/gtag/js?id=UA-1860730-1"></script>
<script>
window.dataLayer = window.dataLayer || [];
function gtag(){dataLayer.push(arguments);}
gtag('js', new Date());
gtag('config', 'UA-1860730-1');
</script>
<link rel="stylesheet" type="text/css" href="/static/libs/qtip2/2.1.1/jquery.qtip.css" />
<script type="text/javascript" src="/static/libs/qtip2/2.1.1/jquery.qtip.js"></script>
<script>
$(function() {
/* Automatically set up popup help blocks like:
* <div class="popup-help">
* <span class="glyphicon glyphicon-question-sign"> </span>
* <div>
* Content to show in the popup.
* </div>
* </div>
* Hovering over the icon shows the content in a popup.
*/
$(".popup-help").each(function() {
var content = $(this).children('div').detach();
var popupOnClick = $(this).hasClass('popup-on-click');
// Attach to the first element
$(this).children().first().qtip({
content: { text: content },
style: { classes: 'qtip-bootstrap' },
hide: {
delay: 100,
fixed: true
},
show: {
event: popupOnClick ? 'click' : 'mouseenter'
},
position: {
viewport: $(window)
},
});
});
});
</script>
</head>
<body>
<div class="container blur">
<div id="breadcrumbs">
<ul class="breadcrumbs">
<li>
<a href="/">Web Services</a>
</li>
</ul>
</div>
<div id="page-content">
<h1>
404 Page Not Found Error
</h1>
<div id="content">
<p>We are sorry, but the page you are requesting does not exist.</p>
<p>Please check the URL path you are requested and try again.</p>
<p>If you believe the error to be ours, please
<a href="//www.iris.edu/hq/contact">contact</a>
us.</p>
</div>
</div>
</div>
</body>
</html>
]
More Details:
handler exited, code: 1 reason: Internal Server Error
Request:
http://service.iris.edu/fdsnws/dataselect/1/query?starttime=2010-02-27T06%3A30%3A00.000000&endtime=2010-02-27T06%3A40%3A00.000000&network=IU&station=ANMO&location=00&channel=BHZ
Request Submitted:
2024/06/05 10:06:11 UTC
Service version:
Service: fdsnws-dataselect version: 1.1.9
Traceback (most recent call last):
File "/Users/runner/miniconda3/envs/test/lib/python3.12/site-packages/_pytest/runner.py", line 341, in from_call
result: Optional[TResult] = func()
^^^^^^
File "/Users/runner/miniconda3/envs/test/lib/python3.12/site-packages/_pytest/runner.py", line 241, in <lambda>
lambda: runtest_hook(item=item, **kwds), when=when, reraise=reraise
^^^^^^^^^^^^^^^^^^^^^^^^^^^^^^^
File "/Users/runner/miniconda3/envs/test/lib/python3.12/site-packages/pluggy/_hooks.py", line 513, in __call__
return self._hookexec(self.name, self._hookimpls.copy(), kwargs, firstresult)
^^^^^^^^^^^^^^^^^^^^^^^^^^^^^^^^^^^^^^^^^^^^^^^^^^^^^^^^^^^^^^^^^^^^^^
File "/Users/runner/miniconda3/envs/test/lib/python3.12/site-packages/pluggy/_manager.py", line 120, in _hookexec
return self._inner_hookexec(hook_name, methods, kwargs, firstresult)
^^^^^^^^^^^^^^^^^^^^^^^^^^^^^^^^^^^^^^^^^^^^^^^^^^^^^^^^^^^^^
File "/Users/runner/miniconda3/envs/test/lib/python3.12/site-packages/pluggy/_callers.py", line 182, in _multicall
return outcome.get_result()
^^^^^^^^^^^^^^^^^^^^
File "/Users/runner/miniconda3/envs/test/lib/python3.12/site-packages/pluggy/_result.py", line 100, in get_result
raise exc.with_traceback(exc.__traceback__)
File "/Users/runner/miniconda3/envs/test/lib/python3.12/site-packages/pluggy/_callers.py", line 167, in _multicall
teardown.throw(outcome._exception)
File "/Users/runner/miniconda3/envs/test/lib/python3.12/site-packages/_pytest/threadexception.py", line 87, in pytest_runtest_call
yield from thread_exception_runtest_hook()
File "/Users/runner/miniconda3/envs/test/lib/python3.12/site-packages/_pytest/threadexception.py", line 63, in thread_exception_runtest_hook
yield
File "/Users/runner/miniconda3/envs/test/lib/python3.12/site-packages/pluggy/_callers.py", line 167, in _multicall
teardown.throw(outcome._exception)
File "/Users/runner/miniconda3/envs/test/lib/python3.12/site-packages/_pytest/unraisableexception.py", line 90, in pytest_runtest_call
yield from unraisable_exception_runtest_hook()
File "/Users/runner/miniconda3/envs/test/lib/python3.12/site-packages/_pytest/unraisableexception.py", line 65, in unraisable_exception_runtest_hook
yield
File "/Users/runner/miniconda3/envs/test/lib/python3.12/site-packages/pluggy/_callers.py", line 167, in _multicall
teardown.throw(outcome._exception)
File "/Users/runner/miniconda3/envs/test/lib/python3.12/site-packages/_pytest/logging.py", line 850, in pytest_runtest_call
yield from self._runtest_for(item, "call")
File "/Users/runner/miniconda3/envs/test/lib/python3.12/site-packages/_pytest/logging.py", line 833, in _runtest_for
yield
File "/Users/runner/miniconda3/envs/test/lib/python3.12/site-packages/pluggy/_callers.py", line 167, in _multicall
teardown.throw(outcome._exception)
File "/Users/runner/miniconda3/envs/test/lib/python3.12/site-packages/_pytest/capture.py", line 878, in pytest_runtest_call
return (yield)
^^^^^
File "/Users/runner/miniconda3/envs/test/lib/python3.12/site-packages/pluggy/_callers.py", line 167, in _multicall
teardown.throw(outcome._exception)
File "/Users/runner/miniconda3/envs/test/lib/python3.12/site-packages/_pytest/skipping.py", line 257, in pytest_runtest_call
return (yield)
^^^^^
File "/Users/runner/miniconda3/envs/test/lib/python3.12/site-packages/pluggy/_callers.py", line 103, in _multicall
res = hook_impl.function(*args)
^^^^^^^^^^^^^^^^^^^^^^^^^
File "/Users/runner/miniconda3/envs/test/lib/python3.12/site-packages/_pytest/runner.py", line 183, in pytest_runtest_call
raise e
File "/Users/runner/miniconda3/envs/test/lib/python3.12/site-packages/_pytest/runner.py", line 173, in pytest_runtest_call
item.runtest()
File "/Users/runner/miniconda3/envs/test/lib/python3.12/site-packages/_pytest/python.py", line 1632, in runtest
self.ihook.pytest_pyfunc_call(pyfuncitem=self)
File "/Users/runner/miniconda3/envs/test/lib/python3.12/site-packages/pluggy/_hooks.py", line 513, in __call__
return self._hookexec(self.name, self._hookimpls.copy(), kwargs, firstresult)
^^^^^^^^^^^^^^^^^^^^^^^^^^^^^^^^^^^^^^^^^^^^^^^^^^^^^^^^^^^^^^^^^^^^^^
File "/Users/runner/miniconda3/envs/test/lib/python3.12/site-packages/pluggy/_manager.py", line 120, in _hookexec
return self._inner_hookexec(hook_name, methods, kwargs, firstresult)
^^^^^^^^^^^^^^^^^^^^^^^^^^^^^^^^^^^^^^^^^^^^^^^^^^^^^^^^^^^^^
File "/Users/runner/miniconda3/envs/test/lib/python3.12/site-packages/pluggy/_callers.py", line 139, in _multicall
raise exception.with_traceback(exception.__traceback__)
File "/Users/runner/miniconda3/envs/test/lib/python3.12/site-packages/pluggy/_callers.py", line 103, in _multicall
res = hook_impl.function(*args)
^^^^^^^^^^^^^^^^^^^^^^^^^
File "/Users/runner/miniconda3/envs/test/lib/python3.12/site-packages/_pytest/python.py", line 162, in pytest_pyfunc_call
result = testfunction(**testargs)
^^^^^^^^^^^^^^^^^^^^^^^^
File "/Users/runner/miniconda3/envs/test/lib/python3.12/site-packages/obspy/clients/fdsn/tests/test_client.py", line 616, in test_authentication
got = client.get_waveforms(*query)
^^^^^^^^^^^^^^^^^^^^^^^^^^^^
File "/Users/runner/miniconda3/envs/test/lib/python3.12/site-packages/obspy/clients/fdsn/client.py", line 879, in get_waveforms
data_stream = self._download(url, use_gzip=False)
^^^^^^^^^^^^^^^^^^^^^^^^^^^^^^^^^^^
File "/Users/runner/miniconda3/envs/test/lib/python3.12/site-packages/obspy/clients/fdsn/client.py", line 1493, in _download
raise_on_error(code, data)
File "/Users/runner/miniconda3/envs/test/lib/python3.12/site-packages/obspy/clients/fdsn/client.py", line 1868, in raise_on_error
raise FDSNInternalServerException("Service responds: Internal server "
obspy.clients.fdsn.header.FDSNInternalServerException: Service responds: Internal server error
HTTP Status code: 500
Detailed response of server:
Error 500: Error calling internal metadata service, code 404 [<!doctype html>
<html lang="en">
<head>
<title>
NSF SAGE:
404 Page Not Found Error
</title>
<meta name="keywords" content="seismology, seismological data,
earthquakes, iris dmc" />
<!-- Forces IE to render in 'latest' compatible mode -->
<meta http-equiv="X-UA-Compatible" content="IE=Edge"/>
<meta charset="utf-8" />
<meta name="viewport" content="width=device-width, initial-scale=1" />
<link rel="stylesheet" media="all" type="text/css" href="/static/css/iris.css" />
<link rel="stylesheet" media="print" type="text/css" href="/static/css/print.css" />
<link rel="shortcut icon" href="/static/img/favicon.ico" />
<script type="text/javascript" src="//ajax.googleapis.com/ajax/libs/jquery/1.11.1/jquery.js"></script>
<script type="text/javascript" src="//netdna.bootstrapcdn.com/bootstrap/3.4.1/js/bootstrap.min.js"></script>
<!--
<script type="text/javascript" src="//ajax.googleapis.com/ajax/libs/jqueryui/1.8.23/jquery-ui.min.js"></script>
<script type="text/javascript" src="/static/libs/megamenu/megamenu_plugins.js"></script>
<script type="text/javascript" src="/static/libs/megamenu/megamenu.min.js"></script>
-->
<!-- Global site tag (gtag.js) - Google Analytics -->
<script async src="https://www.googletagmanager.com/gtag/js?id=UA-1860730-1"></script>
<script>
window.dataLayer = window.dataLayer || [];
function gtag(){dataLayer.push(arguments);}
gtag('js', new Date());
gtag('config', 'UA-1860730-1');
</script>
<link rel="stylesheet" type="text/css" href="/static/libs/qtip2/2.1.1/jquery.qtip.css" />
<script type="text/javascript" src="/static/libs/qtip2/2.1.1/jquery.qtip.js"></script>
<script>
$(function() {
/* Automatically set up popup help blocks like:
* <div class="popup-help">
* <span class="glyphicon glyphicon-question-sign"> </span>
* <div>
* Content to show in the popup.
* </div>
* </div>
* Hovering over the icon shows the content in a popup.
*/
$(".popup-help").each(function() {
var content = $(this).children('div').detach();
var popupOnClick = $(this).hasClass('popup-on-click');
// Attach to the first element
$(this).children().first().qtip({
content: { text: content },
style: { classes: 'qtip-bootstrap' },
hide: {
delay: 100,
fixed: true
},
show: {
event: popupOnClick ? 'click' : 'mouseenter'
},
position: {
viewport: $(window)
},
});
});
});
</script>
</head>
<body>
<div class="container blur">
<div id="breadcrumbs">
<ul class="breadcrumbs">
<li>
<a href="/">Web Services</a>
</li>
</ul>
</div>
<div id="page-content">
<h1>
404 Page Not Found Error
</h1>
<div id="content">
<p>We are sorry, but the page you are requesting does not exist.</p>
<p>Please check the URL path you are requested and try again.</p>
<p>If you believe the error to be ours, please
<a href="//www.iris.edu/hq/contact">contact</a>
us.</p>
</div>
</div>
</div>
</body>
</html>
]
More Details:
handler exited, code: 1 reason: Internal Server Error
Request:
http://service.iris.edu/fdsnws/dataselect/1/queryauth?starttime=2010-02-27T06%3A30%3A00.000000&endtime=2010-02-27T06%3A40%3A00.000000&network=IU&station=ANMO&location=00&channel=BHZ
Request Submitted:
2024/06/05 10:06:14 UTC
Service version:
Service: fdsnws-dataselect version: 1.1.9
Traceback (most recent call last):
File "/Users/runner/miniconda3/envs/test/lib/python3.12/site-packages/_pytest/runner.py", line 341, in from_call
result: Optional[TResult] = func()
^^^^^^
File "/Users/runner/miniconda3/envs/test/lib/python3.12/site-packages/_pytest/runner.py", line 241, in <lambda>
lambda: runtest_hook(item=item, **kwds), when=when, reraise=reraise
^^^^^^^^^^^^^^^^^^^^^^^^^^^^^^^
File "/Users/runner/miniconda3/envs/test/lib/python3.12/site-packages/pluggy/_hooks.py", line 513, in __call__
return self._hookexec(self.name, self._hookimpls.copy(), kwargs, firstresult)
^^^^^^^^^^^^^^^^^^^^^^^^^^^^^^^^^^^^^^^^^^^^^^^^^^^^^^^^^^^^^^^^^^^^^^
File "/Users/runner/miniconda3/envs/test/lib/python3.12/site-packages/pluggy/_manager.py", line 120, in _hookexec
return self._inner_hookexec(hook_name, methods, kwargs, firstresult)
^^^^^^^^^^^^^^^^^^^^^^^^^^^^^^^^^^^^^^^^^^^^^^^^^^^^^^^^^^^^^
File "/Users/runner/miniconda3/envs/test/lib/python3.12/site-packages/pluggy/_callers.py", line 182, in _multicall
return outcome.get_result()
^^^^^^^^^^^^^^^^^^^^
File "/Users/runner/miniconda3/envs/test/lib/python3.12/site-packages/pluggy/_result.py", line 100, in get_result
raise exc.with_traceback(exc.__traceback__)
File "/Users/runner/miniconda3/envs/test/lib/python3.12/site-packages/pluggy/_callers.py", line 167, in _multicall
teardown.throw(outcome._exception)
File "/Users/runner/miniconda3/envs/test/lib/python3.12/site-packages/_pytest/threadexception.py", line 87, in pytest_runtest_call
yield from thread_exception_runtest_hook()
File "/Users/runner/miniconda3/envs/test/lib/python3.12/site-packages/_pytest/threadexception.py", line 63, in thread_exception_runtest_hook
yield
File "/Users/runner/miniconda3/envs/test/lib/python3.12/site-packages/pluggy/_callers.py", line 167, in _multicall
teardown.throw(outcome._exception)
File "/Users/runner/miniconda3/envs/test/lib/python3.12/site-packages/_pytest/unraisableexception.py", line 90, in pytest_runtest_call
yield from unraisable_exception_runtest_hook()
File "/Users/runner/miniconda3/envs/test/lib/python3.12/site-packages/_pytest/unraisableexception.py", line 65, in unraisable_exception_runtest_hook
yield
File "/Users/runner/miniconda3/envs/test/lib/python3.12/site-packages/pluggy/_callers.py", line 167, in _multicall
teardown.throw(outcome._exception)
File "/Users/runner/miniconda3/envs/test/lib/python3.12/site-packages/_pytest/logging.py", line 850, in pytest_runtest_call
yield from self._runtest_for(item, "call")
File "/Users/runner/miniconda3/envs/test/lib/python3.12/site-packages/_pytest/logging.py", line 833, in _runtest_for
yield
File "/Users/runner/miniconda3/envs/test/lib/python3.12/site-packages/pluggy/_callers.py", line 167, in _multicall
teardown.throw(outcome._exception)
File "/Users/runner/miniconda3/envs/test/lib/python3.12/site-packages/_pytest/capture.py", line 878, in pytest_runtest_call
return (yield)
^^^^^
File "/Users/runner/miniconda3/envs/test/lib/python3.12/site-packages/pluggy/_callers.py", line 167, in _multicall
teardown.throw(outcome._exception)
File "/Users/runner/miniconda3/envs/test/lib/python3.12/site-packages/_pytest/skipping.py", line 257, in pytest_runtest_call
return (yield)
^^^^^
File "/Users/runner/miniconda3/envs/test/lib/python3.12/site-packages/pluggy/_callers.py", line 103, in _multicall
res = hook_impl.function(*args)
^^^^^^^^^^^^^^^^^^^^^^^^^
File "/Users/runner/miniconda3/envs/test/lib/python3.12/site-packages/_pytest/runner.py", line 183, in pytest_runtest_call
raise e
File "/Users/runner/miniconda3/envs/test/lib/python3.12/site-packages/_pytest/runner.py", line 173, in pytest_runtest_call
item.runtest()
File "/Users/runner/miniconda3/envs/test/lib/python3.12/site-packages/_pytest/python.py", line 1632, in runtest
self.ihook.pytest_pyfunc_call(pyfuncitem=self)
File "/Users/runner/miniconda3/envs/test/lib/python3.12/site-packages/pluggy/_hooks.py", line 513, in __call__
return self._hookexec(self.name, self._hookimpls.copy(), kwargs, firstresult)
^^^^^^^^^^^^^^^^^^^^^^^^^^^^^^^^^^^^^^^^^^^^^^^^^^^^^^^^^^^^^^^^^^^^^^
File "/Users/runner/miniconda3/envs/test/lib/python3.12/site-packages/pluggy/_manager.py", line 120, in _hookexec
return self._inner_hookexec(hook_name, methods, kwargs, firstresult)
^^^^^^^^^^^^^^^^^^^^^^^^^^^^^^^^^^^^^^^^^^^^^^^^^^^^^^^^^^^^^
File "/Users/runner/miniconda3/envs/test/lib/python3.12/site-packages/pluggy/_callers.py", line 139, in _multicall
raise exception.with_traceback(exception.__traceback__)
File "/Users/runner/miniconda3/envs/test/lib/python3.12/site-packages/pluggy/_callers.py", line 103, in _multicall
res = hook_impl.function(*args)
^^^^^^^^^^^^^^^^^^^^^^^^^
File "/Users/runner/miniconda3/envs/test/lib/python3.12/site-packages/_pytest/python.py", line 162, in pytest_pyfunc_call
result = testfunction(**testargs)
^^^^^^^^^^^^^^^^^^^^^^^^
File "/Users/runner/miniconda3/envs/test/lib/python3.12/site-packages/obspy/clients/fdsn/tests/test_client.py", line 681, in test_iris_example_queries_station_discover_services_false
inv = client.get_stations(latitude=-56.1, longitude=-26.7,
^^^^^^^^^^^^^^^^^^^^^^^^^^^^^^^^^^^^^^^^^^^^^^^^^^^^
File "/Users/runner/miniconda3/envs/test/lib/python3.12/site-packages/obspy/clients/fdsn/client.py", line 755, in get_stations
data_stream = self._download(url)
^^^^^^^^^^^^^^^^^^^
File "/Users/runner/miniconda3/envs/test/lib/python3.12/site-packages/obspy/clients/fdsn/client.py", line 1493, in _download
raise_on_error(code, data)
File "/Users/runner/miniconda3/envs/test/lib/python3.12/site-packages/obspy/clients/fdsn/client.py", line 1888, in raise_on_error
raise FDSNException("Unknown HTTP code: %i" % code, server_info)
obspy.clients.fdsn.header.FDSNException: Unknown HTTP code: 404
Detailed response of server:
Not Found
<!doctype html>
<html lang="en">
<head>
<title>
NSF SAGE:
404 Page Not Found Error
</title>
<meta name="keywords" content="seismology, seismological data,
earthquakes, iris dmc" />
<!-- Forces IE to render in 'latest' compatible mode -->
<meta http-equiv="X-UA-Compatible" content="IE=Edge"/>
<meta charset="utf-8" />
<meta name="viewport" content="width=device-width, initial-scale=1" />
<link rel="stylesheet" media="all" type="text/css" href="/static/css/iris.css" />
<link rel="stylesheet" media="print" type="text/css" href="/static/css/print.css" />
<link rel="shortcut icon" href="/static/img/favicon.ico" />
<script type="text/javascript" src="//ajax.googleapis.com/ajax/libs/jquery/1.11.1/jquery.js"></script>
<script type="text/javascript" src="//netdna.bootstrapcdn.com/bootstrap/3.4.1/js/bootstrap.min.js"></script>
<!--
<script type="text/javascript" src="//ajax.googleapis.com/ajax/libs/jqueryui/1.8.23/jquery-ui.min.js"></script>
<script type="text/javascript" src="/static/libs/megamenu/megamenu_plugins.js"></script>
<script type="text/javascript" src="/static/libs/megamenu/megamenu.min.js"></script>
-->
<!-- Global site tag (gtag.js) - Google Analytics -->
<script async src="https://www.googletagmanager.com/gtag/js?id=UA-1860730-1"></script>
<script>
window.dataLayer = window.dataLayer || [];
function gtag(){dataLayer.push(arguments);}
gtag('js', new Date());
gtag('config', 'UA-1860730-1');
</script>
<link rel="stylesheet" type="text/css" href="/static/libs/qtip2/2.1.1/jquery.qtip.css" />
<script type="text/javascript" src="/static/libs/qtip2/2.1.1/jquery.qtip.js"></script>
<script>
$(function() {
/* Automatically set up popup help blocks like:
* <div class="popup-help">
* <span class="glyphicon glyphicon-question-sign"> </span>
* <div>
* Content to show in the popup.
* </div>
* </div>
* Hovering over the icon shows the content in a popup.
*/
$(".popup-help").each(function() {
var content = $(this).children('div').detach();
var popupOnClick = $(this).hasClass('popup-on-click');
// Attach to the first element
$(this).children().first().qtip({
content: { text: content },
style: { classes: 'qtip-bootstrap' },
hide: {
delay: 100,
fixed: true
},
show: {
event: popupOnClick ? 'click' : 'mouseenter'
},
position: {
viewport: $(window)
},
});
});
});
</script>
</head>
<body>
<div class="container blur">
<div id="breadcrumbs">
<ul class="breadcrumbs">
<li>
<a href="/">Web Services</a>
</li>
</ul>
</div>
<div id="page-content">
<h1>
404 Page Not Found Error
</h1>
<div id="content">
<p>We are sorry, but the page you are requesting does not exist.</p>
<p>Please check the URL path you are requested and try again.</p>
<p>If you believe the error to be ours, please
<a href="//www.iris.edu/hq/contact">contact</a>
us.</p>
</div>
</div>
</div>
</body>
</html>
Traceback (most recent call last):
File "/Users/runner/miniconda3/envs/test/lib/python3.12/site-packages/_pytest/runner.py", line 341, in from_call
result: Optional[TResult] = func()
^^^^^^
File "/Users/runner/miniconda3/envs/test/lib/python3.12/site-packages/_pytest/runner.py", line 241, in <lambda>
lambda: runtest_hook(item=item, **kwds), when=when, reraise=reraise
^^^^^^^^^^^^^^^^^^^^^^^^^^^^^^^
File "/Users/runner/miniconda3/envs/test/lib/python3.12/site-packages/pluggy/_hooks.py", line 513, in __call__
return self._hookexec(self.name, self._hookimpls.copy(), kwargs, firstresult)
^^^^^^^^^^^^^^^^^^^^^^^^^^^^^^^^^^^^^^^^^^^^^^^^^^^^^^^^^^^^^^^^^^^^^^
File "/Users/runner/miniconda3/envs/test/lib/python3.12/site-packages/pluggy/_manager.py", line 120, in _hookexec
return self._inner_hookexec(hook_name, methods, kwargs, firstresult)
^^^^^^^^^^^^^^^^^^^^^^^^^^^^^^^^^^^^^^^^^^^^^^^^^^^^^^^^^^^^^
File "/Users/runner/miniconda3/envs/test/lib/python3.12/site-packages/pluggy/_callers.py", line 182, in _multicall
return outcome.get_result()
^^^^^^^^^^^^^^^^^^^^
File "/Users/runner/miniconda3/envs/test/lib/python3.12/site-packages/pluggy/_result.py", line 100, in get_result
raise exc.with_traceback(exc.__traceback__)
File "/Users/runner/miniconda3/envs/test/lib/python3.12/site-packages/pluggy/_callers.py", line 167, in _multicall
teardown.throw(outcome._exception)
File "/Users/runner/miniconda3/envs/test/lib/python3.12/site-packages/_pytest/threadexception.py", line 87, in pytest_runtest_call
yield from thread_exception_runtest_hook()
File "/Users/runner/miniconda3/envs/test/lib/python3.12/site-packages/_pytest/threadexception.py", line 63, in thread_exception_runtest_hook
yield
File "/Users/runner/miniconda3/envs/test/lib/python3.12/site-packages/pluggy/_callers.py", line 167, in _multicall
teardown.throw(outcome._exception)
File "/Users/runner/miniconda3/envs/test/lib/python3.12/site-packages/_pytest/unraisableexception.py", line 90, in pytest_runtest_call
yield from unraisable_exception_runtest_hook()
File "/Users/runner/miniconda3/envs/test/lib/python3.12/site-packages/_pytest/unraisableexception.py", line 65, in unraisable_exception_runtest_hook
yield
File "/Users/runner/miniconda3/envs/test/lib/python3.12/site-packages/pluggy/_callers.py", line 167, in _multicall
teardown.throw(outcome._exception)
File "/Users/runner/miniconda3/envs/test/lib/python3.12/site-packages/_pytest/logging.py", line 850, in pytest_runtest_call
yield from self._runtest_for(item, "call")
File "/Users/runner/miniconda3/envs/test/lib/python3.12/site-packages/_pytest/logging.py", line 833, in _runtest_for
yield
File "/Users/runner/miniconda3/envs/test/lib/python3.12/site-packages/pluggy/_callers.py", line 167, in _multicall
teardown.throw(outcome._exception)
File "/Users/runner/miniconda3/envs/test/lib/python3.12/site-packages/_pytest/capture.py", line 878, in pytest_runtest_call
return (yield)
^^^^^
File "/Users/runner/miniconda3/envs/test/lib/python3.12/site-packages/pluggy/_callers.py", line 167, in _multicall
teardown.throw(outcome._exception)
File "/Users/runner/miniconda3/envs/test/lib/python3.12/site-packages/_pytest/skipping.py", line 257, in pytest_runtest_call
return (yield)
^^^^^
File "/Users/runner/miniconda3/envs/test/lib/python3.12/site-packages/pluggy/_callers.py", line 103, in _multicall
res = hook_impl.function(*args)
^^^^^^^^^^^^^^^^^^^^^^^^^
File "/Users/runner/miniconda3/envs/test/lib/python3.12/site-packages/_pytest/runner.py", line 183, in pytest_runtest_call
raise e
File "/Users/runner/miniconda3/envs/test/lib/python3.12/site-packages/_pytest/runner.py", line 173, in pytest_runtest_call
item.runtest()
File "/Users/runner/miniconda3/envs/test/lib/python3.12/site-packages/_pytest/python.py", line 1632, in runtest
self.ihook.pytest_pyfunc_call(pyfuncitem=self)
File "/Users/runner/miniconda3/envs/test/lib/python3.12/site-packages/pluggy/_hooks.py", line 513, in __call__
return self._hookexec(self.name, self._hookimpls.copy(), kwargs, firstresult)
^^^^^^^^^^^^^^^^^^^^^^^^^^^^^^^^^^^^^^^^^^^^^^^^^^^^^^^^^^^^^^^^^^^^^^
File "/Users/runner/miniconda3/envs/test/lib/python3.12/site-packages/pluggy/_manager.py", line 120, in _hookexec
return self._inner_hookexec(hook_name, methods, kwargs, firstresult)
^^^^^^^^^^^^^^^^^^^^^^^^^^^^^^^^^^^^^^^^^^^^^^^^^^^^^^^^^^^^^
File "/Users/runner/miniconda3/envs/test/lib/python3.12/site-packages/pluggy/_callers.py", line 139, in _multicall
raise exception.with_traceback(exception.__traceback__)
File "/Users/runner/miniconda3/envs/test/lib/python3.12/site-packages/pluggy/_callers.py", line 103, in _multicall
res = hook_impl.function(*args)
^^^^^^^^^^^^^^^^^^^^^^^^^
File "/Users/runner/miniconda3/envs/test/lib/python3.12/site-packages/_pytest/python.py", line 162, in pytest_pyfunc_call
result = testfunction(**testargs)
^^^^^^^^^^^^^^^^^^^^^^^^
File "/Users/runner/miniconda3/envs/test/lib/python3.12/site-packages/obspy/clients/fdsn/tests/test_client.py", line 766, in test_iris_example_queries_dataselect_discover_services_false
got = client.get_waveforms(*query)
^^^^^^^^^^^^^^^^^^^^^^^^^^^^
File "/Users/runner/miniconda3/envs/test/lib/python3.12/site-packages/obspy/clients/fdsn/client.py", line 879, in get_waveforms
data_stream = self._download(url, use_gzip=False)
^^^^^^^^^^^^^^^^^^^^^^^^^^^^^^^^^^^
File "/Users/runner/miniconda3/envs/test/lib/python3.12/site-packages/obspy/clients/fdsn/client.py", line 1493, in _download
raise_on_error(code, data)
File "/Users/runner/miniconda3/envs/test/lib/python3.12/site-packages/obspy/clients/fdsn/client.py", line 1868, in raise_on_error
raise FDSNInternalServerException("Service responds: Internal server "
obspy.clients.fdsn.header.FDSNInternalServerException: Service responds: Internal server error
HTTP Status code: 500
Detailed response of server:
Error 500: Error calling internal metadata service, code 404 [<!doctype html>
<html lang="en">
<head>
<title>
NSF SAGE:
404 Page Not Found Error
</title>
<meta name="keywords" content="seismology, seismological data,
earthquakes, iris dmc" />
<!-- Forces IE to render in 'latest' compatible mode -->
<meta http-equiv="X-UA-Compatible" content="IE=Edge"/>
<meta charset="utf-8" />
<meta name="viewport" content="width=device-width, initial-scale=1" />
<link rel="stylesheet" media="all" type="text/css" href="/static/css/iris.css" />
<link rel="stylesheet" media="print" type="text/css" href="/static/css/print.css" />
<link rel="shortcut icon" href="/static/img/favicon.ico" />
<script type="text/javascript" src="//ajax.googleapis.com/ajax/libs/jquery/1.11.1/jquery.js"></script>
<script type="text/javascript" src="//netdna.bootstrapcdn.com/bootstrap/3.4.1/js/bootstrap.min.js"></script>
<!--
<script type="text/javascript" src="//ajax.googleapis.com/ajax/libs/jqueryui/1.8.23/jquery-ui.min.js"></script>
<script type="text/javascript" src="/static/libs/megamenu/megamenu_plugins.js"></script>
<script type="text/javascript" src="/static/libs/megamenu/megamenu.min.js"></script>
-->
<!-- Global site tag (gtag.js) - Google Analytics -->
<script async src="https://www.googletagmanager.com/gtag/js?id=UA-1860730-1"></script>
<script>
window.dataLayer = window.dataLayer || [];
function gtag(){dataLayer.push(arguments);}
gtag('js', new Date());
gtag('config', 'UA-1860730-1');
</script>
<link rel="stylesheet" type="text/css" href="/static/libs/qtip2/2.1.1/jquery.qtip.css" />
<script type="text/javascript" src="/static/libs/qtip2/2.1.1/jquery.qtip.js"></script>
<script>
$(function() {
/* Automatically set up popup help blocks like:
* <div class="popup-help">
* <span class="glyphicon glyphicon-question-sign"> </span>
* <div>
* Content to show in the popup.
* </div>
* </div>
* Hovering over the icon shows the content in a popup.
*/
$(".popup-help").each(function() {
var content = $(this).children('div').detach();
var popupOnClick = $(this).hasClass('popup-on-click');
// Attach to the first element
$(this).children().first().qtip({
content: { text: content },
style: { classes: 'qtip-bootstrap' },
hide: {
delay: 100,
fixed: true
},
show: {
event: popupOnClick ? 'click' : 'mouseenter'
},
position: {
viewport: $(window)
},
});
});
});
</script>
</head>
<body>
<div class="container blur">
<div id="breadcrumbs">
<ul class="breadcrumbs">
<li>
<a href="/">Web Services</a>
</li>
</ul>
</div>
<div id="page-content">
<h1>
404 Page Not Found Error
</h1>
<div id="content">
<p>We are sorry, but the page you are requesting does not exist.</p>
<p>Please check the URL path you are requested and try again.</p>
<p>If you believe the error to be ours, please
<a href="//www.iris.edu/hq/contact">contact</a>
us.</p>
</div>
</div>
</div>
</body>
</html>
]
More Details:
handler exited, code: 1 reason: Internal Server Error
Request:
http://service.iris.edu/fdsnws/dataselect/1/query?starttime=2010-02-27T06%3A30%3A00.000000&endtime=2010-02-27T06%3A40%3A00.000000&network=IU&station=ANMO&location=00&channel=BHZ
Request Submitted:
2024/06/05 10:06:23 UTC
Service version:
Service: fdsnws-dataselect version: 1.1.9
Traceback (most recent call last):
File "/Users/runner/miniconda3/envs/test/lib/python3.12/site-packages/_pytest/runner.py", line 341, in from_call
result: Optional[TResult] = func()
^^^^^^
File "/Users/runner/miniconda3/envs/test/lib/python3.12/site-packages/_pytest/runner.py", line 241, in <lambda>
lambda: runtest_hook(item=item, **kwds), when=when, reraise=reraise
^^^^^^^^^^^^^^^^^^^^^^^^^^^^^^^
File "/Users/runner/miniconda3/envs/test/lib/python3.12/site-packages/pluggy/_hooks.py", line 513, in __call__
return self._hookexec(self.name, self._hookimpls.copy(), kwargs, firstresult)
^^^^^^^^^^^^^^^^^^^^^^^^^^^^^^^^^^^^^^^^^^^^^^^^^^^^^^^^^^^^^^^^^^^^^^
File "/Users/runner/miniconda3/envs/test/lib/python3.12/site-packages/pluggy/_manager.py", line 120, in _hookexec
return self._inner_hookexec(hook_name, methods, kwargs, firstresult)
^^^^^^^^^^^^^^^^^^^^^^^^^^^^^^^^^^^^^^^^^^^^^^^^^^^^^^^^^^^^^
File "/Users/runner/miniconda3/envs/test/lib/python3.12/site-packages/pluggy/_callers.py", line 182, in _multicall
return outcome.get_result()
^^^^^^^^^^^^^^^^^^^^
File "/Users/runner/miniconda3/envs/test/lib/python3.12/site-packages/pluggy/_result.py", line 100, in get_result
raise exc.with_traceback(exc.__traceback__)
File "/Users/runner/miniconda3/envs/test/lib/python3.12/site-packages/pluggy/_callers.py", line 167, in _multicall
teardown.throw(outcome._exception)
File "/Users/runner/miniconda3/envs/test/lib/python3.12/site-packages/_pytest/threadexception.py", line 87, in pytest_runtest_call
yield from thread_exception_runtest_hook()
File "/Users/runner/miniconda3/envs/test/lib/python3.12/site-packages/_pytest/threadexception.py", line 63, in thread_exception_runtest_hook
yield
File "/Users/runner/miniconda3/envs/test/lib/python3.12/site-packages/pluggy/_callers.py", line 167, in _multicall
teardown.throw(outcome._exception)
File "/Users/runner/miniconda3/envs/test/lib/python3.12/site-packages/_pytest/unraisableexception.py", line 90, in pytest_runtest_call
yield from unraisable_exception_runtest_hook()
File "/Users/runner/miniconda3/envs/test/lib/python3.12/site-packages/_pytest/unraisableexception.py", line 65, in unraisable_exception_runtest_hook
yield
File "/Users/runner/miniconda3/envs/test/lib/python3.12/site-packages/pluggy/_callers.py", line 167, in _multicall
teardown.throw(outcome._exception)
File "/Users/runner/miniconda3/envs/test/lib/python3.12/site-packages/_pytest/logging.py", line 850, in pytest_runtest_call
yield from self._runtest_for(item, "call")
File "/Users/runner/miniconda3/envs/test/lib/python3.12/site-packages/_pytest/logging.py", line 833, in _runtest_for
yield
File "/Users/runner/miniconda3/envs/test/lib/python3.12/site-packages/pluggy/_callers.py", line 167, in _multicall
teardown.throw(outcome._exception)
File "/Users/runner/miniconda3/envs/test/lib/python3.12/site-packages/_pytest/capture.py", line 878, in pytest_runtest_call
return (yield)
^^^^^
File "/Users/runner/miniconda3/envs/test/lib/python3.12/site-packages/pluggy/_callers.py", line 167, in _multicall
teardown.throw(outcome._exception)
File "/Users/runner/miniconda3/envs/test/lib/python3.12/site-packages/_pytest/skipping.py", line 257, in pytest_runtest_call
return (yield)
^^^^^
File "/Users/runner/miniconda3/envs/test/lib/python3.12/site-packages/pluggy/_callers.py", line 103, in _multicall
res = hook_impl.function(*args)
^^^^^^^^^^^^^^^^^^^^^^^^^
File "/Users/runner/miniconda3/envs/test/lib/python3.12/site-packages/_pytest/runner.py", line 183, in pytest_runtest_call
raise e
File "/Users/runner/miniconda3/envs/test/lib/python3.12/site-packages/_pytest/runner.py", line 173, in pytest_runtest_call
item.runtest()
File "/Users/runner/miniconda3/envs/test/lib/python3.12/site-packages/_pytest/python.py", line 1632, in runtest
self.ihook.pytest_pyfunc_call(pyfuncitem=self)
File "/Users/runner/miniconda3/envs/test/lib/python3.12/site-packages/pluggy/_hooks.py", line 513, in __call__
return self._hookexec(self.name, self._hookimpls.copy(), kwargs, firstresult)
^^^^^^^^^^^^^^^^^^^^^^^^^^^^^^^^^^^^^^^^^^^^^^^^^^^^^^^^^^^^^^^^^^^^^^
File "/Users/runner/miniconda3/envs/test/lib/python3.12/site-packages/pluggy/_manager.py", line 120, in _hookexec
return self._inner_hookexec(hook_name, methods, kwargs, firstresult)
^^^^^^^^^^^^^^^^^^^^^^^^^^^^^^^^^^^^^^^^^^^^^^^^^^^^^^^^^^^^^
File "/Users/runner/miniconda3/envs/test/lib/python3.12/site-packages/pluggy/_callers.py", line 139, in _multicall
raise exception.with_traceback(exception.__traceback__)
File "/Users/runner/miniconda3/envs/test/lib/python3.12/site-packages/pluggy/_callers.py", line 103, in _multicall
res = hook_impl.function(*args)
^^^^^^^^^^^^^^^^^^^^^^^^^
File "/Users/runner/miniconda3/envs/test/lib/python3.12/site-packages/_pytest/python.py", line 162, in pytest_pyfunc_call
result = testfunction(**testargs)
^^^^^^^^^^^^^^^^^^^^^^^^
File "/Users/runner/miniconda3/envs/test/lib/python3.12/site-packages/obspy/clients/fdsn/tests/test_client.py", line 792, in test_conflicting_params
self.client.get_stations(network="IU", net="IU")
File "/Users/runner/miniconda3/envs/test/lib/python3.12/site-packages/obspy/clients/fdsn/client.py", line 747, in get_stations
raise ValueError(msg)
ValueError: The current client does not have a station service.
Traceback (most recent call last):
File "/Users/runner/miniconda3/envs/test/lib/python3.12/site-packages/_pytest/runner.py", line 341, in from_call
result: Optional[TResult] = func()
^^^^^^
File "/Users/runner/miniconda3/envs/test/lib/python3.12/site-packages/_pytest/runner.py", line 241, in <lambda>
lambda: runtest_hook(item=item, **kwds), when=when, reraise=reraise
^^^^^^^^^^^^^^^^^^^^^^^^^^^^^^^
File "/Users/runner/miniconda3/envs/test/lib/python3.12/site-packages/pluggy/_hooks.py", line 513, in __call__
return self._hookexec(self.name, self._hookimpls.copy(), kwargs, firstresult)
^^^^^^^^^^^^^^^^^^^^^^^^^^^^^^^^^^^^^^^^^^^^^^^^^^^^^^^^^^^^^^^^^^^^^^
File "/Users/runner/miniconda3/envs/test/lib/python3.12/site-packages/pluggy/_manager.py", line 120, in _hookexec
return self._inner_hookexec(hook_name, methods, kwargs, firstresult)
^^^^^^^^^^^^^^^^^^^^^^^^^^^^^^^^^^^^^^^^^^^^^^^^^^^^^^^^^^^^^
File "/Users/runner/miniconda3/envs/test/lib/python3.12/site-packages/pluggy/_callers.py", line 182, in _multicall
return outcome.get_result()
^^^^^^^^^^^^^^^^^^^^
File "/Users/runner/miniconda3/envs/test/lib/python3.12/site-packages/pluggy/_result.py", line 100, in get_result
raise exc.with_traceback(exc.__traceback__)
File "/Users/runner/miniconda3/envs/test/lib/python3.12/site-packages/pluggy/_callers.py", line 167, in _multicall
teardown.throw(outcome._exception)
File "/Users/runner/miniconda3/envs/test/lib/python3.12/site-packages/_pytest/threadexception.py", line 87, in pytest_runtest_call
yield from thread_exception_runtest_hook()
File "/Users/runner/miniconda3/envs/test/lib/python3.12/site-packages/_pytest/threadexception.py", line 63, in thread_exception_runtest_hook
yield
File "/Users/runner/miniconda3/envs/test/lib/python3.12/site-packages/pluggy/_callers.py", line 167, in _multicall
teardown.throw(outcome._exception)
File "/Users/runner/miniconda3/envs/test/lib/python3.12/site-packages/_pytest/unraisableexception.py", line 90, in pytest_runtest_call
yield from unraisable_exception_runtest_hook()
File "/Users/runner/miniconda3/envs/test/lib/python3.12/site-packages/_pytest/unraisableexception.py", line 65, in unraisable_exception_runtest_hook
yield
File "/Users/runner/miniconda3/envs/test/lib/python3.12/site-packages/pluggy/_callers.py", line 167, in _multicall
teardown.throw(outcome._exception)
File "/Users/runner/miniconda3/envs/test/lib/python3.12/site-packages/_pytest/logging.py", line 850, in pytest_runtest_call
yield from self._runtest_for(item, "call")
File "/Users/runner/miniconda3/envs/test/lib/python3.12/site-packages/_pytest/logging.py", line 833, in _runtest_for
yield
File "/Users/runner/miniconda3/envs/test/lib/python3.12/site-packages/pluggy/_callers.py", line 167, in _multicall
teardown.throw(outcome._exception)
File "/Users/runner/miniconda3/envs/test/lib/python3.12/site-packages/_pytest/capture.py", line 878, in pytest_runtest_call
return (yield)
^^^^^
File "/Users/runner/miniconda3/envs/test/lib/python3.12/site-packages/pluggy/_callers.py", line 167, in _multicall
teardown.throw(outcome._exception)
File "/Users/runner/miniconda3/envs/test/lib/python3.12/site-packages/_pytest/skipping.py", line 257, in pytest_runtest_call
return (yield)
^^^^^
File "/Users/runner/miniconda3/envs/test/lib/python3.12/site-packages/pluggy/_callers.py", line 103, in _multicall
res = hook_impl.function(*args)
^^^^^^^^^^^^^^^^^^^^^^^^^
File "/Users/runner/miniconda3/envs/test/lib/python3.12/site-packages/_pytest/runner.py", line 183, in pytest_runtest_call
raise e
File "/Users/runner/miniconda3/envs/test/lib/python3.12/site-packages/_pytest/runner.py", line 173, in pytest_runtest_call
item.runtest()
File "/Users/runner/miniconda3/envs/test/lib/python3.12/site-packages/_pytest/python.py", line 1632, in runtest
self.ihook.pytest_pyfunc_call(pyfuncitem=self)
File "/Users/runner/miniconda3/envs/test/lib/python3.12/site-packages/pluggy/_hooks.py", line 513, in __call__
return self._hookexec(self.name, self._hookimpls.copy(), kwargs, firstresult)
^^^^^^^^^^^^^^^^^^^^^^^^^^^^^^^^^^^^^^^^^^^^^^^^^^^^^^^^^^^^^^^^^^^^^^
File "/Users/runner/miniconda3/envs/test/lib/python3.12/site-packages/pluggy/_manager.py", line 120, in _hookexec
return self._inner_hookexec(hook_name, methods, kwargs, firstresult)
^^^^^^^^^^^^^^^^^^^^^^^^^^^^^^^^^^^^^^^^^^^^^^^^^^^^^^^^^^^^^
File "/Users/runner/miniconda3/envs/test/lib/python3.12/site-packages/pluggy/_callers.py", line 139, in _multicall
raise exception.with_traceback(exception.__traceback__)
File "/Users/runner/miniconda3/envs/test/lib/python3.12/site-packages/pluggy/_callers.py", line 103, in _multicall
res = hook_impl.function(*args)
^^^^^^^^^^^^^^^^^^^^^^^^^
File "/Users/runner/miniconda3/envs/test/lib/python3.12/site-packages/_pytest/python.py", line 162, in pytest_pyfunc_call
result = testfunction(**testargs)
^^^^^^^^^^^^^^^^^^^^^^^^
File "/Users/runner/miniconda3/envs/test/lib/python3.12/site-packages/obspy/clients/fdsn/tests/test_client.py", line 830, in test_help_function_with_iris
client.help("station")
File "/Users/runner/miniconda3/envs/test/lib/python3.12/site-packages/obspy/clients/fdsn/client.py", line 1371, in help
raise ValueError(msg)
ValueError: Service 'station' not available for current client.
Traceback (most recent call last):
File "/Users/runner/miniconda3/envs/test/lib/python3.12/site-packages/_pytest/runner.py", line 341, in from_call
result: Optional[TResult] = func()
^^^^^^
File "/Users/runner/miniconda3/envs/test/lib/python3.12/site-packages/_pytest/runner.py", line 241, in <lambda>
lambda: runtest_hook(item=item, **kwds), when=when, reraise=reraise
^^^^^^^^^^^^^^^^^^^^^^^^^^^^^^^
File "/Users/runner/miniconda3/envs/test/lib/python3.12/site-packages/pluggy/_hooks.py", line 513, in __call__
return self._hookexec(self.name, self._hookimpls.copy(), kwargs, firstresult)
^^^^^^^^^^^^^^^^^^^^^^^^^^^^^^^^^^^^^^^^^^^^^^^^^^^^^^^^^^^^^^^^^^^^^^
File "/Users/runner/miniconda3/envs/test/lib/python3.12/site-packages/pluggy/_manager.py", line 120, in _hookexec
return self._inner_hookexec(hook_name, methods, kwargs, firstresult)
^^^^^^^^^^^^^^^^^^^^^^^^^^^^^^^^^^^^^^^^^^^^^^^^^^^^^^^^^^^^^
File "/Users/runner/miniconda3/envs/test/lib/python3.12/site-packages/pluggy/_callers.py", line 182, in _multicall
return outcome.get_result()
^^^^^^^^^^^^^^^^^^^^
File "/Users/runner/miniconda3/envs/test/lib/python3.12/site-packages/pluggy/_result.py", line 100, in get_result
raise exc.with_traceback(exc.__traceback__)
File "/Users/runner/miniconda3/envs/test/lib/python3.12/site-packages/pluggy/_callers.py", line 167, in _multicall
teardown.throw(outcome._exception)
File "/Users/runner/miniconda3/envs/test/lib/python3.12/site-packages/_pytest/threadexception.py", line 87, in pytest_runtest_call
yield from thread_exception_runtest_hook()
File "/Users/runner/miniconda3/envs/test/lib/python3.12/site-packages/_pytest/threadexception.py", line 63, in thread_exception_runtest_hook
yield
File "/Users/runner/miniconda3/envs/test/lib/python3.12/site-packages/pluggy/_callers.py", line 167, in _multicall
teardown.throw(outcome._exception)
File "/Users/runner/miniconda3/envs/test/lib/python3.12/site-packages/_pytest/unraisableexception.py", line 90, in pytest_runtest_call
yield from unraisable_exception_runtest_hook()
File "/Users/runner/miniconda3/envs/test/lib/python3.12/site-packages/_pytest/unraisableexception.py", line 65, in unraisable_exception_runtest_hook
yield
File "/Users/runner/miniconda3/envs/test/lib/python3.12/site-packages/pluggy/_callers.py", line 167, in _multicall
teardown.throw(outcome._exception)
File "/Users/runner/miniconda3/envs/test/lib/python3.12/site-packages/_pytest/logging.py", line 850, in pytest_runtest_call
yield from self._runtest_for(item, "call")
File "/Users/runner/miniconda3/envs/test/lib/python3.12/site-packages/_pytest/logging.py", line 833, in _runtest_for
yield
File "/Users/runner/miniconda3/envs/test/lib/python3.12/site-packages/pluggy/_callers.py", line 167, in _multicall
teardown.throw(outcome._exception)
File "/Users/runner/miniconda3/envs/test/lib/python3.12/site-packages/_pytest/capture.py", line 878, in pytest_runtest_call
return (yield)
^^^^^
File "/Users/runner/miniconda3/envs/test/lib/python3.12/site-packages/pluggy/_callers.py", line 167, in _multicall
teardown.throw(outcome._exception)
File "/Users/runner/miniconda3/envs/test/lib/python3.12/site-packages/_pytest/skipping.py", line 257, in pytest_runtest_call
return (yield)
^^^^^
File "/Users/runner/miniconda3/envs/test/lib/python3.12/site-packages/pluggy/_callers.py", line 103, in _multicall
res = hook_impl.function(*args)
^^^^^^^^^^^^^^^^^^^^^^^^^
File "/Users/runner/miniconda3/envs/test/lib/python3.12/site-packages/_pytest/runner.py", line 183, in pytest_runtest_call
raise e
File "/Users/runner/miniconda3/envs/test/lib/python3.12/site-packages/_pytest/runner.py", line 173, in pytest_runtest_call
item.runtest()
File "/Users/runner/miniconda3/envs/test/lib/python3.12/site-packages/_pytest/python.py", line 1632, in runtest
self.ihook.pytest_pyfunc_call(pyfuncitem=self)
File "/Users/runner/miniconda3/envs/test/lib/python3.12/site-packages/pluggy/_hooks.py", line 513, in __call__
return self._hookexec(self.name, self._hookimpls.copy(), kwargs, firstresult)
^^^^^^^^^^^^^^^^^^^^^^^^^^^^^^^^^^^^^^^^^^^^^^^^^^^^^^^^^^^^^^^^^^^^^^
File "/Users/runner/miniconda3/envs/test/lib/python3.12/site-packages/pluggy/_manager.py", line 120, in _hookexec
return self._inner_hookexec(hook_name, methods, kwargs, firstresult)
^^^^^^^^^^^^^^^^^^^^^^^^^^^^^^^^^^^^^^^^^^^^^^^^^^^^^^^^^^^^^
File "/Users/runner/miniconda3/envs/test/lib/python3.12/site-packages/pluggy/_callers.py", line 139, in _multicall
raise exception.with_traceback(exception.__traceback__)
File "/Users/runner/miniconda3/envs/test/lib/python3.12/site-packages/pluggy/_callers.py", line 103, in _multicall
res = hook_impl.function(*args)
^^^^^^^^^^^^^^^^^^^^^^^^^
File "/Users/runner/miniconda3/envs/test/lib/python3.12/site-packages/_pytest/python.py", line 162, in pytest_pyfunc_call
result = testfunction(**testargs)
^^^^^^^^^^^^^^^^^^^^^^^^
File "/Users/runner/miniconda3/envs/test/lib/python3.12/site-packages/obspy/clients/fdsn/tests/test_client.py", line 874, in test_str_method
assert got == expected, failmsg(got, expected)
AssertionError:
Got:
['FDSN Webservice Client (base url: http://service.iris.edu)', "Available Services: 'dataselect' (vX.X.X) 'event' (vX.X.X) 'available_event_catalogs' 'available_event_contributors'", '', "Use e.g. client.help('dataselect') for the", 'parameter description of the individual services', 'or client.help() for parameter description of', 'all webservices.']
Expected:
['FDSN Webservice Client (base url: http://service.iris.edu)', "Available Services: 'dataselect' (vX.X.X) 'event' (vX.X.X) 'station' (vX.X.X) 'available_event_catalogs' 'available_event_contributors'", '', "Use e.g. client.help('dataselect') for the", 'parameter description of the individual services', 'or client.help() for parameter description of', 'all webservices.']
assert ['FDSN Webser...tion of', ...] == ['FDSN Webser...tion of', ...]
At index 1 diff: "Available Services: 'dataselect' (vX.X.X) 'event' (vX.X.X) 'available_event_catalogs' 'available_event_contributors'" != "Available Services: 'dataselect' (vX.X.X) 'event' (vX.X.X) 'station' (vX.X.X) 'available_event_catalogs' 'available_event_contributors'"
Full diff:
[
'FDSN Webservice Client (base url: http://service.iris.edu)',
- "Available Services: 'dataselect' (vX.X.X) 'event' (vX.X.X) 'station' "
? ----------
+ "Available Services: 'dataselect' (vX.X.X) 'event' (vX.X.X) "
- "(vX.X.X) 'available_event_catalogs' 'available_event_contributors'",
? ---------
+ "'available_event_catalogs' 'available_event_contributors'",
'',
"Use e.g. client.help('dataselect') for the",
'parameter description of the individual services',
'or client.help() for parameter description of',
'all webservices.',
]
Traceback (most recent call last):
File "/Users/runner/miniconda3/envs/test/lib/python3.12/site-packages/_pytest/runner.py", line 341, in from_call
result: Optional[TResult] = func()
^^^^^^
File "/Users/runner/miniconda3/envs/test/lib/python3.12/site-packages/_pytest/runner.py", line 241, in <lambda>
lambda: runtest_hook(item=item, **kwds), when=when, reraise=reraise
^^^^^^^^^^^^^^^^^^^^^^^^^^^^^^^
File "/Users/runner/miniconda3/envs/test/lib/python3.12/site-packages/pluggy/_hooks.py", line 513, in __call__
return self._hookexec(self.name, self._hookimpls.copy(), kwargs, firstresult)
^^^^^^^^^^^^^^^^^^^^^^^^^^^^^^^^^^^^^^^^^^^^^^^^^^^^^^^^^^^^^^^^^^^^^^
File "/Users/runner/miniconda3/envs/test/lib/python3.12/site-packages/pluggy/_manager.py", line 120, in _hookexec
return self._inner_hookexec(hook_name, methods, kwargs, firstresult)
^^^^^^^^^^^^^^^^^^^^^^^^^^^^^^^^^^^^^^^^^^^^^^^^^^^^^^^^^^^^^
File "/Users/runner/miniconda3/envs/test/lib/python3.12/site-packages/pluggy/_callers.py", line 182, in _multicall
return outcome.get_result()
^^^^^^^^^^^^^^^^^^^^
File "/Users/runner/miniconda3/envs/test/lib/python3.12/site-packages/pluggy/_result.py", line 100, in get_result
raise exc.with_traceback(exc.__traceback__)
File "/Users/runner/miniconda3/envs/test/lib/python3.12/site-packages/pluggy/_callers.py", line 167, in _multicall
teardown.throw(outcome._exception)
File "/Users/runner/miniconda3/envs/test/lib/python3.12/site-packages/_pytest/threadexception.py", line 87, in pytest_runtest_call
yield from thread_exception_runtest_hook()
File "/Users/runner/miniconda3/envs/test/lib/python3.12/site-packages/_pytest/threadexception.py", line 63, in thread_exception_runtest_hook
yield
File "/Users/runner/miniconda3/envs/test/lib/python3.12/site-packages/pluggy/_callers.py", line 167, in _multicall
teardown.throw(outcome._exception)
File "/Users/runner/miniconda3/envs/test/lib/python3.12/site-packages/_pytest/unraisableexception.py", line 90, in pytest_runtest_call
yield from unraisable_exception_runtest_hook()
File "/Users/runner/miniconda3/envs/test/lib/python3.12/site-packages/_pytest/unraisableexception.py", line 65, in unraisable_exception_runtest_hook
yield
File "/Users/runner/miniconda3/envs/test/lib/python3.12/site-packages/pluggy/_callers.py", line 167, in _multicall
teardown.throw(outcome._exception)
File "/Users/runner/miniconda3/envs/test/lib/python3.12/site-packages/_pytest/logging.py", line 850, in pytest_runtest_call
yield from self._runtest_for(item, "call")
File "/Users/runner/miniconda3/envs/test/lib/python3.12/site-packages/_pytest/logging.py", line 833, in _runtest_for
yield
File "/Users/runner/miniconda3/envs/test/lib/python3.12/site-packages/pluggy/_callers.py", line 167, in _multicall
teardown.throw(outcome._exception)
File "/Users/runner/miniconda3/envs/test/lib/python3.12/site-packages/_pytest/capture.py", line 878, in pytest_runtest_call
return (yield)
^^^^^
File "/Users/runner/miniconda3/envs/test/lib/python3.12/site-packages/pluggy/_callers.py", line 167, in _multicall
teardown.throw(outcome._exception)
File "/Users/runner/miniconda3/envs/test/lib/python3.12/site-packages/_pytest/skipping.py", line 257, in pytest_runtest_call
return (yield)
^^^^^
File "/Users/runner/miniconda3/envs/test/lib/python3.12/site-packages/pluggy/_callers.py", line 103, in _multicall
res = hook_impl.function(*args)
^^^^^^^^^^^^^^^^^^^^^^^^^
File "/Users/runner/miniconda3/envs/test/lib/python3.12/site-packages/_pytest/runner.py", line 183, in pytest_runtest_call
raise e
File "/Users/runner/miniconda3/envs/test/lib/python3.12/site-packages/_pytest/runner.py", line 173, in pytest_runtest_call
item.runtest()
File "/Users/runner/miniconda3/envs/test/lib/python3.12/site-packages/_pytest/python.py", line 1632, in runtest
self.ihook.pytest_pyfunc_call(pyfuncitem=self)
File "/Users/runner/miniconda3/envs/test/lib/python3.12/site-packages/pluggy/_hooks.py", line 513, in __call__
return self._hookexec(self.name, self._hookimpls.copy(), kwargs, firstresult)
^^^^^^^^^^^^^^^^^^^^^^^^^^^^^^^^^^^^^^^^^^^^^^^^^^^^^^^^^^^^^^^^^^^^^^
File "/Users/runner/miniconda3/envs/test/lib/python3.12/site-packages/pluggy/_manager.py", line 120, in _hookexec
return self._inner_hookexec(hook_name, methods, kwargs, firstresult)
^^^^^^^^^^^^^^^^^^^^^^^^^^^^^^^^^^^^^^^^^^^^^^^^^^^^^^^^^^^^^
File "/Users/runner/miniconda3/envs/test/lib/python3.12/site-packages/pluggy/_callers.py", line 139, in _multicall
raise exception.with_traceback(exception.__traceback__)
File "/Users/runner/miniconda3/envs/test/lib/python3.12/site-packages/pluggy/_callers.py", line 103, in _multicall
res = hook_impl.function(*args)
^^^^^^^^^^^^^^^^^^^^^^^^^
File "/Users/runner/miniconda3/envs/test/lib/python3.12/site-packages/_pytest/python.py", line 162, in pytest_pyfunc_call
result = testfunction(**testargs)
^^^^^^^^^^^^^^^^^^^^^^^^
File "/Users/runner/miniconda3/envs/test/lib/python3.12/site-packages/obspy/clients/fdsn/tests/test_client.py", line 900, in test_dataselect_bulk
got = client.get_waveforms_bulk(bulk, **params)
^^^^^^^^^^^^^^^^^^^^^^^^^^^^^^^^^^^^^^^^^
File "/Users/runner/miniconda3/envs/test/lib/python3.12/site-packages/obspy/clients/fdsn/client.py", line 1058, in get_waveforms_bulk
data_stream = self._download(
^^^^^^^^^^^^^^^
File "/Users/runner/miniconda3/envs/test/lib/python3.12/site-packages/obspy/clients/fdsn/client.py", line 1493, in _download
raise_on_error(code, data)
File "/Users/runner/miniconda3/envs/test/lib/python3.12/site-packages/obspy/clients/fdsn/client.py", line 1868, in raise_on_error
raise FDSNInternalServerException("Service responds: Internal server "
obspy.clients.fdsn.header.FDSNInternalServerException: Service responds: Internal server error
HTTP Status code: 500
Detailed response of server:
 Xmo6_q
."IӬsmAvhVl@Q
t-$ehwdY6#(
K)s	/\fDdLx)j
rA\ C)|?	@
X$<&.fC B'8np]LGr
o2
+1B4Jѐ'-
KvO
J$VGдy#@.u|W[TG P
z
K9HBDQ
J
,AH
]7m습.<+b}>.ᖑW0Bm&1
isڜ
"'!9	-x)r'5S6$R
ܒo	W	S
&.5
1
KO\4y.fGBR
k\kVAA]
FlfȧG† HQ97|^
~Gy
%
l>b7w%;o;
gz
uqZiɋ ̬=OSX( ?_'o{^& ň<+_ERF"S
#VW{i3|FyC	y4w 4fsʢ+Rj\25bl\4N3Ғmpii_pBC׹p)0_&+QݮWyZ}F/JJbHzݨd7 QbsDm{ڊ}(~riQLW+[y
[ 5=R@tEuHCY@1)`DhS#8
%L#qwږ1f<[EɪMʘ)Q6@3(EGvi
.n/9sEhe?bf]-i?~<T
5X$!~
!a4i]$"mM0{
Do`Dz[ 6A\H4{%c6okoF
LD
~2R6:Pgмj3b	[} !&|532@F
:kU<B4ޏЋ21iDWp8Ck6퇽ksvh^
l<\mgfh;̒R6{ۊPpgY3NTqm|;tQ'_Zw຺
1]1S<feұ
|}MQAӫw;TXu
v=.{abPh
nk7<?b縠.T.%ݻft*EK;&JT
œW9Bi̊iNjB
O	E]

ZGZWs+<DP(hogy)WXEl
ÒwԀ<(Un/0}rN19UI^ʿȯ9jHȉr
QK,Uz@qeo9	!" J?>ʖCjhva
,Ԏ)
!
>~8urRL_wRm@#t4v 
Traceback (most recent call last):
File "/Users/runner/miniconda3/envs/test/lib/python3.12/site-packages/_pytest/runner.py", line 341, in from_call
result: Optional[TResult] = func()
^^^^^^
File "/Users/runner/miniconda3/envs/test/lib/python3.12/site-packages/_pytest/runner.py", line 241, in <lambda>
lambda: runtest_hook(item=item, **kwds), when=when, reraise=reraise
^^^^^^^^^^^^^^^^^^^^^^^^^^^^^^^
File "/Users/runner/miniconda3/envs/test/lib/python3.12/site-packages/pluggy/_hooks.py", line 513, in __call__
return self._hookexec(self.name, self._hookimpls.copy(), kwargs, firstresult)
^^^^^^^^^^^^^^^^^^^^^^^^^^^^^^^^^^^^^^^^^^^^^^^^^^^^^^^^^^^^^^^^^^^^^^
File "/Users/runner/miniconda3/envs/test/lib/python3.12/site-packages/pluggy/_manager.py", line 120, in _hookexec
return self._inner_hookexec(hook_name, methods, kwargs, firstresult)
^^^^^^^^^^^^^^^^^^^^^^^^^^^^^^^^^^^^^^^^^^^^^^^^^^^^^^^^^^^^^
File "/Users/runner/miniconda3/envs/test/lib/python3.12/site-packages/pluggy/_callers.py", line 182, in _multicall
return outcome.get_result()
^^^^^^^^^^^^^^^^^^^^
File "/Users/runner/miniconda3/envs/test/lib/python3.12/site-packages/pluggy/_result.py", line 100, in get_result
raise exc.with_traceback(exc.__traceback__)
File "/Users/runner/miniconda3/envs/test/lib/python3.12/site-packages/pluggy/_callers.py", line 167, in _multicall
teardown.throw(outcome._exception)
File "/Users/runner/miniconda3/envs/test/lib/python3.12/site-packages/_pytest/threadexception.py", line 87, in pytest_runtest_call
yield from thread_exception_runtest_hook()
File "/Users/runner/miniconda3/envs/test/lib/python3.12/site-packages/_pytest/threadexception.py", line 63, in thread_exception_runtest_hook
yield
File "/Users/runner/miniconda3/envs/test/lib/python3.12/site-packages/pluggy/_callers.py", line 167, in _multicall
teardown.throw(outcome._exception)
File "/Users/runner/miniconda3/envs/test/lib/python3.12/site-packages/_pytest/unraisableexception.py", line 90, in pytest_runtest_call
yield from unraisable_exception_runtest_hook()
File "/Users/runner/miniconda3/envs/test/lib/python3.12/site-packages/_pytest/unraisableexception.py", line 65, in unraisable_exception_runtest_hook
yield
File "/Users/runner/miniconda3/envs/test/lib/python3.12/site-packages/pluggy/_callers.py", line 167, in _multicall
teardown.throw(outcome._exception)
File "/Users/runner/miniconda3/envs/test/lib/python3.12/site-packages/_pytest/logging.py", line 850, in pytest_runtest_call
yield from self._runtest_for(item, "call")
File "/Users/runner/miniconda3/envs/test/lib/python3.12/site-packages/_pytest/logging.py", line 833, in _runtest_for
yield
File "/Users/runner/miniconda3/envs/test/lib/python3.12/site-packages/pluggy/_callers.py", line 167, in _multicall
teardown.throw(outcome._exception)
File "/Users/runner/miniconda3/envs/test/lib/python3.12/site-packages/_pytest/capture.py", line 878, in pytest_runtest_call
return (yield)
^^^^^
File "/Users/runner/miniconda3/envs/test/lib/python3.12/site-packages/pluggy/_callers.py", line 167, in _multicall
teardown.throw(outcome._exception)
File "/Users/runner/miniconda3/envs/test/lib/python3.12/site-packages/_pytest/skipping.py", line 257, in pytest_runtest_call
return (yield)
^^^^^
File "/Users/runner/miniconda3/envs/test/lib/python3.12/site-packages/pluggy/_callers.py", line 103, in _multicall
res = hook_impl.function(*args)
^^^^^^^^^^^^^^^^^^^^^^^^^
File "/Users/runner/miniconda3/envs/test/lib/python3.12/site-packages/_pytest/runner.py", line 183, in pytest_runtest_call
raise e
File "/Users/runner/miniconda3/envs/test/lib/python3.12/site-packages/_pytest/runner.py", line 173, in pytest_runtest_call
item.runtest()
File "/Users/runner/miniconda3/envs/test/lib/python3.12/site-packages/_pytest/python.py", line 1632, in runtest
self.ihook.pytest_pyfunc_call(pyfuncitem=self)
File "/Users/runner/miniconda3/envs/test/lib/python3.12/site-packages/pluggy/_hooks.py", line 513, in __call__
return self._hookexec(self.name, self._hookimpls.copy(), kwargs, firstresult)
^^^^^^^^^^^^^^^^^^^^^^^^^^^^^^^^^^^^^^^^^^^^^^^^^^^^^^^^^^^^^^^^^^^^^^
File "/Users/runner/miniconda3/envs/test/lib/python3.12/site-packages/pluggy/_manager.py", line 120, in _hookexec
return self._inner_hookexec(hook_name, methods, kwargs, firstresult)
^^^^^^^^^^^^^^^^^^^^^^^^^^^^^^^^^^^^^^^^^^^^^^^^^^^^^^^^^^^^^
File "/Users/runner/miniconda3/envs/test/lib/python3.12/site-packages/pluggy/_callers.py", line 139, in _multicall
raise exception.with_traceback(exception.__traceback__)
File "/Users/runner/miniconda3/envs/test/lib/python3.12/site-packages/pluggy/_callers.py", line 103, in _multicall
res = hook_impl.function(*args)
^^^^^^^^^^^^^^^^^^^^^^^^^
File "/Users/runner/miniconda3/envs/test/lib/python3.12/site-packages/_pytest/python.py", line 162, in pytest_pyfunc_call
result = testfunction(**testargs)
^^^^^^^^^^^^^^^^^^^^^^^^
File "/Users/runner/miniconda3/envs/test/lib/python3.12/site-packages/obspy/clients/fdsn/tests/test_client.py", line 976, in test_station_bulk
inv = client.get_stations_bulk(bulk, level="station")
^^^^^^^^^^^^^^^^^^^^^^^^^^^^^^^^^^^^^^^^^^^^^^^
File "/Users/runner/miniconda3/envs/test/lib/python3.12/site-packages/obspy/clients/fdsn/client.py", line 1234, in get_stations_bulk
raise ValueError(msg)
ValueError: The current client does not have a station service.
Traceback (most recent call last):
File "/Users/runner/miniconda3/envs/test/lib/python3.12/site-packages/_pytest/runner.py", line 341, in from_call
result: Optional[TResult] = func()
^^^^^^
File "/Users/runner/miniconda3/envs/test/lib/python3.12/site-packages/_pytest/runner.py", line 241, in <lambda>
lambda: runtest_hook(item=item, **kwds), when=when, reraise=reraise
^^^^^^^^^^^^^^^^^^^^^^^^^^^^^^^
File "/Users/runner/miniconda3/envs/test/lib/python3.12/site-packages/pluggy/_hooks.py", line 513, in __call__
return self._hookexec(self.name, self._hookimpls.copy(), kwargs, firstresult)
^^^^^^^^^^^^^^^^^^^^^^^^^^^^^^^^^^^^^^^^^^^^^^^^^^^^^^^^^^^^^^^^^^^^^^
File "/Users/runner/miniconda3/envs/test/lib/python3.12/site-packages/pluggy/_manager.py", line 120, in _hookexec
return self._inner_hookexec(hook_name, methods, kwargs, firstresult)
^^^^^^^^^^^^^^^^^^^^^^^^^^^^^^^^^^^^^^^^^^^^^^^^^^^^^^^^^^^^^
File "/Users/runner/miniconda3/envs/test/lib/python3.12/site-packages/pluggy/_callers.py", line 182, in _multicall
return outcome.get_result()
^^^^^^^^^^^^^^^^^^^^
File "/Users/runner/miniconda3/envs/test/lib/python3.12/site-packages/pluggy/_result.py", line 100, in get_result
raise exc.with_traceback(exc.__traceback__)
File "/Users/runner/miniconda3/envs/test/lib/python3.12/site-packages/pluggy/_callers.py", line 167, in _multicall
teardown.throw(outcome._exception)
File "/Users/runner/miniconda3/envs/test/lib/python3.12/site-packages/_pytest/threadexception.py", line 87, in pytest_runtest_call
yield from thread_exception_runtest_hook()
File "/Users/runner/miniconda3/envs/test/lib/python3.12/site-packages/_pytest/threadexception.py", line 63, in thread_exception_runtest_hook
yield
File "/Users/runner/miniconda3/envs/test/lib/python3.12/site-packages/pluggy/_callers.py", line 167, in _multicall
teardown.throw(outcome._exception)
File "/Users/runner/miniconda3/envs/test/lib/python3.12/site-packages/_pytest/unraisableexception.py", line 90, in pytest_runtest_call
yield from unraisable_exception_runtest_hook()
File "/Users/runner/miniconda3/envs/test/lib/python3.12/site-packages/_pytest/unraisableexception.py", line 65, in unraisable_exception_runtest_hook
yield
File "/Users/runner/miniconda3/envs/test/lib/python3.12/site-packages/pluggy/_callers.py", line 167, in _multicall
teardown.throw(outcome._exception)
File "/Users/runner/miniconda3/envs/test/lib/python3.12/site-packages/_pytest/logging.py", line 850, in pytest_runtest_call
yield from self._runtest_for(item, "call")
File "/Users/runner/miniconda3/envs/test/lib/python3.12/site-packages/_pytest/logging.py", line 833, in _runtest_for
yield
File "/Users/runner/miniconda3/envs/test/lib/python3.12/site-packages/pluggy/_callers.py", line 167, in _multicall
teardown.throw(outcome._exception)
File "/Users/runner/miniconda3/envs/test/lib/python3.12/site-packages/_pytest/capture.py", line 878, in pytest_runtest_call
return (yield)
^^^^^
File "/Users/runner/miniconda3/envs/test/lib/python3.12/site-packages/pluggy/_callers.py", line 167, in _multicall
teardown.throw(outcome._exception)
File "/Users/runner/miniconda3/envs/test/lib/python3.12/site-packages/_pytest/skipping.py", line 257, in pytest_runtest_call
return (yield)
^^^^^
File "/Users/runner/miniconda3/envs/test/lib/python3.12/site-packages/pluggy/_callers.py", line 103, in _multicall
res = hook_impl.function(*args)
^^^^^^^^^^^^^^^^^^^^^^^^^
File "/Users/runner/miniconda3/envs/test/lib/python3.12/site-packages/_pytest/runner.py", line 183, in pytest_runtest_call
raise e
File "/Users/runner/miniconda3/envs/test/lib/python3.12/site-packages/_pytest/runner.py", line 173, in pytest_runtest_call
item.runtest()
File "/Users/runner/miniconda3/envs/test/lib/python3.12/site-packages/_pytest/python.py", line 1632, in runtest
self.ihook.pytest_pyfunc_call(pyfuncitem=self)
File "/Users/runner/miniconda3/envs/test/lib/python3.12/site-packages/pluggy/_hooks.py", line 513, in __call__
return self._hookexec(self.name, self._hookimpls.copy(), kwargs, firstresult)
^^^^^^^^^^^^^^^^^^^^^^^^^^^^^^^^^^^^^^^^^^^^^^^^^^^^^^^^^^^^^^^^^^^^^^
File "/Users/runner/miniconda3/envs/test/lib/python3.12/site-packages/pluggy/_manager.py", line 120, in _hookexec
return self._inner_hookexec(hook_name, methods, kwargs, firstresult)
^^^^^^^^^^^^^^^^^^^^^^^^^^^^^^^^^^^^^^^^^^^^^^^^^^^^^^^^^^^^^
File "/Users/runner/miniconda3/envs/test/lib/python3.12/site-packages/pluggy/_callers.py", line 139, in _multicall
raise exception.with_traceback(exception.__traceback__)
File "/Users/runner/miniconda3/envs/test/lib/python3.12/site-packages/pluggy/_callers.py", line 103, in _multicall
res = hook_impl.function(*args)
^^^^^^^^^^^^^^^^^^^^^^^^^
File "/Users/runner/miniconda3/envs/test/lib/python3.12/site-packages/_pytest/python.py", line 162, in pytest_pyfunc_call
result = testfunction(**testargs)
^^^^^^^^^^^^^^^^^^^^^^^^
File "/Users/runner/miniconda3/envs/test/lib/python3.12/site-packages/obspy/clients/fdsn/tests/test_client.py", line 1022, in test_get_waveform_attach_response
st = client.get_waveforms_bulk(bulk, attach_response=True)
^^^^^^^^^^^^^^^^^^^^^^^^^^^^^^^^^^^^^^^^^^^^^^^^^^^^^
File "/Users/runner/miniconda3/envs/test/lib/python3.12/site-packages/obspy/clients/fdsn/client.py", line 1058, in get_waveforms_bulk
data_stream = self._download(
^^^^^^^^^^^^^^^
File "/Users/runner/miniconda3/envs/test/lib/python3.12/site-packages/obspy/clients/fdsn/client.py", line 1493, in _download
raise_on_error(code, data)
File "/Users/runner/miniconda3/envs/test/lib/python3.12/site-packages/obspy/clients/fdsn/client.py", line 1868, in raise_on_error
raise FDSNInternalServerException("Service responds: Internal server "
obspy.clients.fdsn.header.FDSNInternalServerException: Service responds: Internal server error
HTTP Status code: 500
Detailed response of server:
 Xmo6_q
."NӮumAvhWl@Q
t-$ehwdY6#(
K)s	φ1\fDdLx)j
rA\ O C|<
@
X̙$<.fC B'8n{
|:{96F
!5,Lt3'l(5FCS7^2T.M>ez**͓<Z@9GO moPBA.0##{d
.A 1
QeKF{+-!5tyެ+ֺ˩ܻh[F^]N/]\*R/sZ.\J:hγP&ej mI8!"LT1"!
>u)L\0K?u5i(b8Li&0]p1񏠅;
6\ǩ"&2R >8"؂/͐O-*msW.(Ώ<J<},sŮoKk6GWʝMX3;ZQ:̸?sEfVYgFvU,QWR/ӧWY/UbDM")#=I>F<~DO; t9e5)S5BYPdr3Zj	'?i6?pJcCo\Y|5~z¢-
[#\F%1}=
U2\kJ(mH׶WK]J?N
v9o(N٩p-E<`mVqCi ߚŞyhT:,
zƘ0OFA"npO`%	W;k3
mĢd]&A	e򔈨TU]EU\L
2OXw Xa|Ҝ9"YS
u13zִ]G
ćXr OiA,yGV~H0x̴j~.ܴ\]70"
\\àqp!Ҁ	ܳj[Qz7c&Ǎ{';rv?)
3h^S5z̈́>
h8<,
cвĝ!N03*
MR!iGENY}_4&t8x辵tܵ=;4/SYu6y
njͳjkr\d
I)mEsI,ӹrgZIL68vd>luoR;
	]	
R<aeұ
|}CQAӫw;TXu
vĬ&h
K1(4Uw
[sRP *]s:ۢa_
XU%aN׫;?aŬ@'PE5!F
w.
-#L-c"(X_st+jk6ohRa[fwj@׍zCRwv?L!9NWv
ê$Ckk/_iלxyML$jKB%
=q 2	js7ۜXK tZj-Pe+̡QQ5
41{Xj§r
Mj
3!KH2	|1JU 8N 
Traceback (most recent call last):
File "/Users/runner/miniconda3/envs/test/lib/python3.12/site-packages/_pytest/runner.py", line 341, in from_call
result: Optional[TResult] = func()
^^^^^^
File "/Users/runner/miniconda3/envs/test/lib/python3.12/site-packages/_pytest/runner.py", line 241, in <lambda>
lambda: runtest_hook(item=item, **kwds), when=when, reraise=reraise
^^^^^^^^^^^^^^^^^^^^^^^^^^^^^^^
File "/Users/runner/miniconda3/envs/test/lib/python3.12/site-packages/pluggy/_hooks.py", line 513, in __call__
return self._hookexec(self.name, self._hookimpls.copy(), kwargs, firstresult)
^^^^^^^^^^^^^^^^^^^^^^^^^^^^^^^^^^^^^^^^^^^^^^^^^^^^^^^^^^^^^^^^^^^^^^
File "/Users/runner/miniconda3/envs/test/lib/python3.12/site-packages/pluggy/_manager.py", line 120, in _hookexec
return self._inner_hookexec(hook_name, methods, kwargs, firstresult)
^^^^^^^^^^^^^^^^^^^^^^^^^^^^^^^^^^^^^^^^^^^^^^^^^^^^^^^^^^^^^
File "/Users/runner/miniconda3/envs/test/lib/python3.12/site-packages/pluggy/_callers.py", line 182, in _multicall
return outcome.get_result()
^^^^^^^^^^^^^^^^^^^^
File "/Users/runner/miniconda3/envs/test/lib/python3.12/site-packages/pluggy/_result.py", line 100, in get_result
raise exc.with_traceback(exc.__traceback__)
File "/Users/runner/miniconda3/envs/test/lib/python3.12/site-packages/pluggy/_callers.py", line 167, in _multicall
teardown.throw(outcome._exception)
File "/Users/runner/miniconda3/envs/test/lib/python3.12/site-packages/_pytest/threadexception.py", line 87, in pytest_runtest_call
yield from thread_exception_runtest_hook()
File "/Users/runner/miniconda3/envs/test/lib/python3.12/site-packages/_pytest/threadexception.py", line 63, in thread_exception_runtest_hook
yield
File "/Users/runner/miniconda3/envs/test/lib/python3.12/site-packages/pluggy/_callers.py", line 167, in _multicall
teardown.throw(outcome._exception)
File "/Users/runner/miniconda3/envs/test/lib/python3.12/site-packages/_pytest/unraisableexception.py", line 90, in pytest_runtest_call
yield from unraisable_exception_runtest_hook()
File "/Users/runner/miniconda3/envs/test/lib/python3.12/site-packages/_pytest/unraisableexception.py", line 65, in unraisable_exception_runtest_hook
yield
File "/Users/runner/miniconda3/envs/test/lib/python3.12/site-packages/pluggy/_callers.py", line 167, in _multicall
teardown.throw(outcome._exception)
File "/Users/runner/miniconda3/envs/test/lib/python3.12/site-packages/_pytest/logging.py", line 850, in pytest_runtest_call
yield from self._runtest_for(item, "call")
File "/Users/runner/miniconda3/envs/test/lib/python3.12/site-packages/_pytest/logging.py", line 833, in _runtest_for
yield
File "/Users/runner/miniconda3/envs/test/lib/python3.12/site-packages/pluggy/_callers.py", line 167, in _multicall
teardown.throw(outcome._exception)
File "/Users/runner/miniconda3/envs/test/lib/python3.12/site-packages/_pytest/capture.py", line 878, in pytest_runtest_call
return (yield)
^^^^^
File "/Users/runner/miniconda3/envs/test/lib/python3.12/site-packages/pluggy/_callers.py", line 167, in _multicall
teardown.throw(outcome._exception)
File "/Users/runner/miniconda3/envs/test/lib/python3.12/site-packages/_pytest/skipping.py", line 257, in pytest_runtest_call
return (yield)
^^^^^
File "/Users/runner/miniconda3/envs/test/lib/python3.12/site-packages/pluggy/_callers.py", line 103, in _multicall
res = hook_impl.function(*args)
^^^^^^^^^^^^^^^^^^^^^^^^^
File "/Users/runner/miniconda3/envs/test/lib/python3.12/site-packages/_pytest/runner.py", line 183, in pytest_runtest_call
raise e
File "/Users/runner/miniconda3/envs/test/lib/python3.12/site-packages/_pytest/runner.py", line 173, in pytest_runtest_call
item.runtest()
File "/Users/runner/miniconda3/envs/test/lib/python3.12/site-packages/_pytest/python.py", line 1632, in runtest
self.ihook.pytest_pyfunc_call(pyfuncitem=self)
File "/Users/runner/miniconda3/envs/test/lib/python3.12/site-packages/pluggy/_hooks.py", line 513, in __call__
return self._hookexec(self.name, self._hookimpls.copy(), kwargs, firstresult)
^^^^^^^^^^^^^^^^^^^^^^^^^^^^^^^^^^^^^^^^^^^^^^^^^^^^^^^^^^^^^^^^^^^^^^
File "/Users/runner/miniconda3/envs/test/lib/python3.12/site-packages/pluggy/_manager.py", line 120, in _hookexec
return self._inner_hookexec(hook_name, methods, kwargs, firstresult)
^^^^^^^^^^^^^^^^^^^^^^^^^^^^^^^^^^^^^^^^^^^^^^^^^^^^^^^^^^^^^
File "/Users/runner/miniconda3/envs/test/lib/python3.12/site-packages/pluggy/_callers.py", line 139, in _multicall
raise exception.with_traceback(exception.__traceback__)
File "/Users/runner/miniconda3/envs/test/lib/python3.12/site-packages/pluggy/_callers.py", line 103, in _multicall
res = hook_impl.function(*args)
^^^^^^^^^^^^^^^^^^^^^^^^^
File "/Users/runner/miniconda3/envs/test/lib/python3.12/site-packages/_pytest/python.py", line 162, in pytest_pyfunc_call
result = testfunction(**testargs)
^^^^^^^^^^^^^^^^^^^^^^^^
File "/Users/runner/miniconda3/envs/test/lib/python3.12/site-packages/obspy/clients/fdsn/tests/test_client.py", line 1189, in test_manually_deactivate_single_service
assert sorted(client.services.keys()) == ['dataselect', 'station']
AssertionError: assert ['dataselect'] == ['dataselect', 'station']
Right contains one more item: 'station'
Full diff:
[
'dataselect',
- 'station',
]
Traceback (most recent call last):
File "/Users/runner/miniconda3/envs/test/lib/python3.12/site-packages/_pytest/runner.py", line 341, in from_call
result: Optional[TResult] = func()
^^^^^^
File "/Users/runner/miniconda3/envs/test/lib/python3.12/site-packages/_pytest/runner.py", line 241, in <lambda>
lambda: runtest_hook(item=item, **kwds), when=when, reraise=reraise
^^^^^^^^^^^^^^^^^^^^^^^^^^^^^^^
File "/Users/runner/miniconda3/envs/test/lib/python3.12/site-packages/pluggy/_hooks.py", line 513, in __call__
return self._hookexec(self.name, self._hookimpls.copy(), kwargs, firstresult)
^^^^^^^^^^^^^^^^^^^^^^^^^^^^^^^^^^^^^^^^^^^^^^^^^^^^^^^^^^^^^^^^^^^^^^
File "/Users/runner/miniconda3/envs/test/lib/python3.12/site-packages/pluggy/_manager.py", line 120, in _hookexec
return self._inner_hookexec(hook_name, methods, kwargs, firstresult)
^^^^^^^^^^^^^^^^^^^^^^^^^^^^^^^^^^^^^^^^^^^^^^^^^^^^^^^^^^^^^
File "/Users/runner/miniconda3/envs/test/lib/python3.12/site-packages/pluggy/_callers.py", line 182, in _multicall
return outcome.get_result()
^^^^^^^^^^^^^^^^^^^^
File "/Users/runner/miniconda3/envs/test/lib/python3.12/site-packages/pluggy/_result.py", line 100, in get_result
raise exc.with_traceback(exc.__traceback__)
File "/Users/runner/miniconda3/envs/test/lib/python3.12/site-packages/pluggy/_callers.py", line 167, in _multicall
teardown.throw(outcome._exception)
File "/Users/runner/miniconda3/envs/test/lib/python3.12/site-packages/_pytest/threadexception.py", line 87, in pytest_runtest_call
yield from thread_exception_runtest_hook()
File "/Users/runner/miniconda3/envs/test/lib/python3.12/site-packages/_pytest/threadexception.py", line 63, in thread_exception_runtest_hook
yield
File "/Users/runner/miniconda3/envs/test/lib/python3.12/site-packages/pluggy/_callers.py", line 167, in _multicall
teardown.throw(outcome._exception)
File "/Users/runner/miniconda3/envs/test/lib/python3.12/site-packages/_pytest/unraisableexception.py", line 90, in pytest_runtest_call
yield from unraisable_exception_runtest_hook()
File "/Users/runner/miniconda3/envs/test/lib/python3.12/site-packages/_pytest/unraisableexception.py", line 65, in unraisable_exception_runtest_hook
yield
File "/Users/runner/miniconda3/envs/test/lib/python3.12/site-packages/pluggy/_callers.py", line 167, in _multicall
teardown.throw(outcome._exception)
File "/Users/runner/miniconda3/envs/test/lib/python3.12/site-packages/_pytest/logging.py", line 850, in pytest_runtest_call
yield from self._runtest_for(item, "call")
File "/Users/runner/miniconda3/envs/test/lib/python3.12/site-packages/_pytest/logging.py", line 833, in _runtest_for
yield
File "/Users/runner/miniconda3/envs/test/lib/python3.12/site-packages/pluggy/_callers.py", line 167, in _multicall
teardown.throw(outcome._exception)
File "/Users/runner/miniconda3/envs/test/lib/python3.12/site-packages/_pytest/capture.py", line 878, in pytest_runtest_call
return (yield)
^^^^^
File "/Users/runner/miniconda3/envs/test/lib/python3.12/site-packages/pluggy/_callers.py", line 167, in _multicall
teardown.throw(outcome._exception)
File "/Users/runner/miniconda3/envs/test/lib/python3.12/site-packages/_pytest/skipping.py", line 257, in pytest_runtest_call
return (yield)
^^^^^
File "/Users/runner/miniconda3/envs/test/lib/python3.12/site-packages/pluggy/_callers.py", line 103, in _multicall
res = hook_impl.function(*args)
^^^^^^^^^^^^^^^^^^^^^^^^^
File "/Users/runner/miniconda3/envs/test/lib/python3.12/site-packages/_pytest/runner.py", line 183, in pytest_runtest_call
raise e
File "/Users/runner/miniconda3/envs/test/lib/python3.12/site-packages/_pytest/runner.py", line 173, in pytest_runtest_call
item.runtest()
File "/Users/runner/miniconda3/envs/test/lib/python3.12/site-packages/_pytest/python.py", line 1632, in runtest
self.ihook.pytest_pyfunc_call(pyfuncitem=self)
File "/Users/runner/miniconda3/envs/test/lib/python3.12/site-packages/pluggy/_hooks.py", line 513, in __call__
return self._hookexec(self.name, self._hookimpls.copy(), kwargs, firstresult)
^^^^^^^^^^^^^^^^^^^^^^^^^^^^^^^^^^^^^^^^^^^^^^^^^^^^^^^^^^^^^^^^^^^^^^
File "/Users/runner/miniconda3/envs/test/lib/python3.12/site-packages/pluggy/_manager.py", line 120, in _hookexec
return self._inner_hookexec(hook_name, methods, kwargs, firstresult)
^^^^^^^^^^^^^^^^^^^^^^^^^^^^^^^^^^^^^^^^^^^^^^^^^^^^^^^^^^^^^
File "/Users/runner/miniconda3/envs/test/lib/python3.12/site-packages/pluggy/_callers.py", line 139, in _multicall
raise exception.with_traceback(exception.__traceback__)
File "/Users/runner/miniconda3/envs/test/lib/python3.12/site-packages/pluggy/_callers.py", line 103, in _multicall
res = hook_impl.function(*args)
^^^^^^^^^^^^^^^^^^^^^^^^^
File "/Users/runner/miniconda3/envs/test/lib/python3.12/site-packages/_pytest/python.py", line 162, in pytest_pyfunc_call
result = testfunction(**testargs)
^^^^^^^^^^^^^^^^^^^^^^^^
File "/Users/runner/miniconda3/envs/test/lib/python3.12/site-packages/obspy/clients/fdsn/tests/test_client.py", line 1286, in test_redirection
st = c.get_waveforms(
^^^^^^^^^^^^^^^^
File "/Users/runner/miniconda3/envs/test/lib/python3.12/site-packages/obspy/clients/fdsn/client.py", line 879, in get_waveforms
data_stream = self._download(url, use_gzip=False)
^^^^^^^^^^^^^^^^^^^^^^^^^^^^^^^^^^^
File "/Users/runner/miniconda3/envs/test/lib/python3.12/site-packages/obspy/clients/fdsn/client.py", line 1493, in _download
raise_on_error(code, data)
File "/Users/runner/miniconda3/envs/test/lib/python3.12/site-packages/obspy/clients/fdsn/client.py", line 1868, in raise_on_error
raise FDSNInternalServerException("Service responds: Internal server "
obspy.clients.fdsn.header.FDSNInternalServerException: Service responds: Internal server error
HTTP Status code: 500
Detailed response of server:
Error 500: Error calling internal metadata service, code 404 [<!doctype html>
<html lang="en">
<head>
<title>
NSF SAGE:
404 Page Not Found Error
</title>
<meta name="keywords" content="seismology, seismological data,
earthquakes, iris dmc" />
<!-- Forces IE to render in 'latest' compatible mode -->
<meta http-equiv="X-UA-Compatible" content="IE=Edge"/>
<meta charset="utf-8" />
<meta name="viewport" content="width=device-width, initial-scale=1" />
<link rel="stylesheet" media="all" type="text/css" href="/static/css/iris.css" />
<link rel="stylesheet" media="print" type="text/css" href="/static/css/print.css" />
<link rel="shortcut icon" href="/static/img/favicon.ico" />
<script type="text/javascript" src="//ajax.googleapis.com/ajax/libs/jquery/1.11.1/jquery.js"></script>
<script type="text/javascript" src="//netdna.bootstrapcdn.com/bootstrap/3.4.1/js/bootstrap.min.js"></script>
<!--
<script type="text/javascript" src="//ajax.googleapis.com/ajax/libs/jqueryui/1.8.23/jquery-ui.min.js"></script>
<script type="text/javascript" src="/static/libs/megamenu/megamenu_plugins.js"></script>
<script type="text/javascript" src="/static/libs/megamenu/megamenu.min.js"></script>
-->
<!-- Global site tag (gtag.js) - Google Analytics -->
<script async src="https://www.googletagmanager.com/gtag/js?id=UA-1860730-1"></script>
<script>
window.dataLayer = window.dataLayer || [];
function gtag(){dataLayer.push(arguments);}
gtag('js', new Date());
gtag('config', 'UA-1860730-1');
</script>
<link rel="stylesheet" type="text/css" href="/static/libs/qtip2/2.1.1/jquery.qtip.css" />
<script type="text/javascript" src="/static/libs/qtip2/2.1.1/jquery.qtip.js"></script>
<script>
$(function() {
/* Automatically set up popup help blocks like:
* <div class="popup-help">
* <span class="glyphicon glyphicon-question-sign"> </span>
* <div>
* Content to show in the popup.
* </div>
* </div>
* Hovering over the icon shows the content in a popup.
*/
$(".popup-help").each(function() {
var content = $(this).children('div').detach();
var popupOnClick = $(this).hasClass('popup-on-click');
// Attach to the first element
$(this).children().first().qtip({
content: { text: content },
style: { classes: 'qtip-bootstrap' },
hide: {
delay: 100,
fixed: true
},
show: {
event: popupOnClick ? 'click' : 'mouseenter'
},
position: {
viewport: $(window)
},
});
});
});
</script>
</head>
<body>
<div class="container blur">
<div id="breadcrumbs">
<ul class="breadcrumbs">
<li>
<a href="/">Web Services</a>
</li>
</ul>
</div>
<div id="page-content">
<h1>
404 Page Not Found Error
</h1>
<div id="content">
<p>We are sorry, but the page you are requesting does not exist.</p>
<p>Please check the URL path you are requested and try again.</p>
<p>If you believe the error to be ours, please
<a href="//www.iris.edu/hq/contact">contact</a>
us.</p>
</div>
</div>
</div>
</body>
</html>
]
More Details:
handler exited, code: 1 reason: Internal Server Error
Request:
http://service.iris.edu/fdsnws/dataselect/1/query?starttime=2010-02-27T06%3A30%3A00.000000&endtime=2010-02-27T06%3A30%3A01.000000&network=IU&station=ANMO&location=00&channel=BHZ
Request Submitted:
2024/06/05 10:06:40 UTC
Service version:
Service: fdsnws-dataselect version: 1.1.9
Traceback (most recent call last):
File "/Users/runner/miniconda3/envs/test/lib/python3.12/site-packages/_pytest/runner.py", line 341, in from_call
result: Optional[TResult] = func()
^^^^^^
File "/Users/runner/miniconda3/envs/test/lib/python3.12/site-packages/_pytest/runner.py", line 241, in <lambda>
lambda: runtest_hook(item=item, **kwds), when=when, reraise=reraise
^^^^^^^^^^^^^^^^^^^^^^^^^^^^^^^
File "/Users/runner/miniconda3/envs/test/lib/python3.12/site-packages/pluggy/_hooks.py", line 513, in __call__
return self._hookexec(self.name, self._hookimpls.copy(), kwargs, firstresult)
^^^^^^^^^^^^^^^^^^^^^^^^^^^^^^^^^^^^^^^^^^^^^^^^^^^^^^^^^^^^^^^^^^^^^^
File "/Users/runner/miniconda3/envs/test/lib/python3.12/site-packages/pluggy/_manager.py", line 120, in _hookexec
return self._inner_hookexec(hook_name, methods, kwargs, firstresult)
^^^^^^^^^^^^^^^^^^^^^^^^^^^^^^^^^^^^^^^^^^^^^^^^^^^^^^^^^^^^^
File "/Users/runner/miniconda3/envs/test/lib/python3.12/site-packages/pluggy/_callers.py", line 182, in _multicall
return outcome.get_result()
^^^^^^^^^^^^^^^^^^^^
File "/Users/runner/miniconda3/envs/test/lib/python3.12/site-packages/pluggy/_result.py", line 100, in get_result
raise exc.with_traceback(exc.__traceback__)
File "/Users/runner/miniconda3/envs/test/lib/python3.12/site-packages/pluggy/_callers.py", line 167, in _multicall
teardown.throw(outcome._exception)
File "/Users/runner/miniconda3/envs/test/lib/python3.12/site-packages/_pytest/threadexception.py", line 87, in pytest_runtest_call
yield from thread_exception_runtest_hook()
File "/Users/runner/miniconda3/envs/test/lib/python3.12/site-packages/_pytest/threadexception.py", line 63, in thread_exception_runtest_hook
yield
File "/Users/runner/miniconda3/envs/test/lib/python3.12/site-packages/pluggy/_callers.py", line 167, in _multicall
teardown.throw(outcome._exception)
File "/Users/runner/miniconda3/envs/test/lib/python3.12/site-packages/_pytest/unraisableexception.py", line 90, in pytest_runtest_call
yield from unraisable_exception_runtest_hook()
File "/Users/runner/miniconda3/envs/test/lib/python3.12/site-packages/_pytest/unraisableexception.py", line 65, in unraisable_exception_runtest_hook
yield
File "/Users/runner/miniconda3/envs/test/lib/python3.12/site-packages/pluggy/_callers.py", line 167, in _multicall
teardown.throw(outcome._exception)
File "/Users/runner/miniconda3/envs/test/lib/python3.12/site-packages/_pytest/logging.py", line 850, in pytest_runtest_call
yield from self._runtest_for(item, "call")
File "/Users/runner/miniconda3/envs/test/lib/python3.12/site-packages/_pytest/logging.py", line 833, in _runtest_for
yield
File "/Users/runner/miniconda3/envs/test/lib/python3.12/site-packages/pluggy/_callers.py", line 167, in _multicall
teardown.throw(outcome._exception)
File "/Users/runner/miniconda3/envs/test/lib/python3.12/site-packages/_pytest/capture.py", line 878, in pytest_runtest_call
return (yield)
^^^^^
File "/Users/runner/miniconda3/envs/test/lib/python3.12/site-packages/pluggy/_callers.py", line 167, in _multicall
teardown.throw(outcome._exception)
File "/Users/runner/miniconda3/envs/test/lib/python3.12/site-packages/_pytest/skipping.py", line 257, in pytest_runtest_call
return (yield)
^^^^^
File "/Users/runner/miniconda3/envs/test/lib/python3.12/site-packages/pluggy/_callers.py", line 103, in _multicall
res = hook_impl.function(*args)
^^^^^^^^^^^^^^^^^^^^^^^^^
File "/Users/runner/miniconda3/envs/test/lib/python3.12/site-packages/_pytest/runner.py", line 183, in pytest_runtest_call
raise e
File "/Users/runner/miniconda3/envs/test/lib/python3.12/site-packages/_pytest/runner.py", line 173, in pytest_runtest_call
item.runtest()
File "/Users/runner/miniconda3/envs/test/lib/python3.12/site-packages/_pytest/python.py", line 1632, in runtest
self.ihook.pytest_pyfunc_call(pyfuncitem=self)
File "/Users/runner/miniconda3/envs/test/lib/python3.12/site-packages/pluggy/_hooks.py", line 513, in __call__
return self._hookexec(self.name, self._hookimpls.copy(), kwargs, firstresult)
^^^^^^^^^^^^^^^^^^^^^^^^^^^^^^^^^^^^^^^^^^^^^^^^^^^^^^^^^^^^^^^^^^^^^^
File "/Users/runner/miniconda3/envs/test/lib/python3.12/site-packages/pluggy/_manager.py", line 120, in _hookexec
return self._inner_hookexec(hook_name, methods, kwargs, firstresult)
^^^^^^^^^^^^^^^^^^^^^^^^^^^^^^^^^^^^^^^^^^^^^^^^^^^^^^^^^^^^^
File "/Users/runner/miniconda3/envs/test/lib/python3.12/site-packages/pluggy/_callers.py", line 139, in _multicall
raise exception.with_traceback(exception.__traceback__)
File "/Users/runner/miniconda3/envs/test/lib/python3.12/site-packages/pluggy/_callers.py", line 103, in _multicall
res = hook_impl.function(*args)
^^^^^^^^^^^^^^^^^^^^^^^^^
File "/Users/runner/miniconda3/envs/test/lib/python3.12/site-packages/_pytest/python.py", line 162, in pytest_pyfunc_call
result = testfunction(**testargs)
^^^^^^^^^^^^^^^^^^^^^^^^
File "/Users/runner/miniconda3/envs/test/lib/python3.12/site-packages/obspy/clients/fdsn/tests/test_client.py", line 1355, in test_redirection_auth
st = c_auth.get_waveforms(
^^^^^^^^^^^^^^^^^^^^^
File "/Users/runner/miniconda3/envs/test/lib/python3.12/site-packages/obspy/clients/fdsn/client.py", line 879, in get_waveforms
data_stream = self._download(url, use_gzip=False)
^^^^^^^^^^^^^^^^^^^^^^^^^^^^^^^^^^^
File "/Users/runner/miniconda3/envs/test/lib/python3.12/site-packages/obspy/clients/fdsn/client.py", line 1493, in _download
raise_on_error(code, data)
File "/Users/runner/miniconda3/envs/test/lib/python3.12/site-packages/obspy/clients/fdsn/client.py", line 1868, in raise_on_error
raise FDSNInternalServerException("Service responds: Internal server "
obspy.clients.fdsn.header.FDSNInternalServerException: Service responds: Internal server error
HTTP Status code: 500
Detailed response of server:
Error 500: Error calling internal metadata service, code 404 [<!doctype html>
<html lang="en">
<head>
<title>
NSF SAGE:
404 Page Not Found Error
</title>
<meta name="keywords" content="seismology, seismological data,
earthquakes, iris dmc" />
<!-- Forces IE to render in 'latest' compatible mode -->
<meta http-equiv="X-UA-Compatible" content="IE=Edge"/>
<meta charset="utf-8" />
<meta name="viewport" content="width=device-width, initial-scale=1" />
<link rel="stylesheet" media="all" type="text/css" href="/static/css/iris.css" />
<link rel="stylesheet" media="print" type="text/css" href="/static/css/print.css" />
<link rel="shortcut icon" href="/static/img/favicon.ico" />
<script type="text/javascript" src="//ajax.googleapis.com/ajax/libs/jquery/1.11.1/jquery.js"></script>
<script type="text/javascript" src="//netdna.bootstrapcdn.com/bootstrap/3.4.1/js/bootstrap.min.js"></script>
<!--
<script type="text/javascript" src="//ajax.googleapis.com/ajax/libs/jqueryui/1.8.23/jquery-ui.min.js"></script>
<script type="text/javascript" src="/static/libs/megamenu/megamenu_plugins.js"></script>
<script type="text/javascript" src="/static/libs/megamenu/megamenu.min.js"></script>
-->
<!-- Global site tag (gtag.js) - Google Analytics -->
<script async src="https://www.googletagmanager.com/gtag/js?id=UA-1860730-1"></script>
<script>
window.dataLayer = window.dataLayer || [];
function gtag(){dataLayer.push(arguments);}
gtag('js', new Date());
gtag('config', 'UA-1860730-1');
</script>
<link rel="stylesheet" type="text/css" href="/static/libs/qtip2/2.1.1/jquery.qtip.css" />
<script type="text/javascript" src="/static/libs/qtip2/2.1.1/jquery.qtip.js"></script>
<script>
$(function() {
/* Automatically set up popup help blocks like:
* <div class="popup-help">
* <span class="glyphicon glyphicon-question-sign"> </span>
* <div>
* Content to show in the popup.
* </div>
* </div>
* Hovering over the icon shows the content in a popup.
*/
$(".popup-help").each(function() {
var content = $(this).children('div').detach();
var popupOnClick = $(this).hasClass('popup-on-click');
// Attach to the first element
$(this).children().first().qtip({
content: { text: content },
style: { classes: 'qtip-bootstrap' },
hide: {
delay: 100,
fixed: true
},
show: {
event: popupOnClick ? 'click' : 'mouseenter'
},
position: {
viewport: $(window)
},
});
});
});
</script>
</head>
<body>
<div class="container blur">
<div id="breadcrumbs">
<ul class="breadcrumbs">
<li>
<a href="/">Web Services</a>
</li>
</ul>
</div>
<div id="page-content">
<h1>
404 Page Not Found Error
</h1>
<div id="content">
<p>We are sorry, but the page you are requesting does not exist.</p>
<p>Please check the URL path you are requested and try again.</p>
<p>If you believe the error to be ours, please
<a href="//www.iris.edu/hq/contact">contact</a>
us.</p>
</div>
</div>
</div>
</body>
</html>
]
More Details:
handler exited, code: 1 reason: Internal Server Error
Request:
http://service.iris.edu/fdsnws/dataselect/1/queryauth?starttime=2010-02-27T06%3A30%3A00.000000&endtime=2010-02-27T06%3A30%3A01.000000&network=IU&station=ANMO&location=00&channel=BHZ
Request Submitted:
2024/06/05 10:06:49 UTC
Service version:
Service: fdsnws-dataselect version: 1.1.9
Traceback (most recent call last):
File "/Users/runner/miniconda3/envs/test/lib/python3.12/site-packages/_pytest/runner.py", line 341, in from_call
result: Optional[TResult] = func()
^^^^^^
File "/Users/runner/miniconda3/envs/test/lib/python3.12/site-packages/_pytest/runner.py", line 241, in <lambda>
lambda: runtest_hook(item=item, **kwds), when=when, reraise=reraise
^^^^^^^^^^^^^^^^^^^^^^^^^^^^^^^
File "/Users/runner/miniconda3/envs/test/lib/python3.12/site-packages/pluggy/_hooks.py", line 513, in __call__
return self._hookexec(self.name, self._hookimpls.copy(), kwargs, firstresult)
^^^^^^^^^^^^^^^^^^^^^^^^^^^^^^^^^^^^^^^^^^^^^^^^^^^^^^^^^^^^^^^^^^^^^^
File "/Users/runner/miniconda3/envs/test/lib/python3.12/site-packages/pluggy/_manager.py", line 120, in _hookexec
return self._inner_hookexec(hook_name, methods, kwargs, firstresult)
^^^^^^^^^^^^^^^^^^^^^^^^^^^^^^^^^^^^^^^^^^^^^^^^^^^^^^^^^^^^^
File "/Users/runner/miniconda3/envs/test/lib/python3.12/site-packages/pluggy/_callers.py", line 182, in _multicall
return outcome.get_result()
^^^^^^^^^^^^^^^^^^^^
File "/Users/runner/miniconda3/envs/test/lib/python3.12/site-packages/pluggy/_result.py", line 100, in get_result
raise exc.with_traceback(exc.__traceback__)
File "/Users/runner/miniconda3/envs/test/lib/python3.12/site-packages/pluggy/_callers.py", line 167, in _multicall
teardown.throw(outcome._exception)
File "/Users/runner/miniconda3/envs/test/lib/python3.12/site-packages/_pytest/threadexception.py", line 87, in pytest_runtest_call
yield from thread_exception_runtest_hook()
File "/Users/runner/miniconda3/envs/test/lib/python3.12/site-packages/_pytest/threadexception.py", line 63, in thread_exception_runtest_hook
yield
File "/Users/runner/miniconda3/envs/test/lib/python3.12/site-packages/pluggy/_callers.py", line 167, in _multicall
teardown.throw(outcome._exception)
File "/Users/runner/miniconda3/envs/test/lib/python3.12/site-packages/_pytest/unraisableexception.py", line 90, in pytest_runtest_call
yield from unraisable_exception_runtest_hook()
File "/Users/runner/miniconda3/envs/test/lib/python3.12/site-packages/_pytest/unraisableexception.py", line 65, in unraisable_exception_runtest_hook
yield
File "/Users/runner/miniconda3/envs/test/lib/python3.12/site-packages/pluggy/_callers.py", line 167, in _multicall
teardown.throw(outcome._exception)
File "/Users/runner/miniconda3/envs/test/lib/python3.12/site-packages/_pytest/logging.py", line 850, in pytest_runtest_call
yield from self._runtest_for(item, "call")
File "/Users/runner/miniconda3/envs/test/lib/python3.12/site-packages/_pytest/logging.py", line 833, in _runtest_for
yield
File "/Users/runner/miniconda3/envs/test/lib/python3.12/site-packages/pluggy/_callers.py", line 167, in _multicall
teardown.throw(outcome._exception)
File "/Users/runner/miniconda3/envs/test/lib/python3.12/site-packages/_pytest/capture.py", line 878, in pytest_runtest_call
return (yield)
^^^^^
File "/Users/runner/miniconda3/envs/test/lib/python3.12/site-packages/pluggy/_callers.py", line 167, in _multicall
teardown.throw(outcome._exception)
File "/Users/runner/miniconda3/envs/test/lib/python3.12/site-packages/_pytest/skipping.py", line 257, in pytest_runtest_call
return (yield)
^^^^^
File "/Users/runner/miniconda3/envs/test/lib/python3.12/site-packages/pluggy/_callers.py", line 103, in _multicall
res = hook_impl.function(*args)
^^^^^^^^^^^^^^^^^^^^^^^^^
File "/Users/runner/miniconda3/envs/test/lib/python3.12/site-packages/_pytest/runner.py", line 183, in pytest_runtest_call
raise e
File "/Users/runner/miniconda3/envs/test/lib/python3.12/site-packages/_pytest/runner.py", line 173, in pytest_runtest_call
item.runtest()
File "/Users/runner/miniconda3/envs/test/lib/python3.12/site-packages/_pytest/python.py", line 1632, in runtest
self.ihook.pytest_pyfunc_call(pyfuncitem=self)
File "/Users/runner/miniconda3/envs/test/lib/python3.12/site-packages/pluggy/_hooks.py", line 513, in __call__
return self._hookexec(self.name, self._hookimpls.copy(), kwargs, firstresult)
^^^^^^^^^^^^^^^^^^^^^^^^^^^^^^^^^^^^^^^^^^^^^^^^^^^^^^^^^^^^^^^^^^^^^^
File "/Users/runner/miniconda3/envs/test/lib/python3.12/site-packages/pluggy/_manager.py", line 120, in _hookexec
return self._inner_hookexec(hook_name, methods, kwargs, firstresult)
^^^^^^^^^^^^^^^^^^^^^^^^^^^^^^^^^^^^^^^^^^^^^^^^^^^^^^^^^^^^^
File "/Users/runner/miniconda3/envs/test/lib/python3.12/site-packages/pluggy/_callers.py", line 139, in _multicall
raise exception.with_traceback(exception.__traceback__)
File "/Users/runner/miniconda3/envs/test/lib/python3.12/site-packages/pluggy/_callers.py", line 103, in _multicall
res = hook_impl.function(*args)
^^^^^^^^^^^^^^^^^^^^^^^^^
File "/Users/runner/miniconda3/envs/test/lib/python3.12/site-packages/_pytest/python.py", line 162, in pytest_pyfunc_call
result = testfunction(**testargs)
^^^^^^^^^^^^^^^^^^^^^^^^
File "/Users/runner/miniconda3/envs/test/lib/python3.12/unittest/mock.py", line 1390, in patched
return func(*newargs, **newkeywargs)
^^^^^^^^^^^^^^^^^^^^^^^^^^^^^
File "/Users/runner/miniconda3/envs/test/lib/python3.12/site-packages/obspy/clients/fdsn/tests/test_client.py", line 1434, in test_no_data_exception
self.client.get_stations()
File "/Users/runner/miniconda3/envs/test/lib/python3.12/site-packages/obspy/clients/fdsn/client.py", line 747, in get_stations
raise ValueError(msg)
ValueError: The current client does not have a station service.
Traceback (most recent call last):
File "/Users/runner/miniconda3/envs/test/lib/python3.12/site-packages/_pytest/runner.py", line 341, in from_call
result: Optional[TResult] = func()
^^^^^^
File "/Users/runner/miniconda3/envs/test/lib/python3.12/site-packages/_pytest/runner.py", line 241, in <lambda>
lambda: runtest_hook(item=item, **kwds), when=when, reraise=reraise
^^^^^^^^^^^^^^^^^^^^^^^^^^^^^^^
File "/Users/runner/miniconda3/envs/test/lib/python3.12/site-packages/pluggy/_hooks.py", line 513, in __call__
return self._hookexec(self.name, self._hookimpls.copy(), kwargs, firstresult)
^^^^^^^^^^^^^^^^^^^^^^^^^^^^^^^^^^^^^^^^^^^^^^^^^^^^^^^^^^^^^^^^^^^^^^
File "/Users/runner/miniconda3/envs/test/lib/python3.12/site-packages/pluggy/_manager.py", line 120, in _hookexec
return self._inner_hookexec(hook_name, methods, kwargs, firstresult)
^^^^^^^^^^^^^^^^^^^^^^^^^^^^^^^^^^^^^^^^^^^^^^^^^^^^^^^^^^^^^
File "/Users/runner/miniconda3/envs/test/lib/python3.12/site-packages/pluggy/_callers.py", line 182, in _multicall
return outcome.get_result()
^^^^^^^^^^^^^^^^^^^^
File "/Users/runner/miniconda3/envs/test/lib/python3.12/site-packages/pluggy/_result.py", line 100, in get_result
raise exc.with_traceback(exc.__traceback__)
File "/Users/runner/miniconda3/envs/test/lib/python3.12/site-packages/pluggy/_callers.py", line 167, in _multicall
teardown.throw(outcome._exception)
File "/Users/runner/miniconda3/envs/test/lib/python3.12/site-packages/_pytest/threadexception.py", line 87, in pytest_runtest_call
yield from thread_exception_runtest_hook()
File "/Users/runner/miniconda3/envs/test/lib/python3.12/site-packages/_pytest/threadexception.py", line 63, in thread_exception_runtest_hook
yield
File "/Users/runner/miniconda3/envs/test/lib/python3.12/site-packages/pluggy/_callers.py", line 167, in _multicall
teardown.throw(outcome._exception)
File "/Users/runner/miniconda3/envs/test/lib/python3.12/site-packages/_pytest/unraisableexception.py", line 90, in pytest_runtest_call
yield from unraisable_exception_runtest_hook()
File "/Users/runner/miniconda3/envs/test/lib/python3.12/site-packages/_pytest/unraisableexception.py", line 65, in unraisable_exception_runtest_hook
yield
File "/Users/runner/miniconda3/envs/test/lib/python3.12/site-packages/pluggy/_callers.py", line 167, in _multicall
teardown.throw(outcome._exception)
File "/Users/runner/miniconda3/envs/test/lib/python3.12/site-packages/_pytest/logging.py", line 850, in pytest_runtest_call
yield from self._runtest_for(item, "call")
File "/Users/runner/miniconda3/envs/test/lib/python3.12/site-packages/_pytest/logging.py", line 833, in _runtest_for
yield
File "/Users/runner/miniconda3/envs/test/lib/python3.12/site-packages/pluggy/_callers.py", line 167, in _multicall
teardown.throw(outcome._exception)
File "/Users/runner/miniconda3/envs/test/lib/python3.12/site-packages/_pytest/capture.py", line 878, in pytest_runtest_call
return (yield)
^^^^^
File "/Users/runner/miniconda3/envs/test/lib/python3.12/site-packages/pluggy/_callers.py", line 167, in _multicall
teardown.throw(outcome._exception)
File "/Users/runner/miniconda3/envs/test/lib/python3.12/site-packages/_pytest/skipping.py", line 257, in pytest_runtest_call
return (yield)
^^^^^
File "/Users/runner/miniconda3/envs/test/lib/python3.12/site-packages/pluggy/_callers.py", line 103, in _multicall
res = hook_impl.function(*args)
^^^^^^^^^^^^^^^^^^^^^^^^^
File "/Users/runner/miniconda3/envs/test/lib/python3.12/site-packages/_pytest/runner.py", line 183, in pytest_runtest_call
raise e
File "/Users/runner/miniconda3/envs/test/lib/python3.12/site-packages/_pytest/runner.py", line 173, in pytest_runtest_call
item.runtest()
File "/Users/runner/miniconda3/envs/test/lib/python3.12/site-packages/_pytest/python.py", line 1632, in runtest
self.ihook.pytest_pyfunc_call(pyfuncitem=self)
File "/Users/runner/miniconda3/envs/test/lib/python3.12/site-packages/pluggy/_hooks.py", line 513, in __call__
return self._hookexec(self.name, self._hookimpls.copy(), kwargs, firstresult)
^^^^^^^^^^^^^^^^^^^^^^^^^^^^^^^^^^^^^^^^^^^^^^^^^^^^^^^^^^^^^^^^^^^^^^
File "/Users/runner/miniconda3/envs/test/lib/python3.12/site-packages/pluggy/_manager.py", line 120, in _hookexec
return self._inner_hookexec(hook_name, methods, kwargs, firstresult)
^^^^^^^^^^^^^^^^^^^^^^^^^^^^^^^^^^^^^^^^^^^^^^^^^^^^^^^^^^^^^
File "/Users/runner/miniconda3/envs/test/lib/python3.12/site-packages/pluggy/_callers.py", line 139, in _multicall
raise exception.with_traceback(exception.__traceback__)
File "/Users/runner/miniconda3/envs/test/lib/python3.12/site-packages/pluggy/_callers.py", line 103, in _multicall
res = hook_impl.function(*args)
^^^^^^^^^^^^^^^^^^^^^^^^^
File "/Users/runner/miniconda3/envs/test/lib/python3.12/site-packages/_pytest/python.py", line 162, in pytest_pyfunc_call
result = testfunction(**testargs)
^^^^^^^^^^^^^^^^^^^^^^^^
File "/Users/runner/miniconda3/envs/test/lib/python3.12/unittest/mock.py", line 1390, in patched
return func(*newargs, **newkeywargs)
^^^^^^^^^^^^^^^^^^^^^^^^^^^^^
File "/Users/runner/miniconda3/envs/test/lib/python3.12/site-packages/obspy/clients/fdsn/tests/test_client.py", line 1444, in test_request_too_large_exception
self.client.get_stations()
File "/Users/runner/miniconda3/envs/test/lib/python3.12/site-packages/obspy/clients/fdsn/client.py", line 747, in get_stations
raise ValueError(msg)
ValueError: The current client does not have a station service.
Traceback (most recent call last):
File "/Users/runner/miniconda3/envs/test/lib/python3.12/site-packages/_pytest/runner.py", line 341, in from_call
result: Optional[TResult] = func()
^^^^^^
File "/Users/runner/miniconda3/envs/test/lib/python3.12/site-packages/_pytest/runner.py", line 241, in <lambda>
lambda: runtest_hook(item=item, **kwds), when=when, reraise=reraise
^^^^^^^^^^^^^^^^^^^^^^^^^^^^^^^
File "/Users/runner/miniconda3/envs/test/lib/python3.12/site-packages/pluggy/_hooks.py", line 513, in __call__
return self._hookexec(self.name, self._hookimpls.copy(), kwargs, firstresult)
^^^^^^^^^^^^^^^^^^^^^^^^^^^^^^^^^^^^^^^^^^^^^^^^^^^^^^^^^^^^^^^^^^^^^^
File "/Users/runner/miniconda3/envs/test/lib/python3.12/site-packages/pluggy/_manager.py", line 120, in _hookexec
return self._inner_hookexec(hook_name, methods, kwargs, firstresult)
^^^^^^^^^^^^^^^^^^^^^^^^^^^^^^^^^^^^^^^^^^^^^^^^^^^^^^^^^^^^^
File "/Users/runner/miniconda3/envs/test/lib/python3.12/site-packages/pluggy/_callers.py", line 182, in _multicall
return outcome.get_result()
^^^^^^^^^^^^^^^^^^^^
File "/Users/runner/miniconda3/envs/test/lib/python3.12/site-packages/pluggy/_result.py", line 100, in get_result
raise exc.with_traceback(exc.__traceback__)
File "/Users/runner/miniconda3/envs/test/lib/python3.12/site-packages/pluggy/_callers.py", line 167, in _multicall
teardown.throw(outcome._exception)
File "/Users/runner/miniconda3/envs/test/lib/python3.12/site-packages/_pytest/threadexception.py", line 87, in pytest_runtest_call
yield from thread_exception_runtest_hook()
File "/Users/runner/miniconda3/envs/test/lib/python3.12/site-packages/_pytest/threadexception.py", line 63, in thread_exception_runtest_hook
yield
File "/Users/runner/miniconda3/envs/test/lib/python3.12/site-packages/pluggy/_callers.py", line 167, in _multicall
teardown.throw(outcome._exception)
File "/Users/runner/miniconda3/envs/test/lib/python3.12/site-packages/_pytest/unraisableexception.py", line 90, in pytest_runtest_call
yield from unraisable_exception_runtest_hook()
File "/Users/runner/miniconda3/envs/test/lib/python3.12/site-packages/_pytest/unraisableexception.py", line 65, in unraisable_exception_runtest_hook
yield
File "/Users/runner/miniconda3/envs/test/lib/python3.12/site-packages/pluggy/_callers.py", line 167, in _multicall
teardown.throw(outcome._exception)
File "/Users/runner/miniconda3/envs/test/lib/python3.12/site-packages/_pytest/logging.py", line 850, in pytest_runtest_call
yield from self._runtest_for(item, "call")
File "/Users/runner/miniconda3/envs/test/lib/python3.12/site-packages/_pytest/logging.py", line 833, in _runtest_for
yield
File "/Users/runner/miniconda3/envs/test/lib/python3.12/site-packages/pluggy/_callers.py", line 167, in _multicall
teardown.throw(outcome._exception)
File "/Users/runner/miniconda3/envs/test/lib/python3.12/site-packages/_pytest/capture.py", line 878, in pytest_runtest_call
return (yield)
^^^^^
File "/Users/runner/miniconda3/envs/test/lib/python3.12/site-packages/pluggy/_callers.py", line 167, in _multicall
teardown.throw(outcome._exception)
File "/Users/runner/miniconda3/envs/test/lib/python3.12/site-packages/_pytest/skipping.py", line 257, in pytest_runtest_call
return (yield)
^^^^^
File "/Users/runner/miniconda3/envs/test/lib/python3.12/site-packages/pluggy/_callers.py", line 103, in _multicall
res = hook_impl.function(*args)
^^^^^^^^^^^^^^^^^^^^^^^^^
File "/Users/runner/miniconda3/envs/test/lib/python3.12/site-packages/_pytest/runner.py", line 183, in pytest_runtest_call
raise e
File "/Users/runner/miniconda3/envs/test/lib/python3.12/site-packages/_pytest/runner.py", line 173, in pytest_runtest_call
item.runtest()
File "/Users/runner/miniconda3/envs/test/lib/python3.12/site-packages/_pytest/python.py", line 1632, in runtest
self.ihook.pytest_pyfunc_call(pyfuncitem=self)
File "/Users/runner/miniconda3/envs/test/lib/python3.12/site-packages/pluggy/_hooks.py", line 513, in __call__
return self._hookexec(self.name, self._hookimpls.copy(), kwargs, firstresult)
^^^^^^^^^^^^^^^^^^^^^^^^^^^^^^^^^^^^^^^^^^^^^^^^^^^^^^^^^^^^^^^^^^^^^^
File "/Users/runner/miniconda3/envs/test/lib/python3.12/site-packages/pluggy/_manager.py", line 120, in _hookexec
return self._inner_hookexec(hook_name, methods, kwargs, firstresult)
^^^^^^^^^^^^^^^^^^^^^^^^^^^^^^^^^^^^^^^^^^^^^^^^^^^^^^^^^^^^^
File "/Users/runner/miniconda3/envs/test/lib/python3.12/site-packages/pluggy/_callers.py", line 139, in _multicall
raise exception.with_traceback(exception.__traceback__)
File "/Users/runner/miniconda3/envs/test/lib/python3.12/site-packages/pluggy/_callers.py", line 103, in _multicall
res = hook_impl.function(*args)
^^^^^^^^^^^^^^^^^^^^^^^^^
File "/Users/runner/miniconda3/envs/test/lib/python3.12/site-packages/_pytest/python.py", line 162, in pytest_pyfunc_call
result = testfunction(**testargs)
^^^^^^^^^^^^^^^^^^^^^^^^
File "/Users/runner/miniconda3/envs/test/lib/python3.12/unittest/mock.py", line 1390, in patched
return func(*newargs, **newkeywargs)
^^^^^^^^^^^^^^^^^^^^^^^^^^^^^
File "/Users/runner/miniconda3/envs/test/lib/python3.12/site-packages/obspy/clients/fdsn/tests/test_client.py", line 1456, in test_authentication_exceptions
Client(eida_token="TEST")
File "/Users/runner/miniconda3/envs/test/lib/python3.12/site-packages/obspy/clients/fdsn/client.py", line 284, in __init__
self._discover_services()
File "/Users/runner/miniconda3/envs/test/lib/python3.12/site-packages/obspy/clients/fdsn/client.py", line 1657, in _discover_services
raise FDSNNoServiceException(msg)
obspy.clients.fdsn.header.FDSNNoServiceException: No FDSN services could be discovered at 'http://service.iris.edu'. This could be due to a temporary service outage or an invalid FDSN service address.
Traceback (most recent call last):
File "/Users/runner/miniconda3/envs/test/lib/python3.12/site-packages/_pytest/runner.py", line 341, in from_call
result: Optional[TResult] = func()
^^^^^^
File "/Users/runner/miniconda3/envs/test/lib/python3.12/site-packages/_pytest/runner.py", line 241, in <lambda>
lambda: runtest_hook(item=item, **kwds), when=when, reraise=reraise
^^^^^^^^^^^^^^^^^^^^^^^^^^^^^^^
File "/Users/runner/miniconda3/envs/test/lib/python3.12/site-packages/pluggy/_hooks.py", line 513, in __call__
return self._hookexec(self.name, self._hookimpls.copy(), kwargs, firstresult)
^^^^^^^^^^^^^^^^^^^^^^^^^^^^^^^^^^^^^^^^^^^^^^^^^^^^^^^^^^^^^^^^^^^^^^
File "/Users/runner/miniconda3/envs/test/lib/python3.12/site-packages/pluggy/_manager.py", line 120, in _hookexec
return self._inner_hookexec(hook_name, methods, kwargs, firstresult)
^^^^^^^^^^^^^^^^^^^^^^^^^^^^^^^^^^^^^^^^^^^^^^^^^^^^^^^^^^^^^
File "/Users/runner/miniconda3/envs/test/lib/python3.12/site-packages/pluggy/_callers.py", line 182, in _multicall
return outcome.get_result()
^^^^^^^^^^^^^^^^^^^^
File "/Users/runner/miniconda3/envs/test/lib/python3.12/site-packages/pluggy/_result.py", line 100, in get_result
raise exc.with_traceback(exc.__traceback__)
File "/Users/runner/miniconda3/envs/test/lib/python3.12/site-packages/pluggy/_callers.py", line 167, in _multicall
teardown.throw(outcome._exception)
File "/Users/runner/miniconda3/envs/test/lib/python3.12/site-packages/_pytest/threadexception.py", line 87, in pytest_runtest_call
yield from thread_exception_runtest_hook()
File "/Users/runner/miniconda3/envs/test/lib/python3.12/site-packages/_pytest/threadexception.py", line 63, in thread_exception_runtest_hook
yield
File "/Users/runner/miniconda3/envs/test/lib/python3.12/site-packages/pluggy/_callers.py", line 167, in _multicall
teardown.throw(outcome._exception)
File "/Users/runner/miniconda3/envs/test/lib/python3.12/site-packages/_pytest/unraisableexception.py", line 90, in pytest_runtest_call
yield from unraisable_exception_runtest_hook()
File "/Users/runner/miniconda3/envs/test/lib/python3.12/site-packages/_pytest/unraisableexception.py", line 65, in unraisable_exception_runtest_hook
yield
File "/Users/runner/miniconda3/envs/test/lib/python3.12/site-packages/pluggy/_callers.py", line 167, in _multicall
teardown.throw(outcome._exception)
File "/Users/runner/miniconda3/envs/test/lib/python3.12/site-packages/_pytest/logging.py", line 850, in pytest_runtest_call
yield from self._runtest_for(item, "call")
File "/Users/runner/miniconda3/envs/test/lib/python3.12/site-packages/_pytest/logging.py", line 833, in _runtest_for
yield
File "/Users/runner/miniconda3/envs/test/lib/python3.12/site-packages/pluggy/_callers.py", line 167, in _multicall
teardown.throw(outcome._exception)
File "/Users/runner/miniconda3/envs/test/lib/python3.12/site-packages/_pytest/capture.py", line 878, in pytest_runtest_call
return (yield)
^^^^^
File "/Users/runner/miniconda3/envs/test/lib/python3.12/site-packages/pluggy/_callers.py", line 167, in _multicall
teardown.throw(outcome._exception)
File "/Users/runner/miniconda3/envs/test/lib/python3.12/site-packages/_pytest/skipping.py", line 257, in pytest_runtest_call
return (yield)
^^^^^
File "/Users/runner/miniconda3/envs/test/lib/python3.12/site-packages/pluggy/_callers.py", line 103, in _multicall
res = hook_impl.function(*args)
^^^^^^^^^^^^^^^^^^^^^^^^^
File "/Users/runner/miniconda3/envs/test/lib/python3.12/site-packages/_pytest/runner.py", line 183, in pytest_runtest_call
raise e
File "/Users/runner/miniconda3/envs/test/lib/python3.12/site-packages/_pytest/runner.py", line 173, in pytest_runtest_call
item.runtest()
File "/Users/runner/miniconda3/envs/test/lib/python3.12/site-packages/_pytest/python.py", line 1632, in runtest
self.ihook.pytest_pyfunc_call(pyfuncitem=self)
File "/Users/runner/miniconda3/envs/test/lib/python3.12/site-packages/pluggy/_hooks.py", line 513, in __call__
return self._hookexec(self.name, self._hookimpls.copy(), kwargs, firstresult)
^^^^^^^^^^^^^^^^^^^^^^^^^^^^^^^^^^^^^^^^^^^^^^^^^^^^^^^^^^^^^^^^^^^^^^
File "/Users/runner/miniconda3/envs/test/lib/python3.12/site-packages/pluggy/_manager.py", line 120, in _hookexec
return self._inner_hookexec(hook_name, methods, kwargs, firstresult)
^^^^^^^^^^^^^^^^^^^^^^^^^^^^^^^^^^^^^^^^^^^^^^^^^^^^^^^^^^^^^
File "/Users/runner/miniconda3/envs/test/lib/python3.12/site-packages/pluggy/_callers.py", line 139, in _multicall
raise exception.with_traceback(exception.__traceback__)
File "/Users/runner/miniconda3/envs/test/lib/python3.12/site-packages/pluggy/_callers.py", line 103, in _multicall
res = hook_impl.function(*args)
^^^^^^^^^^^^^^^^^^^^^^^^^
File "/Users/runner/miniconda3/envs/test/lib/python3.12/site-packages/_pytest/python.py", line 162, in pytest_pyfunc_call
result = testfunction(**testargs)
^^^^^^^^^^^^^^^^^^^^^^^^
File "/Users/runner/miniconda3/envs/test/lib/python3.12/unittest/mock.py", line 1390, in patched
return func(*newargs, **newkeywargs)
^^^^^^^^^^^^^^^^^^^^^^^^^^^^^
File "/Users/runner/miniconda3/envs/test/lib/python3.12/site-packages/obspy/clients/fdsn/tests/test_client.py", line 1476, in test_timeout_exception
self.client.get_stations()
File "/Users/runner/miniconda3/envs/test/lib/python3.12/site-packages/obspy/clients/fdsn/client.py", line 747, in get_stations
raise ValueError(msg)
ValueError: The current client does not have a station service.
Traceback (most recent call last):
File "/Users/runner/miniconda3/envs/test/lib/python3.12/site-packages/_pytest/runner.py", line 341, in from_call
result: Optional[TResult] = func()
^^^^^^
File "/Users/runner/miniconda3/envs/test/lib/python3.12/site-packages/_pytest/runner.py", line 241, in <lambda>
lambda: runtest_hook(item=item, **kwds), when=when, reraise=reraise
^^^^^^^^^^^^^^^^^^^^^^^^^^^^^^^
File "/Users/runner/miniconda3/envs/test/lib/python3.12/site-packages/pluggy/_hooks.py", line 513, in __call__
return self._hookexec(self.name, self._hookimpls.copy(), kwargs, firstresult)
^^^^^^^^^^^^^^^^^^^^^^^^^^^^^^^^^^^^^^^^^^^^^^^^^^^^^^^^^^^^^^^^^^^^^^
File "/Users/runner/miniconda3/envs/test/lib/python3.12/site-packages/pluggy/_manager.py", line 120, in _hookexec
return self._inner_hookexec(hook_name, methods, kwargs, firstresult)
^^^^^^^^^^^^^^^^^^^^^^^^^^^^^^^^^^^^^^^^^^^^^^^^^^^^^^^^^^^^^
File "/Users/runner/miniconda3/envs/test/lib/python3.12/site-packages/pluggy/_callers.py", line 182, in _multicall
return outcome.get_result()
^^^^^^^^^^^^^^^^^^^^
File "/Users/runner/miniconda3/envs/test/lib/python3.12/site-packages/pluggy/_result.py", line 100, in get_result
raise exc.with_traceback(exc.__traceback__)
File "/Users/runner/miniconda3/envs/test/lib/python3.12/site-packages/pluggy/_callers.py", line 167, in _multicall
teardown.throw(outcome._exception)
File "/Users/runner/miniconda3/envs/test/lib/python3.12/site-packages/_pytest/threadexception.py", line 87, in pytest_runtest_call
yield from thread_exception_runtest_hook()
File "/Users/runner/miniconda3/envs/test/lib/python3.12/site-packages/_pytest/threadexception.py", line 63, in thread_exception_runtest_hook
yield
File "/Users/runner/miniconda3/envs/test/lib/python3.12/site-packages/pluggy/_callers.py", line 167, in _multicall
teardown.throw(outcome._exception)
File "/Users/runner/miniconda3/envs/test/lib/python3.12/site-packages/_pytest/unraisableexception.py", line 90, in pytest_runtest_call
yield from unraisable_exception_runtest_hook()
File "/Users/runner/miniconda3/envs/test/lib/python3.12/site-packages/_pytest/unraisableexception.py", line 65, in unraisable_exception_runtest_hook
yield
File "/Users/runner/miniconda3/envs/test/lib/python3.12/site-packages/pluggy/_callers.py", line 167, in _multicall
teardown.throw(outcome._exception)
File "/Users/runner/miniconda3/envs/test/lib/python3.12/site-packages/_pytest/logging.py", line 850, in pytest_runtest_call
yield from self._runtest_for(item, "call")
File "/Users/runner/miniconda3/envs/test/lib/python3.12/site-packages/_pytest/logging.py", line 833, in _runtest_for
yield
File "/Users/runner/miniconda3/envs/test/lib/python3.12/site-packages/pluggy/_callers.py", line 167, in _multicall
teardown.throw(outcome._exception)
File "/Users/runner/miniconda3/envs/test/lib/python3.12/site-packages/_pytest/capture.py", line 878, in pytest_runtest_call
return (yield)
^^^^^
File "/Users/runner/miniconda3/envs/test/lib/python3.12/site-packages/pluggy/_callers.py", line 167, in _multicall
teardown.throw(outcome._exception)
File "/Users/runner/miniconda3/envs/test/lib/python3.12/site-packages/_pytest/skipping.py", line 257, in pytest_runtest_call
return (yield)
^^^^^
File "/Users/runner/miniconda3/envs/test/lib/python3.12/site-packages/pluggy/_callers.py", line 103, in _multicall
res = hook_impl.function(*args)
^^^^^^^^^^^^^^^^^^^^^^^^^
File "/Users/runner/miniconda3/envs/test/lib/python3.12/site-packages/_pytest/runner.py", line 183, in pytest_runtest_call
raise e
File "/Users/runner/miniconda3/envs/test/lib/python3.12/site-packages/_pytest/runner.py", line 173, in pytest_runtest_call
item.runtest()
File "/Users/runner/miniconda3/envs/test/lib/python3.12/site-packages/_pytest/python.py", line 1632, in runtest
self.ihook.pytest_pyfunc_call(pyfuncitem=self)
File "/Users/runner/miniconda3/envs/test/lib/python3.12/site-packages/pluggy/_hooks.py", line 513, in __call__
return self._hookexec(self.name, self._hookimpls.copy(), kwargs, firstresult)
^^^^^^^^^^^^^^^^^^^^^^^^^^^^^^^^^^^^^^^^^^^^^^^^^^^^^^^^^^^^^^^^^^^^^^
File "/Users/runner/miniconda3/envs/test/lib/python3.12/site-packages/pluggy/_manager.py", line 120, in _hookexec
return self._inner_hookexec(hook_name, methods, kwargs, firstresult)
^^^^^^^^^^^^^^^^^^^^^^^^^^^^^^^^^^^^^^^^^^^^^^^^^^^^^^^^^^^^^
File "/Users/runner/miniconda3/envs/test/lib/python3.12/site-packages/pluggy/_callers.py", line 139, in _multicall
raise exception.with_traceback(exception.__traceback__)
File "/Users/runner/miniconda3/envs/test/lib/python3.12/site-packages/pluggy/_callers.py", line 103, in _multicall
res = hook_impl.function(*args)
^^^^^^^^^^^^^^^^^^^^^^^^^
File "/Users/runner/miniconda3/envs/test/lib/python3.12/site-packages/_pytest/python.py", line 162, in pytest_pyfunc_call
result = testfunction(**testargs)
^^^^^^^^^^^^^^^^^^^^^^^^
File "/Users/runner/miniconda3/envs/test/lib/python3.12/unittest/mock.py", line 1390, in patched
return func(*newargs, **newkeywargs)
^^^^^^^^^^^^^^^^^^^^^^^^^^^^^
File "/Users/runner/miniconda3/envs/test/lib/python3.12/site-packages/obspy/clients/fdsn/tests/test_client.py", line 1494, in test_not_implemented_exception
self.client.get_stations()
File "/Users/runner/miniconda3/envs/test/lib/python3.12/site-packages/obspy/clients/fdsn/client.py", line 747, in get_stations
raise ValueError(msg)
ValueError: The current client does not have a station service.
Traceback (most recent call last):
File "/Users/runner/miniconda3/envs/test/lib/python3.12/site-packages/_pytest/runner.py", line 341, in from_call
result: Optional[TResult] = func()
^^^^^^
File "/Users/runner/miniconda3/envs/test/lib/python3.12/site-packages/_pytest/runner.py", line 241, in <lambda>
lambda: runtest_hook(item=item, **kwds), when=when, reraise=reraise
^^^^^^^^^^^^^^^^^^^^^^^^^^^^^^^
File "/Users/runner/miniconda3/envs/test/lib/python3.12/site-packages/pluggy/_hooks.py", line 513, in __call__
return self._hookexec(self.name, self._hookimpls.copy(), kwargs, firstresult)
^^^^^^^^^^^^^^^^^^^^^^^^^^^^^^^^^^^^^^^^^^^^^^^^^^^^^^^^^^^^^^^^^^^^^^
File "/Users/runner/miniconda3/envs/test/lib/python3.12/site-packages/pluggy/_manager.py", line 120, in _hookexec
return self._inner_hookexec(hook_name, methods, kwargs, firstresult)
^^^^^^^^^^^^^^^^^^^^^^^^^^^^^^^^^^^^^^^^^^^^^^^^^^^^^^^^^^^^^
File "/Users/runner/miniconda3/envs/test/lib/python3.12/site-packages/pluggy/_callers.py", line 182, in _multicall
return outcome.get_result()
^^^^^^^^^^^^^^^^^^^^
File "/Users/runner/miniconda3/envs/test/lib/python3.12/site-packages/pluggy/_result.py", line 100, in get_result
raise exc.with_traceback(exc.__traceback__)
File "/Users/runner/miniconda3/envs/test/lib/python3.12/site-packages/pluggy/_callers.py", line 167, in _multicall
teardown.throw(outcome._exception)
File "/Users/runner/miniconda3/envs/test/lib/python3.12/site-packages/_pytest/threadexception.py", line 87, in pytest_runtest_call
yield from thread_exception_runtest_hook()
File "/Users/runner/miniconda3/envs/test/lib/python3.12/site-packages/_pytest/threadexception.py", line 63, in thread_exception_runtest_hook
yield
File "/Users/runner/miniconda3/envs/test/lib/python3.12/site-packages/pluggy/_callers.py", line 167, in _multicall
teardown.throw(outcome._exception)
File "/Users/runner/miniconda3/envs/test/lib/python3.12/site-packages/_pytest/unraisableexception.py", line 90, in pytest_runtest_call
yield from unraisable_exception_runtest_hook()
File "/Users/runner/miniconda3/envs/test/lib/python3.12/site-packages/_pytest/unraisableexception.py", line 65, in unraisable_exception_runtest_hook
yield
File "/Users/runner/miniconda3/envs/test/lib/python3.12/site-packages/pluggy/_callers.py", line 167, in _multicall
teardown.throw(outcome._exception)
File "/Users/runner/miniconda3/envs/test/lib/python3.12/site-packages/_pytest/logging.py", line 850, in pytest_runtest_call
yield from self._runtest_for(item, "call")
File "/Users/runner/miniconda3/envs/test/lib/python3.12/site-packages/_pytest/logging.py", line 833, in _runtest_for
yield
File "/Users/runner/miniconda3/envs/test/lib/python3.12/site-packages/pluggy/_callers.py", line 167, in _multicall
teardown.throw(outcome._exception)
File "/Users/runner/miniconda3/envs/test/lib/python3.12/site-packages/_pytest/capture.py", line 878, in pytest_runtest_call
return (yield)
^^^^^
File "/Users/runner/miniconda3/envs/test/lib/python3.12/site-packages/pluggy/_callers.py", line 167, in _multicall
teardown.throw(outcome._exception)
File "/Users/runner/miniconda3/envs/test/lib/python3.12/site-packages/_pytest/skipping.py", line 257, in pytest_runtest_call
return (yield)
^^^^^
File "/Users/runner/miniconda3/envs/test/lib/python3.12/site-packages/pluggy/_callers.py", line 103, in _multicall
res = hook_impl.function(*args)
^^^^^^^^^^^^^^^^^^^^^^^^^
File "/Users/runner/miniconda3/envs/test/lib/python3.12/site-packages/_pytest/runner.py", line 183, in pytest_runtest_call
raise e
File "/Users/runner/miniconda3/envs/test/lib/python3.12/site-packages/_pytest/runner.py", line 173, in pytest_runtest_call
item.runtest()
File "/Users/runner/miniconda3/envs/test/lib/python3.12/site-packages/_pytest/python.py", line 1632, in runtest
self.ihook.pytest_pyfunc_call(pyfuncitem=self)
File "/Users/runner/miniconda3/envs/test/lib/python3.12/site-packages/pluggy/_hooks.py", line 513, in __call__
return self._hookexec(self.name, self._hookimpls.copy(), kwargs, firstresult)
^^^^^^^^^^^^^^^^^^^^^^^^^^^^^^^^^^^^^^^^^^^^^^^^^^^^^^^^^^^^^^^^^^^^^^
File "/Users/runner/miniconda3/envs/test/lib/python3.12/site-packages/pluggy/_manager.py", line 120, in _hookexec
return self._inner_hookexec(hook_name, methods, kwargs, firstresult)
^^^^^^^^^^^^^^^^^^^^^^^^^^^^^^^^^^^^^^^^^^^^^^^^^^^^^^^^^^^^^
File "/Users/runner/miniconda3/envs/test/lib/python3.12/site-packages/pluggy/_callers.py", line 139, in _multicall
raise exception.with_traceback(exception.__traceback__)
File "/Users/runner/miniconda3/envs/test/lib/python3.12/site-packages/pluggy/_callers.py", line 103, in _multicall
res = hook_impl.function(*args)
^^^^^^^^^^^^^^^^^^^^^^^^^
File "/Users/runner/miniconda3/envs/test/lib/python3.12/site-packages/_pytest/python.py", line 162, in pytest_pyfunc_call
result = testfunction(**testargs)
^^^^^^^^^^^^^^^^^^^^^^^^
File "/Users/runner/miniconda3/envs/test/lib/python3.12/unittest/mock.py", line 1390, in patched
return func(*newargs, **newkeywargs)
^^^^^^^^^^^^^^^^^^^^^^^^^^^^^
File "/Users/runner/miniconda3/envs/test/lib/python3.12/site-packages/obspy/clients/fdsn/tests/test_client.py", line 1504, in test_bad_gateway_exception
self.client.get_stations()
File "/Users/runner/miniconda3/envs/test/lib/python3.12/site-packages/obspy/clients/fdsn/client.py", line 747, in get_stations
raise ValueError(msg)
ValueError: The current client does not have a station service.
Traceback (most recent call last):
File "/Users/runner/miniconda3/envs/test/lib/python3.12/site-packages/_pytest/runner.py", line 341, in from_call
result: Optional[TResult] = func()
^^^^^^
File "/Users/runner/miniconda3/envs/test/lib/python3.12/site-packages/_pytest/runner.py", line 241, in <lambda>
lambda: runtest_hook(item=item, **kwds), when=when, reraise=reraise
^^^^^^^^^^^^^^^^^^^^^^^^^^^^^^^
File "/Users/runner/miniconda3/envs/test/lib/python3.12/site-packages/pluggy/_hooks.py", line 513, in __call__
return self._hookexec(self.name, self._hookimpls.copy(), kwargs, firstresult)
^^^^^^^^^^^^^^^^^^^^^^^^^^^^^^^^^^^^^^^^^^^^^^^^^^^^^^^^^^^^^^^^^^^^^^
File "/Users/runner/miniconda3/envs/test/lib/python3.12/site-packages/pluggy/_manager.py", line 120, in _hookexec
return self._inner_hookexec(hook_name, methods, kwargs, firstresult)
^^^^^^^^^^^^^^^^^^^^^^^^^^^^^^^^^^^^^^^^^^^^^^^^^^^^^^^^^^^^^
File "/Users/runner/miniconda3/envs/test/lib/python3.12/site-packages/pluggy/_callers.py", line 182, in _multicall
return outcome.get_result()
^^^^^^^^^^^^^^^^^^^^
File "/Users/runner/miniconda3/envs/test/lib/python3.12/site-packages/pluggy/_result.py", line 100, in get_result
raise exc.with_traceback(exc.__traceback__)
File "/Users/runner/miniconda3/envs/test/lib/python3.12/site-packages/pluggy/_callers.py", line 167, in _multicall
teardown.throw(outcome._exception)
File "/Users/runner/miniconda3/envs/test/lib/python3.12/site-packages/_pytest/threadexception.py", line 87, in pytest_runtest_call
yield from thread_exception_runtest_hook()
File "/Users/runner/miniconda3/envs/test/lib/python3.12/site-packages/_pytest/threadexception.py", line 63, in thread_exception_runtest_hook
yield
File "/Users/runner/miniconda3/envs/test/lib/python3.12/site-packages/pluggy/_callers.py", line 167, in _multicall
teardown.throw(outcome._exception)
File "/Users/runner/miniconda3/envs/test/lib/python3.12/site-packages/_pytest/unraisableexception.py", line 90, in pytest_runtest_call
yield from unraisable_exception_runtest_hook()
File "/Users/runner/miniconda3/envs/test/lib/python3.12/site-packages/_pytest/unraisableexception.py", line 65, in unraisable_exception_runtest_hook
yield
File "/Users/runner/miniconda3/envs/test/lib/python3.12/site-packages/pluggy/_callers.py", line 167, in _multicall
teardown.throw(outcome._exception)
File "/Users/runner/miniconda3/envs/test/lib/python3.12/site-packages/_pytest/logging.py", line 850, in pytest_runtest_call
yield from self._runtest_for(item, "call")
File "/Users/runner/miniconda3/envs/test/lib/python3.12/site-packages/_pytest/logging.py", line 833, in _runtest_for
yield
File "/Users/runner/miniconda3/envs/test/lib/python3.12/site-packages/pluggy/_callers.py", line 167, in _multicall
teardown.throw(outcome._exception)
File "/Users/runner/miniconda3/envs/test/lib/python3.12/site-packages/_pytest/capture.py", line 878, in pytest_runtest_call
return (yield)
^^^^^
File "/Users/runner/miniconda3/envs/test/lib/python3.12/site-packages/pluggy/_callers.py", line 167, in _multicall
teardown.throw(outcome._exception)
File "/Users/runner/miniconda3/envs/test/lib/python3.12/site-packages/_pytest/skipping.py", line 257, in pytest_runtest_call
return (yield)
^^^^^
File "/Users/runner/miniconda3/envs/test/lib/python3.12/site-packages/pluggy/_callers.py", line 103, in _multicall
res = hook_impl.function(*args)
^^^^^^^^^^^^^^^^^^^^^^^^^
File "/Users/runner/miniconda3/envs/test/lib/python3.12/site-packages/_pytest/runner.py", line 183, in pytest_runtest_call
raise e
File "/Users/runner/miniconda3/envs/test/lib/python3.12/site-packages/_pytest/runner.py", line 173, in pytest_runtest_call
item.runtest()
File "/Users/runner/miniconda3/envs/test/lib/python3.12/site-packages/_pytest/python.py", line 1632, in runtest
self.ihook.pytest_pyfunc_call(pyfuncitem=self)
File "/Users/runner/miniconda3/envs/test/lib/python3.12/site-packages/pluggy/_hooks.py", line 513, in __call__
return self._hookexec(self.name, self._hookimpls.copy(), kwargs, firstresult)
^^^^^^^^^^^^^^^^^^^^^^^^^^^^^^^^^^^^^^^^^^^^^^^^^^^^^^^^^^^^^^^^^^^^^^
File "/Users/runner/miniconda3/envs/test/lib/python3.12/site-packages/pluggy/_manager.py", line 120, in _hookexec
return self._inner_hookexec(hook_name, methods, kwargs, firstresult)
^^^^^^^^^^^^^^^^^^^^^^^^^^^^^^^^^^^^^^^^^^^^^^^^^^^^^^^^^^^^^
File "/Users/runner/miniconda3/envs/test/lib/python3.12/site-packages/pluggy/_callers.py", line 139, in _multicall
raise exception.with_traceback(exception.__traceback__)
File "/Users/runner/miniconda3/envs/test/lib/python3.12/site-packages/pluggy/_callers.py", line 103, in _multicall
res = hook_impl.function(*args)
^^^^^^^^^^^^^^^^^^^^^^^^^
File "/Users/runner/miniconda3/envs/test/lib/python3.12/site-packages/_pytest/python.py", line 162, in pytest_pyfunc_call
result = testfunction(**testargs)
^^^^^^^^^^^^^^^^^^^^^^^^
File "/Users/runner/miniconda3/envs/test/lib/python3.12/unittest/mock.py", line 1390, in patched
return func(*newargs, **newkeywargs)
^^^^^^^^^^^^^^^^^^^^^^^^^^^^^
File "/Users/runner/miniconda3/envs/test/lib/python3.12/site-packages/obspy/clients/fdsn/tests/test_client.py", line 1514, in test_service_unavailable_exception
self.client.get_stations()
File "/Users/runner/miniconda3/envs/test/lib/python3.12/site-packages/obspy/clients/fdsn/client.py", line 747, in get_stations
raise ValueError(msg)
ValueError: The current client does not have a station service.
Traceback (most recent call last):
File "/Users/runner/miniconda3/envs/test/lib/python3.12/site-packages/_pytest/runner.py", line 341, in from_call
result: Optional[TResult] = func()
^^^^^^
File "/Users/runner/miniconda3/envs/test/lib/python3.12/site-packages/_pytest/runner.py", line 241, in <lambda>
lambda: runtest_hook(item=item, **kwds), when=when, reraise=reraise
^^^^^^^^^^^^^^^^^^^^^^^^^^^^^^^
File "/Users/runner/miniconda3/envs/test/lib/python3.12/site-packages/pluggy/_hooks.py", line 513, in __call__
return self._hookexec(self.name, self._hookimpls.copy(), kwargs, firstresult)
^^^^^^^^^^^^^^^^^^^^^^^^^^^^^^^^^^^^^^^^^^^^^^^^^^^^^^^^^^^^^^^^^^^^^^
File "/Users/runner/miniconda3/envs/test/lib/python3.12/site-packages/pluggy/_manager.py", line 120, in _hookexec
return self._inner_hookexec(hook_name, methods, kwargs, firstresult)
^^^^^^^^^^^^^^^^^^^^^^^^^^^^^^^^^^^^^^^^^^^^^^^^^^^^^^^^^^^^^
File "/Users/runner/miniconda3/envs/test/lib/python3.12/site-packages/pluggy/_callers.py", line 182, in _multicall
return outcome.get_result()
^^^^^^^^^^^^^^^^^^^^
File "/Users/runner/miniconda3/envs/test/lib/python3.12/site-packages/pluggy/_result.py", line 100, in get_result
raise exc.with_traceback(exc.__traceback__)
File "/Users/runner/miniconda3/envs/test/lib/python3.12/site-packages/pluggy/_callers.py", line 167, in _multicall
teardown.throw(outcome._exception)
File "/Users/runner/miniconda3/envs/test/lib/python3.12/site-packages/_pytest/threadexception.py", line 87, in pytest_runtest_call
yield from thread_exception_runtest_hook()
File "/Users/runner/miniconda3/envs/test/lib/python3.12/site-packages/_pytest/threadexception.py", line 63, in thread_exception_runtest_hook
yield
File "/Users/runner/miniconda3/envs/test/lib/python3.12/site-packages/pluggy/_callers.py", line 167, in _multicall
teardown.throw(outcome._exception)
File "/Users/runner/miniconda3/envs/test/lib/python3.12/site-packages/_pytest/unraisableexception.py", line 90, in pytest_runtest_call
yield from unraisable_exception_runtest_hook()
File "/Users/runner/miniconda3/envs/test/lib/python3.12/site-packages/_pytest/unraisableexception.py", line 65, in unraisable_exception_runtest_hook
yield
File "/Users/runner/miniconda3/envs/test/lib/python3.12/site-packages/pluggy/_callers.py", line 167, in _multicall
teardown.throw(outcome._exception)
File "/Users/runner/miniconda3/envs/test/lib/python3.12/site-packages/_pytest/logging.py", line 850, in pytest_runtest_call
yield from self._runtest_for(item, "call")
File "/Users/runner/miniconda3/envs/test/lib/python3.12/site-packages/_pytest/logging.py", line 833, in _runtest_for
yield
File "/Users/runner/miniconda3/envs/test/lib/python3.12/site-packages/pluggy/_callers.py", line 167, in _multicall
teardown.throw(outcome._exception)
File "/Users/runner/miniconda3/envs/test/lib/python3.12/site-packages/_pytest/capture.py", line 878, in pytest_runtest_call
return (yield)
^^^^^
File "/Users/runner/miniconda3/envs/test/lib/python3.12/site-packages/pluggy/_callers.py", line 167, in _multicall
teardown.throw(outcome._exception)
File "/Users/runner/miniconda3/envs/test/lib/python3.12/site-packages/_pytest/skipping.py", line 257, in pytest_runtest_call
return (yield)
^^^^^
File "/Users/runner/miniconda3/envs/test/lib/python3.12/site-packages/pluggy/_callers.py", line 103, in _multicall
res = hook_impl.function(*args)
^^^^^^^^^^^^^^^^^^^^^^^^^
File "/Users/runner/miniconda3/envs/test/lib/python3.12/site-packages/_pytest/runner.py", line 183, in pytest_runtest_call
raise e
File "/Users/runner/miniconda3/envs/test/lib/python3.12/site-packages/_pytest/runner.py", line 173, in pytest_runtest_call
item.runtest()
File "/Users/runner/miniconda3/envs/test/lib/python3.12/site-packages/_pytest/python.py", line 1632, in runtest
self.ihook.pytest_pyfunc_call(pyfuncitem=self)
File "/Users/runner/miniconda3/envs/test/lib/python3.12/site-packages/pluggy/_hooks.py", line 513, in __call__
return self._hookexec(self.name, self._hookimpls.copy(), kwargs, firstresult)
^^^^^^^^^^^^^^^^^^^^^^^^^^^^^^^^^^^^^^^^^^^^^^^^^^^^^^^^^^^^^^^^^^^^^^
File "/Users/runner/miniconda3/envs/test/lib/python3.12/site-packages/pluggy/_manager.py", line 120, in _hookexec
return self._inner_hookexec(hook_name, methods, kwargs, firstresult)
^^^^^^^^^^^^^^^^^^^^^^^^^^^^^^^^^^^^^^^^^^^^^^^^^^^^^^^^^^^^^
File "/Users/runner/miniconda3/envs/test/lib/python3.12/site-packages/pluggy/_callers.py", line 139, in _multicall
raise exception.with_traceback(exception.__traceback__)
File "/Users/runner/miniconda3/envs/test/lib/python3.12/site-packages/pluggy/_callers.py", line 103, in _multicall
res = hook_impl.function(*args)
^^^^^^^^^^^^^^^^^^^^^^^^^
File "/Users/runner/miniconda3/envs/test/lib/python3.12/site-packages/_pytest/python.py", line 162, in pytest_pyfunc_call
result = testfunction(**testargs)
^^^^^^^^^^^^^^^^^^^^^^^^
File "/Users/runner/miniconda3/envs/test/lib/python3.12/unittest/mock.py", line 1390, in patched
return func(*newargs, **newkeywargs)
^^^^^^^^^^^^^^^^^^^^^^^^^^^^^
File "/Users/runner/miniconda3/envs/test/lib/python3.12/site-packages/obspy/clients/fdsn/tests/test_client.py", line 1523, in test_bad_request_exception
self.client.get_stations()
File "/Users/runner/miniconda3/envs/test/lib/python3.12/site-packages/obspy/clients/fdsn/client.py", line 747, in get_stations
raise ValueError(msg)
ValueError: The current client does not have a station service.
Traceback (most recent call last):
File "/Users/runner/miniconda3/envs/test/lib/python3.12/site-packages/_pytest/runner.py", line 341, in from_call
result: Optional[TResult] = func()
^^^^^^
File "/Users/runner/miniconda3/envs/test/lib/python3.12/site-packages/_pytest/runner.py", line 241, in <lambda>
lambda: runtest_hook(item=item, **kwds), when=when, reraise=reraise
^^^^^^^^^^^^^^^^^^^^^^^^^^^^^^^
File "/Users/runner/miniconda3/envs/test/lib/python3.12/site-packages/pluggy/_hooks.py", line 513, in __call__
return self._hookexec(self.name, self._hookimpls.copy(), kwargs, firstresult)
^^^^^^^^^^^^^^^^^^^^^^^^^^^^^^^^^^^^^^^^^^^^^^^^^^^^^^^^^^^^^^^^^^^^^^
File "/Users/runner/miniconda3/envs/test/lib/python3.12/site-packages/pluggy/_manager.py", line 120, in _hookexec
return self._inner_hookexec(hook_name, methods, kwargs, firstresult)
^^^^^^^^^^^^^^^^^^^^^^^^^^^^^^^^^^^^^^^^^^^^^^^^^^^^^^^^^^^^^
File "/Users/runner/miniconda3/envs/test/lib/python3.12/site-packages/pluggy/_callers.py", line 182, in _multicall
return outcome.get_result()
^^^^^^^^^^^^^^^^^^^^
File "/Users/runner/miniconda3/envs/test/lib/python3.12/site-packages/pluggy/_result.py", line 100, in get_result
raise exc.with_traceback(exc.__traceback__)
File "/Users/runner/miniconda3/envs/test/lib/python3.12/site-packages/pluggy/_callers.py", line 167, in _multicall
teardown.throw(outcome._exception)
File "/Users/runner/miniconda3/envs/test/lib/python3.12/site-packages/_pytest/threadexception.py", line 87, in pytest_runtest_call
yield from thread_exception_runtest_hook()
File "/Users/runner/miniconda3/envs/test/lib/python3.12/site-packages/_pytest/threadexception.py", line 63, in thread_exception_runtest_hook
yield
File "/Users/runner/miniconda3/envs/test/lib/python3.12/site-packages/pluggy/_callers.py", line 167, in _multicall
teardown.throw(outcome._exception)
File "/Users/runner/miniconda3/envs/test/lib/python3.12/site-packages/_pytest/unraisableexception.py", line 90, in pytest_runtest_call
yield from unraisable_exception_runtest_hook()
File "/Users/runner/miniconda3/envs/test/lib/python3.12/site-packages/_pytest/unraisableexception.py", line 65, in unraisable_exception_runtest_hook
yield
File "/Users/runner/miniconda3/envs/test/lib/python3.12/site-packages/pluggy/_callers.py", line 167, in _multicall
teardown.throw(outcome._exception)
File "/Users/runner/miniconda3/envs/test/lib/python3.12/site-packages/_pytest/logging.py", line 850, in pytest_runtest_call
yield from self._runtest_for(item, "call")
File "/Users/runner/miniconda3/envs/test/lib/python3.12/site-packages/_pytest/logging.py", line 833, in _runtest_for
yield
File "/Users/runner/miniconda3/envs/test/lib/python3.12/site-packages/pluggy/_callers.py", line 167, in _multicall
teardown.throw(outcome._exception)
File "/Users/runner/miniconda3/envs/test/lib/python3.12/site-packages/_pytest/capture.py", line 878, in pytest_runtest_call
return (yield)
^^^^^
File "/Users/runner/miniconda3/envs/test/lib/python3.12/site-packages/pluggy/_callers.py", line 167, in _multicall
teardown.throw(outcome._exception)
File "/Users/runner/miniconda3/envs/test/lib/python3.12/site-packages/_pytest/skipping.py", line 257, in pytest_runtest_call
return (yield)
^^^^^
File "/Users/runner/miniconda3/envs/test/lib/python3.12/site-packages/pluggy/_callers.py", line 103, in _multicall
res = hook_impl.function(*args)
^^^^^^^^^^^^^^^^^^^^^^^^^
File "/Users/runner/miniconda3/envs/test/lib/python3.12/site-packages/_pytest/runner.py", line 183, in pytest_runtest_call
raise e
File "/Users/runner/miniconda3/envs/test/lib/python3.12/site-packages/_pytest/runner.py", line 173, in pytest_runtest_call
item.runtest()
File "/Users/runner/miniconda3/envs/test/lib/python3.12/site-packages/_pytest/python.py", line 1632, in runtest
self.ihook.pytest_pyfunc_call(pyfuncitem=self)
File "/Users/runner/miniconda3/envs/test/lib/python3.12/site-packages/pluggy/_hooks.py", line 513, in __call__
return self._hookexec(self.name, self._hookimpls.copy(), kwargs, firstresult)
^^^^^^^^^^^^^^^^^^^^^^^^^^^^^^^^^^^^^^^^^^^^^^^^^^^^^^^^^^^^^^^^^^^^^^
File "/Users/runner/miniconda3/envs/test/lib/python3.12/site-packages/pluggy/_manager.py", line 120, in _hookexec
return self._inner_hookexec(hook_name, methods, kwargs, firstresult)
^^^^^^^^^^^^^^^^^^^^^^^^^^^^^^^^^^^^^^^^^^^^^^^^^^^^^^^^^^^^^
File "/Users/runner/miniconda3/envs/test/lib/python3.12/site-packages/pluggy/_callers.py", line 139, in _multicall
raise exception.with_traceback(exception.__traceback__)
File "/Users/runner/miniconda3/envs/test/lib/python3.12/site-packages/pluggy/_callers.py", line 103, in _multicall
res = hook_impl.function(*args)
^^^^^^^^^^^^^^^^^^^^^^^^^
File "/Users/runner/miniconda3/envs/test/lib/python3.12/site-packages/_pytest/python.py", line 162, in pytest_pyfunc_call
result = testfunction(**testargs)
^^^^^^^^^^^^^^^^^^^^^^^^
File "/Users/runner/miniconda3/envs/test/lib/python3.12/unittest/mock.py", line 1390, in patched
return func(*newargs, **newkeywargs)
^^^^^^^^^^^^^^^^^^^^^^^^^^^^^
File "/Users/runner/miniconda3/envs/test/lib/python3.12/site-packages/obspy/clients/fdsn/tests/test_client.py", line 1532, in test_server_exception
self.client.get_stations()
File "/Users/runner/miniconda3/envs/test/lib/python3.12/site-packages/obspy/clients/fdsn/client.py", line 747, in get_stations
raise ValueError(msg)
ValueError: The current client does not have a station service.
Traceback (most recent call last):
File "/Users/runner/miniconda3/envs/test/lib/python3.12/site-packages/_pytest/runner.py", line 341, in from_call
result: Optional[TResult] = func()
^^^^^^
File "/Users/runner/miniconda3/envs/test/lib/python3.12/site-packages/_pytest/runner.py", line 241, in <lambda>
lambda: runtest_hook(item=item, **kwds), when=when, reraise=reraise
^^^^^^^^^^^^^^^^^^^^^^^^^^^^^^^
File "/Users/runner/miniconda3/envs/test/lib/python3.12/site-packages/pluggy/_hooks.py", line 513, in __call__
return self._hookexec(self.name, self._hookimpls.copy(), kwargs, firstresult)
^^^^^^^^^^^^^^^^^^^^^^^^^^^^^^^^^^^^^^^^^^^^^^^^^^^^^^^^^^^^^^^^^^^^^^
File "/Users/runner/miniconda3/envs/test/lib/python3.12/site-packages/pluggy/_manager.py", line 120, in _hookexec
return self._inner_hookexec(hook_name, methods, kwargs, firstresult)
^^^^^^^^^^^^^^^^^^^^^^^^^^^^^^^^^^^^^^^^^^^^^^^^^^^^^^^^^^^^^
File "/Users/runner/miniconda3/envs/test/lib/python3.12/site-packages/pluggy/_callers.py", line 182, in _multicall
return outcome.get_result()
^^^^^^^^^^^^^^^^^^^^
File "/Users/runner/miniconda3/envs/test/lib/python3.12/site-packages/pluggy/_result.py", line 100, in get_result
raise exc.with_traceback(exc.__traceback__)
File "/Users/runner/miniconda3/envs/test/lib/python3.12/site-packages/pluggy/_callers.py", line 167, in _multicall
teardown.throw(outcome._exception)
File "/Users/runner/miniconda3/envs/test/lib/python3.12/site-packages/_pytest/threadexception.py", line 87, in pytest_runtest_call
yield from thread_exception_runtest_hook()
File "/Users/runner/miniconda3/envs/test/lib/python3.12/site-packages/_pytest/threadexception.py", line 63, in thread_exception_runtest_hook
yield
File "/Users/runner/miniconda3/envs/test/lib/python3.12/site-packages/pluggy/_callers.py", line 167, in _multicall
teardown.throw(outcome._exception)
File "/Users/runner/miniconda3/envs/test/lib/python3.12/site-packages/_pytest/unraisableexception.py", line 90, in pytest_runtest_call
yield from unraisable_exception_runtest_hook()
File "/Users/runner/miniconda3/envs/test/lib/python3.12/site-packages/_pytest/unraisableexception.py", line 65, in unraisable_exception_runtest_hook
yield
File "/Users/runner/miniconda3/envs/test/lib/python3.12/site-packages/pluggy/_callers.py", line 167, in _multicall
teardown.throw(outcome._exception)
File "/Users/runner/miniconda3/envs/test/lib/python3.12/site-packages/_pytest/logging.py", line 850, in pytest_runtest_call
yield from self._runtest_for(item, "call")
File "/Users/runner/miniconda3/envs/test/lib/python3.12/site-packages/_pytest/logging.py", line 833, in _runtest_for
yield
File "/Users/runner/miniconda3/envs/test/lib/python3.12/site-packages/pluggy/_callers.py", line 167, in _multicall
teardown.throw(outcome._exception)
File "/Users/runner/miniconda3/envs/test/lib/python3.12/site-packages/_pytest/capture.py", line 878, in pytest_runtest_call
return (yield)
^^^^^
File "/Users/runner/miniconda3/envs/test/lib/python3.12/site-packages/pluggy/_callers.py", line 167, in _multicall
teardown.throw(outcome._exception)
File "/Users/runner/miniconda3/envs/test/lib/python3.12/site-packages/_pytest/skipping.py", line 257, in pytest_runtest_call
return (yield)
^^^^^
File "/Users/runner/miniconda3/envs/test/lib/python3.12/site-packages/pluggy/_callers.py", line 103, in _multicall
res = hook_impl.function(*args)
^^^^^^^^^^^^^^^^^^^^^^^^^
File "/Users/runner/miniconda3/envs/test/lib/python3.12/site-packages/_pytest/runner.py", line 183, in pytest_runtest_call
raise e
File "/Users/runner/miniconda3/envs/test/lib/python3.12/site-packages/_pytest/runner.py", line 173, in pytest_runtest_call
item.runtest()
File "/Users/runner/miniconda3/envs/test/lib/python3.12/site-packages/_pytest/python.py", line 1632, in runtest
self.ihook.pytest_pyfunc_call(pyfuncitem=self)
File "/Users/runner/miniconda3/envs/test/lib/python3.12/site-packages/pluggy/_hooks.py", line 513, in __call__
return self._hookexec(self.name, self._hookimpls.copy(), kwargs, firstresult)
^^^^^^^^^^^^^^^^^^^^^^^^^^^^^^^^^^^^^^^^^^^^^^^^^^^^^^^^^^^^^^^^^^^^^^
File "/Users/runner/miniconda3/envs/test/lib/python3.12/site-packages/pluggy/_manager.py", line 120, in _hookexec
return self._inner_hookexec(hook_name, methods, kwargs, firstresult)
^^^^^^^^^^^^^^^^^^^^^^^^^^^^^^^^^^^^^^^^^^^^^^^^^^^^^^^^^^^^^
File "/Users/runner/miniconda3/envs/test/lib/python3.12/site-packages/pluggy/_callers.py", line 139, in _multicall
raise exception.with_traceback(exception.__traceback__)
File "/Users/runner/miniconda3/envs/test/lib/python3.12/site-packages/pluggy/_callers.py", line 103, in _multicall
res = hook_impl.function(*args)
^^^^^^^^^^^^^^^^^^^^^^^^^
File "/Users/runner/miniconda3/envs/test/lib/python3.12/site-packages/_pytest/python.py", line 162, in pytest_pyfunc_call
result = testfunction(**testargs)
^^^^^^^^^^^^^^^^^^^^^^^^
File "/Users/runner/miniconda3/envs/test/lib/python3.12/unittest/mock.py", line 1390, in patched
return func(*newargs, **newkeywargs)
^^^^^^^^^^^^^^^^^^^^^^^^^^^^^
File "/Users/runner/miniconda3/envs/test/lib/python3.12/site-packages/obspy/clients/fdsn/tests/test_client.py", line 1541, in test_too_many_requests_exception
self.client.get_stations()
File "/Users/runner/miniconda3/envs/test/lib/python3.12/site-packages/obspy/clients/fdsn/client.py", line 747, in get_stations
raise ValueError(msg)
ValueError: The current client does not have a station service.
Traceback (most recent call last):
File "/Users/runner/miniconda3/envs/test/lib/python3.12/site-packages/_pytest/runner.py", line 341, in from_call
result: Optional[TResult] = func()
^^^^^^
File "/Users/runner/miniconda3/envs/test/lib/python3.12/site-packages/_pytest/runner.py", line 241, in <lambda>
lambda: runtest_hook(item=item, **kwds), when=when, reraise=reraise
^^^^^^^^^^^^^^^^^^^^^^^^^^^^^^^
File "/Users/runner/miniconda3/envs/test/lib/python3.12/site-packages/pluggy/_hooks.py", line 513, in __call__
return self._hookexec(self.name, self._hookimpls.copy(), kwargs, firstresult)
^^^^^^^^^^^^^^^^^^^^^^^^^^^^^^^^^^^^^^^^^^^^^^^^^^^^^^^^^^^^^^^^^^^^^^
File "/Users/runner/miniconda3/envs/test/lib/python3.12/site-packages/pluggy/_manager.py", line 120, in _hookexec
return self._inner_hookexec(hook_name, methods, kwargs, firstresult)
^^^^^^^^^^^^^^^^^^^^^^^^^^^^^^^^^^^^^^^^^^^^^^^^^^^^^^^^^^^^^
File "/Users/runner/miniconda3/envs/test/lib/python3.12/site-packages/pluggy/_callers.py", line 182, in _multicall
return outcome.get_result()
^^^^^^^^^^^^^^^^^^^^
File "/Users/runner/miniconda3/envs/test/lib/python3.12/site-packages/pluggy/_result.py", line 100, in get_result
raise exc.with_traceback(exc.__traceback__)
File "/Users/runner/miniconda3/envs/test/lib/python3.12/site-packages/pluggy/_callers.py", line 167, in _multicall
teardown.throw(outcome._exception)
File "/Users/runner/miniconda3/envs/test/lib/python3.12/site-packages/_pytest/threadexception.py", line 87, in pytest_runtest_call
yield from thread_exception_runtest_hook()
File "/Users/runner/miniconda3/envs/test/lib/python3.12/site-packages/_pytest/threadexception.py", line 63, in thread_exception_runtest_hook
yield
File "/Users/runner/miniconda3/envs/test/lib/python3.12/site-packages/pluggy/_callers.py", line 167, in _multicall
teardown.throw(outcome._exception)
File "/Users/runner/miniconda3/envs/test/lib/python3.12/site-packages/_pytest/unraisableexception.py", line 90, in pytest_runtest_call
yield from unraisable_exception_runtest_hook()
File "/Users/runner/miniconda3/envs/test/lib/python3.12/site-packages/_pytest/unraisableexception.py", line 65, in unraisable_exception_runtest_hook
yield
File "/Users/runner/miniconda3/envs/test/lib/python3.12/site-packages/pluggy/_callers.py", line 167, in _multicall
teardown.throw(outcome._exception)
File "/Users/runner/miniconda3/envs/test/lib/python3.12/site-packages/_pytest/logging.py", line 850, in pytest_runtest_call
yield from self._runtest_for(item, "call")
File "/Users/runner/miniconda3/envs/test/lib/python3.12/site-packages/_pytest/logging.py", line 833, in _runtest_for
yield
File "/Users/runner/miniconda3/envs/test/lib/python3.12/site-packages/pluggy/_callers.py", line 167, in _multicall
teardown.throw(outcome._exception)
File "/Users/runner/miniconda3/envs/test/lib/python3.12/site-packages/_pytest/capture.py", line 878, in pytest_runtest_call
return (yield)
^^^^^
File "/Users/runner/miniconda3/envs/test/lib/python3.12/site-packages/pluggy/_callers.py", line 167, in _multicall
teardown.throw(outcome._exception)
File "/Users/runner/miniconda3/envs/test/lib/python3.12/site-packages/_pytest/skipping.py", line 257, in pytest_runtest_call
return (yield)
^^^^^
File "/Users/runner/miniconda3/envs/test/lib/python3.12/site-packages/pluggy/_callers.py", line 103, in _multicall
res = hook_impl.function(*args)
^^^^^^^^^^^^^^^^^^^^^^^^^
File "/Users/runner/miniconda3/envs/test/lib/python3.12/site-packages/_pytest/runner.py", line 183, in pytest_runtest_call
raise e
File "/Users/runner/miniconda3/envs/test/lib/python3.12/site-packages/_pytest/runner.py", line 173, in pytest_runtest_call
item.runtest()
File "/Users/runner/miniconda3/envs/test/lib/python3.12/site-packages/_pytest/python.py", line 1632, in runtest
self.ihook.pytest_pyfunc_call(pyfuncitem=self)
File "/Users/runner/miniconda3/envs/test/lib/python3.12/site-packages/pluggy/_hooks.py", line 513, in __call__
return self._hookexec(self.name, self._hookimpls.copy(), kwargs, firstresult)
^^^^^^^^^^^^^^^^^^^^^^^^^^^^^^^^^^^^^^^^^^^^^^^^^^^^^^^^^^^^^^^^^^^^^^
File "/Users/runner/miniconda3/envs/test/lib/python3.12/site-packages/pluggy/_manager.py", line 120, in _hookexec
return self._inner_hookexec(hook_name, methods, kwargs, firstresult)
^^^^^^^^^^^^^^^^^^^^^^^^^^^^^^^^^^^^^^^^^^^^^^^^^^^^^^^^^^^^^
File "/Users/runner/miniconda3/envs/test/lib/python3.12/site-packages/pluggy/_callers.py", line 139, in _multicall
raise exception.with_traceback(exception.__traceback__)
File "/Users/runner/miniconda3/envs/test/lib/python3.12/site-packages/pluggy/_callers.py", line 103, in _multicall
res = hook_impl.function(*args)
^^^^^^^^^^^^^^^^^^^^^^^^^
File "/Users/runner/miniconda3/envs/test/lib/python3.12/site-packages/_pytest/python.py", line 162, in pytest_pyfunc_call
result = testfunction(**testargs)
^^^^^^^^^^^^^^^^^^^^^^^^
File "/Users/runner/miniconda3/envs/test/lib/python3.12/site-packages/obspy/clients/fdsn/tests/test_federator_routing_client.py", line 308, in test_get_waveforms_integration_test
assert len(st) >= 1
AssertionError: assert 0 >= 1
+ where 0 = len(<obspy.core.stream.Stream object at 0x11d9d4680>)
Traceback (most recent call last):
File "/Users/runner/miniconda3/envs/test/lib/python3.12/site-packages/_pytest/runner.py", line 341, in from_call
result: Optional[TResult] = func()
^^^^^^
File "/Users/runner/miniconda3/envs/test/lib/python3.12/site-packages/_pytest/runner.py", line 241, in <lambda>
lambda: runtest_hook(item=item, **kwds), when=when, reraise=reraise
^^^^^^^^^^^^^^^^^^^^^^^^^^^^^^^
File "/Users/runner/miniconda3/envs/test/lib/python3.12/site-packages/pluggy/_hooks.py", line 513, in __call__
return self._hookexec(self.name, self._hookimpls.copy(), kwargs, firstresult)
^^^^^^^^^^^^^^^^^^^^^^^^^^^^^^^^^^^^^^^^^^^^^^^^^^^^^^^^^^^^^^^^^^^^^^
File "/Users/runner/miniconda3/envs/test/lib/python3.12/site-packages/pluggy/_manager.py", line 120, in _hookexec
return self._inner_hookexec(hook_name, methods, kwargs, firstresult)
^^^^^^^^^^^^^^^^^^^^^^^^^^^^^^^^^^^^^^^^^^^^^^^^^^^^^^^^^^^^^
File "/Users/runner/miniconda3/envs/test/lib/python3.12/site-packages/pluggy/_callers.py", line 182, in _multicall
return outcome.get_result()
^^^^^^^^^^^^^^^^^^^^
File "/Users/runner/miniconda3/envs/test/lib/python3.12/site-packages/pluggy/_result.py", line 100, in get_result
raise exc.with_traceback(exc.__traceback__)
File "/Users/runner/miniconda3/envs/test/lib/python3.12/site-packages/pluggy/_callers.py", line 167, in _multicall
teardown.throw(outcome._exception)
File "/Users/runner/miniconda3/envs/test/lib/python3.12/site-packages/_pytest/threadexception.py", line 87, in pytest_runtest_call
yield from thread_exception_runtest_hook()
File "/Users/runner/miniconda3/envs/test/lib/python3.12/site-packages/_pytest/threadexception.py", line 63, in thread_exception_runtest_hook
yield
File "/Users/runner/miniconda3/envs/test/lib/python3.12/site-packages/pluggy/_callers.py", line 167, in _multicall
teardown.throw(outcome._exception)
File "/Users/runner/miniconda3/envs/test/lib/python3.12/site-packages/_pytest/unraisableexception.py", line 90, in pytest_runtest_call
yield from unraisable_exception_runtest_hook()
File "/Users/runner/miniconda3/envs/test/lib/python3.12/site-packages/_pytest/unraisableexception.py", line 65, in unraisable_exception_runtest_hook
yield
File "/Users/runner/miniconda3/envs/test/lib/python3.12/site-packages/pluggy/_callers.py", line 167, in _multicall
teardown.throw(outcome._exception)
File "/Users/runner/miniconda3/envs/test/lib/python3.12/site-packages/_pytest/logging.py", line 850, in pytest_runtest_call
yield from self._runtest_for(item, "call")
File "/Users/runner/miniconda3/envs/test/lib/python3.12/site-packages/_pytest/logging.py", line 833, in _runtest_for
yield
File "/Users/runner/miniconda3/envs/test/lib/python3.12/site-packages/pluggy/_callers.py", line 167, in _multicall
teardown.throw(outcome._exception)
File "/Users/runner/miniconda3/envs/test/lib/python3.12/site-packages/_pytest/capture.py", line 878, in pytest_runtest_call
return (yield)
^^^^^
File "/Users/runner/miniconda3/envs/test/lib/python3.12/site-packages/pluggy/_callers.py", line 167, in _multicall
teardown.throw(outcome._exception)
File "/Users/runner/miniconda3/envs/test/lib/python3.12/site-packages/_pytest/skipping.py", line 257, in pytest_runtest_call
return (yield)
^^^^^
File "/Users/runner/miniconda3/envs/test/lib/python3.12/site-packages/pluggy/_callers.py", line 103, in _multicall
res = hook_impl.function(*args)
^^^^^^^^^^^^^^^^^^^^^^^^^
File "/Users/runner/miniconda3/envs/test/lib/python3.12/site-packages/_pytest/runner.py", line 183, in pytest_runtest_call
raise e
File "/Users/runner/miniconda3/envs/test/lib/python3.12/site-packages/_pytest/runner.py", line 173, in pytest_runtest_call
item.runtest()
File "/Users/runner/miniconda3/envs/test/lib/python3.12/site-packages/_pytest/python.py", line 1632, in runtest
self.ihook.pytest_pyfunc_call(pyfuncitem=self)
File "/Users/runner/miniconda3/envs/test/lib/python3.12/site-packages/pluggy/_hooks.py", line 513, in __call__
return self._hookexec(self.name, self._hookimpls.copy(), kwargs, firstresult)
^^^^^^^^^^^^^^^^^^^^^^^^^^^^^^^^^^^^^^^^^^^^^^^^^^^^^^^^^^^^^^^^^^^^^^
File "/Users/runner/miniconda3/envs/test/lib/python3.12/site-packages/pluggy/_manager.py", line 120, in _hookexec
return self._inner_hookexec(hook_name, methods, kwargs, firstresult)
^^^^^^^^^^^^^^^^^^^^^^^^^^^^^^^^^^^^^^^^^^^^^^^^^^^^^^^^^^^^^
File "/Users/runner/miniconda3/envs/test/lib/python3.12/site-packages/pluggy/_callers.py", line 139, in _multicall
raise exception.with_traceback(exception.__traceback__)
File "/Users/runner/miniconda3/envs/test/lib/python3.12/site-packages/pluggy/_callers.py", line 103, in _multicall
res = hook_impl.function(*args)
^^^^^^^^^^^^^^^^^^^^^^^^^
File "/Users/runner/miniconda3/envs/test/lib/python3.12/site-packages/_pytest/python.py", line 162, in pytest_pyfunc_call
result = testfunction(**testargs)
^^^^^^^^^^^^^^^^^^^^^^^^
File "/Users/runner/miniconda3/envs/test/lib/python3.12/site-packages/obspy/clients/fdsn/tests/test_federator_routing_client.py", line 332, in test_get_stations_integration_test
assert len(inv) >= 1
AssertionError: assert 0 >= 1
+ where 0 = len(<obspy.core.inventory.inventory.Inventory object at 0x11d9d5250>)
913 or nothing, depending on the ``output`` parameter.
914
915 .. rubric:: Examples
916
917 (1) Returning frequency, amplitude, phase of first point.
918
919 >>> from obspy.clients.iris import Client
920 >>> client = Client()
921 >>> dt = UTCDateTime("2005-01-01")
922 >>> data = client.evalresp("IU", "ANMO", "00", "BHZ", dt,
UNEXPECTED EXCEPTION: <HTTPError 404: ''>
Traceback (most recent call last):
File "/Users/runner/miniconda3/envs/test/lib/python3.12/doctest.py", line 1361, in __run
exec(compile(example.source, filename, "single",
File "<doctest obspy.clients.iris.client.Client.evalresp[3]>", line 1, in <module>
File "/Users/runner/miniconda3/envs/test/lib/python3.12/site-packages/obspy/clients/iris/client.py", line 970, in evalresp
data = self._fetch("evalresp", **kwargs)
^^^^^^^^^^^^^^^^^^^^^^^^^^^^^^^^^
File "/Users/runner/miniconda3/envs/test/lib/python3.12/site-packages/obspy/clients/iris/client.py", line 124, in _fetch
response = urllib_request.urlopen(req, timeout=self.timeout)
^^^^^^^^^^^^^^^^^^^^^^^^^^^^^^^^^^^^^^^^^^^^^^^^^
File "/Users/runner/miniconda3/envs/test/lib/python3.12/urllib/request.py", line 215, in urlopen
return opener.open(url, data, timeout)
^^^^^^^^^^^^^^^^^^^^^^^^^^^^^^^
File "/Users/runner/miniconda3/envs/test/lib/python3.12/urllib/request.py", line 521, in open
response = meth(req, response)
^^^^^^^^^^^^^^^^^^^
File "/Users/runner/miniconda3/envs/test/lib/python3.12/urllib/request.py", line 630, in http_response
response = self.parent.error(
^^^^^^^^^^^^^^^^^^
File "/Users/runner/miniconda3/envs/test/lib/python3.12/urllib/request.py", line 559, in error
return self._call_chain(*args)
^^^^^^^^^^^^^^^^^^^^^^^
File "/Users/runner/miniconda3/envs/test/lib/python3.12/urllib/request.py", line 492, in _call_chain
result = func(*args)
^^^^^^^^^^^
File "/Users/runner/miniconda3/envs/test/lib/python3.12/urllib/request.py", line 639, in http_error_default
raise HTTPError(req.full_url, code, msg, hdrs, fp)
urllib.error.HTTPError: HTTP Error 404:
/Users/runner/miniconda3/envs/test/lib/python3.12/site-packages/obspy/clients/iris/client.py:922: UnexpectedException
390 :rtype: str or ``None``
391 :return: SEED RESP file as string if no ``filename`` is given..
392
393 .. rubric:: Example
394
395 >>> from obspy.clients.iris import Client
396 >>> from obspy import UTCDateTime
397 >>> client = Client()
398 >>> dt = UTCDateTime("2010-02-27T06:30:00.000")
399 >>> data = client.resp("IU", "ANMO", "00", "BHZ", dt)
UNEXPECTED EXCEPTION: Exception('No response data available (HTTPError: HTTP Error 500: )')
Traceback (most recent call last):
File "/Users/runner/miniconda3/envs/test/lib/python3.12/site-packages/obspy/clients/iris/client.py", line 437, in resp
data = self._fetch("resp", **kwargs)
^^^^^^^^^^^^^^^^^^^^^^^^^^^^^
File "/Users/runner/miniconda3/envs/test/lib/python3.12/site-packages/obspy/clients/iris/client.py", line 124, in _fetch
response = urllib_request.urlopen(req, timeout=self.timeout)
^^^^^^^^^^^^^^^^^^^^^^^^^^^^^^^^^^^^^^^^^^^^^^^^^
File "/Users/runner/miniconda3/envs/test/lib/python3.12/urllib/request.py", line 215, in urlopen
return opener.open(url, data, timeout)
^^^^^^^^^^^^^^^^^^^^^^^^^^^^^^^
File "/Users/runner/miniconda3/envs/test/lib/python3.12/urllib/request.py", line 521, in open
response = meth(req, response)
^^^^^^^^^^^^^^^^^^^
File "/Users/runner/miniconda3/envs/test/lib/python3.12/urllib/request.py", line 630, in http_response
response = self.parent.error(
^^^^^^^^^^^^^^^^^^
File "/Users/runner/miniconda3/envs/test/lib/python3.12/urllib/request.py", line 559, in error
return self._call_chain(*args)
^^^^^^^^^^^^^^^^^^^^^^^
File "/Users/runner/miniconda3/envs/test/lib/python3.12/urllib/request.py", line 492, in _call_chain
result = func(*args)
^^^^^^^^^^^
File "/Users/runner/miniconda3/envs/test/lib/python3.12/urllib/request.py", line 639, in http_error_default
raise HTTPError(req.full_url, code, msg, hdrs, fp)
urllib.error.HTTPError: HTTP Error 500:
During handling of the above exception, another exception occurred:
Traceback (most recent call last):
File "/Users/runner/miniconda3/envs/test/lib/python3.12/doctest.py", line 1361, in __run
exec(compile(example.source, filename, "single",
File "<doctest obspy.clients.iris.client.Client.resp[4]>", line 1, in <module>
File "/Users/runner/miniconda3/envs/test/lib/python3.12/site-packages/obspy/clients/iris/client.py", line 441, in resp
raise Exception(msg)
Exception: No response data available (HTTPError: HTTP Error 500: )
/Users/runner/miniconda3/envs/test/lib/python3.12/site-packages/obspy/clients/iris/client.py:399: UnexpectedException
473 :return: String with SAC poles and zeros information if no ``filename``
474 is given.
475
476 .. rubric:: Example
477
478 >>> from obspy.clients.iris import Client
479 >>> from obspy import UTCDateTime
480 >>> client = Client()
481 >>> dt = UTCDateTime("2005-01-01")
482 >>> sacpz = client.sacpz("IU", "ANMO", "00", "BHZ", dt)
UNEXPECTED EXCEPTION: <HTTPError 500: ''>
Traceback (most recent call last):
File "/Users/runner/miniconda3/envs/test/lib/python3.12/doctest.py", line 1361, in __run
exec(compile(example.source, filename, "single",
File "<doctest obspy.clients.iris.client.Client.sacpz[4]>", line 1, in <module>
File "/Users/runner/miniconda3/envs/test/lib/python3.12/site-packages/obspy/clients/iris/client.py", line 540, in sacpz
data = self._fetch("sacpz", **kwargs)
^^^^^^^^^^^^^^^^^^^^^^^^^^^^^^
File "/Users/runner/miniconda3/envs/test/lib/python3.12/site-packages/obspy/clients/iris/client.py", line 124, in _fetch
response = urllib_request.urlopen(req, timeout=self.timeout)
^^^^^^^^^^^^^^^^^^^^^^^^^^^^^^^^^^^^^^^^^^^^^^^^^
File "/Users/runner/miniconda3/envs/test/lib/python3.12/urllib/request.py", line 215, in urlopen
return opener.open(url, data, timeout)
^^^^^^^^^^^^^^^^^^^^^^^^^^^^^^^
File "/Users/runner/miniconda3/envs/test/lib/python3.12/urllib/request.py", line 521, in open
response = meth(req, response)
^^^^^^^^^^^^^^^^^^^
File "/Users/runner/miniconda3/envs/test/lib/python3.12/urllib/request.py", line 630, in http_response
response = self.parent.error(
^^^^^^^^^^^^^^^^^^
File "/Users/runner/miniconda3/envs/test/lib/python3.12/urllib/request.py", line 559, in error
return self._call_chain(*args)
^^^^^^^^^^^^^^^^^^^^^^^
File "/Users/runner/miniconda3/envs/test/lib/python3.12/urllib/request.py", line 492, in _call_chain
result = func(*args)
^^^^^^^^^^^
File "/Users/runner/miniconda3/envs/test/lib/python3.12/urllib/request.py", line 639, in http_error_default
raise HTTPError(req.full_url, code, msg, hdrs, fp)
urllib.error.HTTPError: HTTP Error 500:
/Users/runner/miniconda3/envs/test/lib/python3.12/site-packages/obspy/clients/iris/client.py:482: UnexpectedException
297 :rtype: :class:`~obspy.core.stream.Stream` or ``None``
298 :return: ObsPy Stream object if no ``filename`` is given.
299
300 .. rubric:: Example
301
302 >>> from obspy.clients.iris import Client
303 >>> from obspy import UTCDateTime
304 >>> dt = UTCDateTime("2005-01-01T00:00:00")
305 >>> client = Client()
306 >>> st = client.timeseries("IU", "ANMO", "00", "BHZ", dt, dt+10)
UNEXPECTED EXCEPTION: Exception('No waveform data available (HTTPError: HTTP Error 500: )')
Traceback (most recent call last):
File "/Users/runner/miniconda3/envs/test/lib/python3.12/site-packages/obspy/clients/iris/client.py", line 331, in timeseries
data = self._fetch("timeseries", param_list=filter, **kwargs)
^^^^^^^^^^^^^^^^^^^^^^^^^^^^^^^^^^^^^^^^^^^^^^^^^^^^^^
File "/Users/runner/miniconda3/envs/test/lib/python3.12/site-packages/obspy/clients/iris/client.py", line 124, in _fetch
response = urllib_request.urlopen(req, timeout=self.timeout)
^^^^^^^^^^^^^^^^^^^^^^^^^^^^^^^^^^^^^^^^^^^^^^^^^
File "/Users/runner/miniconda3/envs/test/lib/python3.12/urllib/request.py", line 215, in urlopen
return opener.open(url, data, timeout)
^^^^^^^^^^^^^^^^^^^^^^^^^^^^^^^
File "/Users/runner/miniconda3/envs/test/lib/python3.12/urllib/request.py", line 521, in open
response = meth(req, response)
^^^^^^^^^^^^^^^^^^^
File "/Users/runner/miniconda3/envs/test/lib/python3.12/urllib/request.py", line 630, in http_response
response = self.parent.error(
^^^^^^^^^^^^^^^^^^
File "/Users/runner/miniconda3/envs/test/lib/python3.12/urllib/request.py", line 559, in error
return self._call_chain(*args)
^^^^^^^^^^^^^^^^^^^^^^^
File "/Users/runner/miniconda3/envs/test/lib/python3.12/urllib/request.py", line 492, in _call_chain
result = func(*args)
^^^^^^^^^^^
File "/Users/runner/miniconda3/envs/test/lib/python3.12/urllib/request.py", line 639, in http_error_default
raise HTTPError(req.full_url, code, msg, hdrs, fp)
urllib.error.HTTPError: HTTP Error 500:
During handling of the above exception, another exception occurred:
Traceback (most recent call last):
File "/Users/runner/miniconda3/envs/test/lib/python3.12/doctest.py", line 1361, in __run
exec(compile(example.source, filename, "single",
File "<doctest obspy.clients.iris.client.Client.timeseries[4]>", line 1, in <module>
File "/Users/runner/miniconda3/envs/test/lib/python3.12/site-packages/obspy/clients/iris/client.py", line 335, in timeseries
raise Exception(msg)
Exception: No waveform data available (HTTPError: HTTP Error 500: )
/Users/runner/miniconda3/envs/test/lib/python3.12/site-packages/obspy/clients/iris/client.py:306: UnexpectedException
Traceback (most recent call last):
File "/Users/runner/miniconda3/envs/test/lib/python3.12/site-packages/_pytest/runner.py", line 341, in from_call
result: Optional[TResult] = func()
^^^^^^
File "/Users/runner/miniconda3/envs/test/lib/python3.12/site-packages/_pytest/runner.py", line 241, in <lambda>
lambda: runtest_hook(item=item, **kwds), when=when, reraise=reraise
^^^^^^^^^^^^^^^^^^^^^^^^^^^^^^^
File "/Users/runner/miniconda3/envs/test/lib/python3.12/site-packages/pluggy/_hooks.py", line 513, in __call__
return self._hookexec(self.name, self._hookimpls.copy(), kwargs, firstresult)
^^^^^^^^^^^^^^^^^^^^^^^^^^^^^^^^^^^^^^^^^^^^^^^^^^^^^^^^^^^^^^^^^^^^^^
File "/Users/runner/miniconda3/envs/test/lib/python3.12/site-packages/pluggy/_manager.py", line 120, in _hookexec
return self._inner_hookexec(hook_name, methods, kwargs, firstresult)
^^^^^^^^^^^^^^^^^^^^^^^^^^^^^^^^^^^^^^^^^^^^^^^^^^^^^^^^^^^^^
File "/Users/runner/miniconda3/envs/test/lib/python3.12/site-packages/pluggy/_callers.py", line 182, in _multicall
return outcome.get_result()
^^^^^^^^^^^^^^^^^^^^
File "/Users/runner/miniconda3/envs/test/lib/python3.12/site-packages/pluggy/_result.py", line 100, in get_result
raise exc.with_traceback(exc.__traceback__)
File "/Users/runner/miniconda3/envs/test/lib/python3.12/site-packages/pluggy/_callers.py", line 167, in _multicall
teardown.throw(outcome._exception)
File "/Users/runner/miniconda3/envs/test/lib/python3.12/site-packages/_pytest/threadexception.py", line 87, in pytest_runtest_call
yield from thread_exception_runtest_hook()
File "/Users/runner/miniconda3/envs/test/lib/python3.12/site-packages/_pytest/threadexception.py", line 63, in thread_exception_runtest_hook
yield
File "/Users/runner/miniconda3/envs/test/lib/python3.12/site-packages/pluggy/_callers.py", line 167, in _multicall
teardown.throw(outcome._exception)
File "/Users/runner/miniconda3/envs/test/lib/python3.12/site-packages/_pytest/unraisableexception.py", line 90, in pytest_runtest_call
yield from unraisable_exception_runtest_hook()
File "/Users/runner/miniconda3/envs/test/lib/python3.12/site-packages/_pytest/unraisableexception.py", line 65, in unraisable_exception_runtest_hook
yield
File "/Users/runner/miniconda3/envs/test/lib/python3.12/site-packages/pluggy/_callers.py", line 167, in _multicall
teardown.throw(outcome._exception)
File "/Users/runner/miniconda3/envs/test/lib/python3.12/site-packages/_pytest/logging.py", line 850, in pytest_runtest_call
yield from self._runtest_for(item, "call")
File "/Users/runner/miniconda3/envs/test/lib/python3.12/site-packages/_pytest/logging.py", line 833, in _runtest_for
yield
File "/Users/runner/miniconda3/envs/test/lib/python3.12/site-packages/pluggy/_callers.py", line 167, in _multicall
teardown.throw(outcome._exception)
File "/Users/runner/miniconda3/envs/test/lib/python3.12/site-packages/_pytest/capture.py", line 878, in pytest_runtest_call
return (yield)
^^^^^
File "/Users/runner/miniconda3/envs/test/lib/python3.12/site-packages/pluggy/_callers.py", line 167, in _multicall
teardown.throw(outcome._exception)
File "/Users/runner/miniconda3/envs/test/lib/python3.12/site-packages/_pytest/skipping.py", line 257, in pytest_runtest_call
return (yield)
^^^^^
File "/Users/runner/miniconda3/envs/test/lib/python3.12/site-packages/pluggy/_callers.py", line 103, in _multicall
res = hook_impl.function(*args)
^^^^^^^^^^^^^^^^^^^^^^^^^
File "/Users/runner/miniconda3/envs/test/lib/python3.12/site-packages/_pytest/runner.py", line 183, in pytest_runtest_call
raise e
File "/Users/runner/miniconda3/envs/test/lib/python3.12/site-packages/_pytest/runner.py", line 173, in pytest_runtest_call
item.runtest()
File "/Users/runner/miniconda3/envs/test/lib/python3.12/site-packages/_pytest/python.py", line 1632, in runtest
self.ihook.pytest_pyfunc_call(pyfuncitem=self)
File "/Users/runner/miniconda3/envs/test/lib/python3.12/site-packages/pluggy/_hooks.py", line 513, in __call__
return self._hookexec(self.name, self._hookimpls.copy(), kwargs, firstresult)
^^^^^^^^^^^^^^^^^^^^^^^^^^^^^^^^^^^^^^^^^^^^^^^^^^^^^^^^^^^^^^^^^^^^^^
File "/Users/runner/miniconda3/envs/test/lib/python3.12/site-packages/pluggy/_manager.py", line 120, in _hookexec
return self._inner_hookexec(hook_name, methods, kwargs, firstresult)
^^^^^^^^^^^^^^^^^^^^^^^^^^^^^^^^^^^^^^^^^^^^^^^^^^^^^^^^^^^^^
File "/Users/runner/miniconda3/envs/test/lib/python3.12/site-packages/pluggy/_callers.py", line 139, in _multicall
raise exception.with_traceback(exception.__traceback__)
File "/Users/runner/miniconda3/envs/test/lib/python3.12/site-packages/pluggy/_callers.py", line 103, in _multicall
res = hook_impl.function(*args)
^^^^^^^^^^^^^^^^^^^^^^^^^
File "/Users/runner/miniconda3/envs/test/lib/python3.12/site-packages/_pytest/python.py", line 162, in pytest_pyfunc_call
result = testfunction(**testargs)
^^^^^^^^^^^^^^^^^^^^^^^^
File "/Users/runner/miniconda3/envs/test/lib/python3.12/site-packages/obspy/clients/iris/tests/test_client.py", line 27, in test_sacpz
result = client.sacpz("IU", "ANMO", "00", "BHZ", t1, t2)
^^^^^^^^^^^^^^^^^^^^^^^^^^^^^^^^^^^^^^^^^^^^^^^
File "/Users/runner/miniconda3/envs/test/lib/python3.12/site-packages/obspy/clients/iris/client.py", line 540, in sacpz
data = self._fetch("sacpz", **kwargs)
^^^^^^^^^^^^^^^^^^^^^^^^^^^^^^
File "/Users/runner/miniconda3/envs/test/lib/python3.12/site-packages/obspy/clients/iris/client.py", line 124, in _fetch
response = urllib_request.urlopen(req, timeout=self.timeout)
^^^^^^^^^^^^^^^^^^^^^^^^^^^^^^^^^^^^^^^^^^^^^^^^^
File "/Users/runner/miniconda3/envs/test/lib/python3.12/urllib/request.py", line 215, in urlopen
return opener.open(url, data, timeout)
^^^^^^^^^^^^^^^^^^^^^^^^^^^^^^^
File "/Users/runner/miniconda3/envs/test/lib/python3.12/urllib/request.py", line 521, in open
response = meth(req, response)
^^^^^^^^^^^^^^^^^^^
File "/Users/runner/miniconda3/envs/test/lib/python3.12/urllib/request.py", line 630, in http_response
response = self.parent.error(
^^^^^^^^^^^^^^^^^^
File "/Users/runner/miniconda3/envs/test/lib/python3.12/urllib/request.py", line 559, in error
return self._call_chain(*args)
^^^^^^^^^^^^^^^^^^^^^^^
File "/Users/runner/miniconda3/envs/test/lib/python3.12/urllib/request.py", line 492, in _call_chain
result = func(*args)
^^^^^^^^^^^
File "/Users/runner/miniconda3/envs/test/lib/python3.12/urllib/request.py", line 639, in http_error_default
raise HTTPError(req.full_url, code, msg, hdrs, fp)
urllib.error.HTTPError: HTTP Error 500:
Traceback (most recent call last):
File "/Users/runner/miniconda3/envs/test/lib/python3.12/site-packages/_pytest/runner.py", line 341, in from_call
result: Optional[TResult] = func()
^^^^^^
File "/Users/runner/miniconda3/envs/test/lib/python3.12/site-packages/_pytest/runner.py", line 241, in <lambda>
lambda: runtest_hook(item=item, **kwds), when=when, reraise=reraise
^^^^^^^^^^^^^^^^^^^^^^^^^^^^^^^
File "/Users/runner/miniconda3/envs/test/lib/python3.12/site-packages/pluggy/_hooks.py", line 513, in __call__
return self._hookexec(self.name, self._hookimpls.copy(), kwargs, firstresult)
^^^^^^^^^^^^^^^^^^^^^^^^^^^^^^^^^^^^^^^^^^^^^^^^^^^^^^^^^^^^^^^^^^^^^^
File "/Users/runner/miniconda3/envs/test/lib/python3.12/site-packages/pluggy/_manager.py", line 120, in _hookexec
return self._inner_hookexec(hook_name, methods, kwargs, firstresult)
^^^^^^^^^^^^^^^^^^^^^^^^^^^^^^^^^^^^^^^^^^^^^^^^^^^^^^^^^^^^^
File "/Users/runner/miniconda3/envs/test/lib/python3.12/site-packages/pluggy/_callers.py", line 182, in _multicall
return outcome.get_result()
^^^^^^^^^^^^^^^^^^^^
File "/Users/runner/miniconda3/envs/test/lib/python3.12/site-packages/pluggy/_result.py", line 100, in get_result
raise exc.with_traceback(exc.__traceback__)
File "/Users/runner/miniconda3/envs/test/lib/python3.12/site-packages/pluggy/_callers.py", line 167, in _multicall
teardown.throw(outcome._exception)
File "/Users/runner/miniconda3/envs/test/lib/python3.12/site-packages/_pytest/threadexception.py", line 87, in pytest_runtest_call
yield from thread_exception_runtest_hook()
File "/Users/runner/miniconda3/envs/test/lib/python3.12/site-packages/_pytest/threadexception.py", line 63, in thread_exception_runtest_hook
yield
File "/Users/runner/miniconda3/envs/test/lib/python3.12/site-packages/pluggy/_callers.py", line 167, in _multicall
teardown.throw(outcome._exception)
File "/Users/runner/miniconda3/envs/test/lib/python3.12/site-packages/_pytest/unraisableexception.py", line 90, in pytest_runtest_call
yield from unraisable_exception_runtest_hook()
File "/Users/runner/miniconda3/envs/test/lib/python3.12/site-packages/_pytest/unraisableexception.py", line 65, in unraisable_exception_runtest_hook
yield
File "/Users/runner/miniconda3/envs/test/lib/python3.12/site-packages/pluggy/_callers.py", line 167, in _multicall
teardown.throw(outcome._exception)
File "/Users/runner/miniconda3/envs/test/lib/python3.12/site-packages/_pytest/logging.py", line 850, in pytest_runtest_call
yield from self._runtest_for(item, "call")
File "/Users/runner/miniconda3/envs/test/lib/python3.12/site-packages/_pytest/logging.py", line 833, in _runtest_for
yield
File "/Users/runner/miniconda3/envs/test/lib/python3.12/site-packages/pluggy/_callers.py", line 167, in _multicall
teardown.throw(outcome._exception)
File "/Users/runner/miniconda3/envs/test/lib/python3.12/site-packages/_pytest/capture.py", line 878, in pytest_runtest_call
return (yield)
^^^^^
File "/Users/runner/miniconda3/envs/test/lib/python3.12/site-packages/pluggy/_callers.py", line 167, in _multicall
teardown.throw(outcome._exception)
File "/Users/runner/miniconda3/envs/test/lib/python3.12/site-packages/_pytest/skipping.py", line 257, in pytest_runtest_call
return (yield)
^^^^^
File "/Users/runner/miniconda3/envs/test/lib/python3.12/site-packages/pluggy/_callers.py", line 103, in _multicall
res = hook_impl.function(*args)
^^^^^^^^^^^^^^^^^^^^^^^^^
File "/Users/runner/miniconda3/envs/test/lib/python3.12/site-packages/_pytest/runner.py", line 183, in pytest_runtest_call
raise e
File "/Users/runner/miniconda3/envs/test/lib/python3.12/site-packages/_pytest/runner.py", line 173, in pytest_runtest_call
item.runtest()
File "/Users/runner/miniconda3/envs/test/lib/python3.12/site-packages/_pytest/python.py", line 1632, in runtest
self.ihook.pytest_pyfunc_call(pyfuncitem=self)
File "/Users/runner/miniconda3/envs/test/lib/python3.12/site-packages/pluggy/_hooks.py", line 513, in __call__
return self._hookexec(self.name, self._hookimpls.copy(), kwargs, firstresult)
^^^^^^^^^^^^^^^^^^^^^^^^^^^^^^^^^^^^^^^^^^^^^^^^^^^^^^^^^^^^^^^^^^^^^^
File "/Users/runner/miniconda3/envs/test/lib/python3.12/site-packages/pluggy/_manager.py", line 120, in _hookexec
return self._inner_hookexec(hook_name, methods, kwargs, firstresult)
^^^^^^^^^^^^^^^^^^^^^^^^^^^^^^^^^^^^^^^^^^^^^^^^^^^^^^^^^^^^^
File "/Users/runner/miniconda3/envs/test/lib/python3.12/site-packages/pluggy/_callers.py", line 139, in _multicall
raise exception.with_traceback(exception.__traceback__)
File "/Users/runner/miniconda3/envs/test/lib/python3.12/site-packages/pluggy/_callers.py", line 103, in _multicall
res = hook_impl.function(*args)
^^^^^^^^^^^^^^^^^^^^^^^^^
File "/Users/runner/miniconda3/envs/test/lib/python3.12/site-packages/_pytest/python.py", line 162, in pytest_pyfunc_call
result = testfunction(**testargs)
^^^^^^^^^^^^^^^^^^^^^^^^
File "/Users/runner/miniconda3/envs/test/lib/python3.12/site-packages/obspy/clients/iris/tests/test_client.py", line 139, in test_evalresp
client.evalresp(network="IU", station="ANMO", location="00",
File "/Users/runner/miniconda3/envs/test/lib/python3.12/site-packages/obspy/clients/iris/client.py", line 970, in evalresp
data = self._fetch("evalresp", **kwargs)
^^^^^^^^^^^^^^^^^^^^^^^^^^^^^^^^^
File "/Users/runner/miniconda3/envs/test/lib/python3.12/site-packages/obspy/clients/iris/client.py", line 124, in _fetch
response = urllib_request.urlopen(req, timeout=self.timeout)
^^^^^^^^^^^^^^^^^^^^^^^^^^^^^^^^^^^^^^^^^^^^^^^^^
File "/Users/runner/miniconda3/envs/test/lib/python3.12/urllib/request.py", line 215, in urlopen
return opener.open(url, data, timeout)
^^^^^^^^^^^^^^^^^^^^^^^^^^^^^^^
File "/Users/runner/miniconda3/envs/test/lib/python3.12/urllib/request.py", line 521, in open
response = meth(req, response)
^^^^^^^^^^^^^^^^^^^
File "/Users/runner/miniconda3/envs/test/lib/python3.12/urllib/request.py", line 630, in http_response
response = self.parent.error(
^^^^^^^^^^^^^^^^^^
File "/Users/runner/miniconda3/envs/test/lib/python3.12/urllib/request.py", line 559, in error
return self._call_chain(*args)
^^^^^^^^^^^^^^^^^^^^^^^
File "/Users/runner/miniconda3/envs/test/lib/python3.12/urllib/request.py", line 492, in _call_chain
result = func(*args)
^^^^^^^^^^^
File "/Users/runner/miniconda3/envs/test/lib/python3.12/urllib/request.py", line 639, in http_error_default
raise HTTPError(req.full_url, code, msg, hdrs, fp)
urllib.error.HTTPError: HTTP Error 404:
Traceback (most recent call last):
File "/Users/runner/miniconda3/envs/test/lib/python3.12/site-packages/obspy/clients/iris/client.py", line 437, in resp
data = self._fetch("resp", **kwargs)
^^^^^^^^^^^^^^^^^^^^^^^^^^^^^
File "/Users/runner/miniconda3/envs/test/lib/python3.12/site-packages/obspy/clients/iris/client.py", line 124, in _fetch
response = urllib_request.urlopen(req, timeout=self.timeout)
^^^^^^^^^^^^^^^^^^^^^^^^^^^^^^^^^^^^^^^^^^^^^^^^^
File "/Users/runner/miniconda3/envs/test/lib/python3.12/urllib/request.py", line 215, in urlopen
return opener.open(url, data, timeout)
^^^^^^^^^^^^^^^^^^^^^^^^^^^^^^^
File "/Users/runner/miniconda3/envs/test/lib/python3.12/urllib/request.py", line 521, in open
response = meth(req, response)
^^^^^^^^^^^^^^^^^^^
File "/Users/runner/miniconda3/envs/test/lib/python3.12/urllib/request.py", line 630, in http_response
response = self.parent.error(
^^^^^^^^^^^^^^^^^^
File "/Users/runner/miniconda3/envs/test/lib/python3.12/urllib/request.py", line 559, in error
return self._call_chain(*args)
^^^^^^^^^^^^^^^^^^^^^^^
File "/Users/runner/miniconda3/envs/test/lib/python3.12/urllib/request.py", line 492, in _call_chain
result = func(*args)
^^^^^^^^^^^
File "/Users/runner/miniconda3/envs/test/lib/python3.12/urllib/request.py", line 639, in http_error_default
raise HTTPError(req.full_url, code, msg, hdrs, fp)
urllib.error.HTTPError: HTTP Error 500:
During handling of the above exception, another exception occurred:
Traceback (most recent call last):
File "/Users/runner/miniconda3/envs/test/lib/python3.12/site-packages/_pytest/runner.py", line 341, in from_call
result: Optional[TResult] = func()
^^^^^^
File "/Users/runner/miniconda3/envs/test/lib/python3.12/site-packages/_pytest/runner.py", line 241, in <lambda>
lambda: runtest_hook(item=item, **kwds), when=when, reraise=reraise
^^^^^^^^^^^^^^^^^^^^^^^^^^^^^^^
File "/Users/runner/miniconda3/envs/test/lib/python3.12/site-packages/pluggy/_hooks.py", line 513, in __call__
return self._hookexec(self.name, self._hookimpls.copy(), kwargs, firstresult)
^^^^^^^^^^^^^^^^^^^^^^^^^^^^^^^^^^^^^^^^^^^^^^^^^^^^^^^^^^^^^^^^^^^^^^
File "/Users/runner/miniconda3/envs/test/lib/python3.12/site-packages/pluggy/_manager.py", line 120, in _hookexec
return self._inner_hookexec(hook_name, methods, kwargs, firstresult)
^^^^^^^^^^^^^^^^^^^^^^^^^^^^^^^^^^^^^^^^^^^^^^^^^^^^^^^^^^^^^
File "/Users/runner/miniconda3/envs/test/lib/python3.12/site-packages/pluggy/_callers.py", line 182, in _multicall
return outcome.get_result()
^^^^^^^^^^^^^^^^^^^^
File "/Users/runner/miniconda3/envs/test/lib/python3.12/site-packages/pluggy/_result.py", line 100, in get_result
raise exc.with_traceback(exc.__traceback__)
File "/Users/runner/miniconda3/envs/test/lib/python3.12/site-packages/pluggy/_callers.py", line 167, in _multicall
teardown.throw(outcome._exception)
File "/Users/runner/miniconda3/envs/test/lib/python3.12/site-packages/_pytest/threadexception.py", line 87, in pytest_runtest_call
yield from thread_exception_runtest_hook()
File "/Users/runner/miniconda3/envs/test/lib/python3.12/site-packages/_pytest/threadexception.py", line 63, in thread_exception_runtest_hook
yield
File "/Users/runner/miniconda3/envs/test/lib/python3.12/site-packages/pluggy/_callers.py", line 167, in _multicall
teardown.throw(outcome._exception)
File "/Users/runner/miniconda3/envs/test/lib/python3.12/site-packages/_pytest/unraisableexception.py", line 90, in pytest_runtest_call
yield from unraisable_exception_runtest_hook()
File "/Users/runner/miniconda3/envs/test/lib/python3.12/site-packages/_pytest/unraisableexception.py", line 65, in unraisable_exception_runtest_hook
yield
File "/Users/runner/miniconda3/envs/test/lib/python3.12/site-packages/pluggy/_callers.py", line 167, in _multicall
teardown.throw(outcome._exception)
File "/Users/runner/miniconda3/envs/test/lib/python3.12/site-packages/_pytest/logging.py", line 850, in pytest_runtest_call
yield from self._runtest_for(item, "call")
File "/Users/runner/miniconda3/envs/test/lib/python3.12/site-packages/_pytest/logging.py", line 833, in _runtest_for
yield
File "/Users/runner/miniconda3/envs/test/lib/python3.12/site-packages/pluggy/_callers.py", line 167, in _multicall
teardown.throw(outcome._exception)
File "/Users/runner/miniconda3/envs/test/lib/python3.12/site-packages/_pytest/capture.py", line 878, in pytest_runtest_call
return (yield)
^^^^^
File "/Users/runner/miniconda3/envs/test/lib/python3.12/site-packages/pluggy/_callers.py", line 167, in _multicall
teardown.throw(outcome._exception)
File "/Users/runner/miniconda3/envs/test/lib/python3.12/site-packages/_pytest/skipping.py", line 257, in pytest_runtest_call
return (yield)
^^^^^
File "/Users/runner/miniconda3/envs/test/lib/python3.12/site-packages/pluggy/_callers.py", line 103, in _multicall
res = hook_impl.function(*args)
^^^^^^^^^^^^^^^^^^^^^^^^^
File "/Users/runner/miniconda3/envs/test/lib/python3.12/site-packages/_pytest/runner.py", line 183, in pytest_runtest_call
raise e
File "/Users/runner/miniconda3/envs/test/lib/python3.12/site-packages/_pytest/runner.py", line 173, in pytest_runtest_call
item.runtest()
File "/Users/runner/miniconda3/envs/test/lib/python3.12/site-packages/_pytest/python.py", line 1632, in runtest
self.ihook.pytest_pyfunc_call(pyfuncitem=self)
File "/Users/runner/miniconda3/envs/test/lib/python3.12/site-packages/pluggy/_hooks.py", line 513, in __call__
return self._hookexec(self.name, self._hookimpls.copy(), kwargs, firstresult)
^^^^^^^^^^^^^^^^^^^^^^^^^^^^^^^^^^^^^^^^^^^^^^^^^^^^^^^^^^^^^^^^^^^^^^
File "/Users/runner/miniconda3/envs/test/lib/python3.12/site-packages/pluggy/_manager.py", line 120, in _hookexec
return self._inner_hookexec(hook_name, methods, kwargs, firstresult)
^^^^^^^^^^^^^^^^^^^^^^^^^^^^^^^^^^^^^^^^^^^^^^^^^^^^^^^^^^^^^
File "/Users/runner/miniconda3/envs/test/lib/python3.12/site-packages/pluggy/_callers.py", line 139, in _multicall
raise exception.with_traceback(exception.__traceback__)
File "/Users/runner/miniconda3/envs/test/lib/python3.12/site-packages/pluggy/_callers.py", line 103, in _multicall
res = hook_impl.function(*args)
^^^^^^^^^^^^^^^^^^^^^^^^^
File "/Users/runner/miniconda3/envs/test/lib/python3.12/site-packages/_pytest/python.py", line 162, in pytest_pyfunc_call
result = testfunction(**testargs)
^^^^^^^^^^^^^^^^^^^^^^^^
File "/Users/runner/miniconda3/envs/test/lib/python3.12/site-packages/obspy/clients/iris/tests/test_client.py", line 235, in test_resp
result = client.resp("IU", "ANMO", "00", "BHZ", t1, t2)
^^^^^^^^^^^^^^^^^^^^^^^^^^^^^^^^^^^^^^^^^^^^^^
File "/Users/runner/miniconda3/envs/test/lib/python3.12/site-packages/obspy/clients/iris/client.py", line 441, in resp
raise Exception(msg)
Exception: No response data available (HTTPError: HTTP Error 500: )
Traceback (most recent call last):
File "/Users/runner/miniconda3/envs/test/lib/python3.12/site-packages/obspy/clients/iris/client.py", line 331, in timeseries
data = self._fetch("timeseries", param_list=filter, **kwargs)
^^^^^^^^^^^^^^^^^^^^^^^^^^^^^^^^^^^^^^^^^^^^^^^^^^^^^^
File "/Users/runner/miniconda3/envs/test/lib/python3.12/site-packages/obspy/clients/iris/client.py", line 124, in _fetch
response = urllib_request.urlopen(req, timeout=self.timeout)
^^^^^^^^^^^^^^^^^^^^^^^^^^^^^^^^^^^^^^^^^^^^^^^^^
File "/Users/runner/miniconda3/envs/test/lib/python3.12/urllib/request.py", line 215, in urlopen
return opener.open(url, data, timeout)
^^^^^^^^^^^^^^^^^^^^^^^^^^^^^^^
File "/Users/runner/miniconda3/envs/test/lib/python3.12/urllib/request.py", line 521, in open
response = meth(req, response)
^^^^^^^^^^^^^^^^^^^
File "/Users/runner/miniconda3/envs/test/lib/python3.12/urllib/request.py", line 630, in http_response
response = self.parent.error(
^^^^^^^^^^^^^^^^^^
File "/Users/runner/miniconda3/envs/test/lib/python3.12/urllib/request.py", line 559, in error
return self._call_chain(*args)
^^^^^^^^^^^^^^^^^^^^^^^
File "/Users/runner/miniconda3/envs/test/lib/python3.12/urllib/request.py", line 492, in _call_chain
result = func(*args)
^^^^^^^^^^^
File "/Users/runner/miniconda3/envs/test/lib/python3.12/urllib/request.py", line 639, in http_error_default
raise HTTPError(req.full_url, code, msg, hdrs, fp)
urllib.error.HTTPError: HTTP Error 500:
During handling of the above exception, another exception occurred:
Traceback (most recent call last):
File "/Users/runner/miniconda3/envs/test/lib/python3.12/site-packages/_pytest/runner.py", line 341, in from_call
result: Optional[TResult] = func()
^^^^^^
File "/Users/runner/miniconda3/envs/test/lib/python3.12/site-packages/_pytest/runner.py", line 241, in <lambda>
lambda: runtest_hook(item=item, **kwds), when=when, reraise=reraise
^^^^^^^^^^^^^^^^^^^^^^^^^^^^^^^
File "/Users/runner/miniconda3/envs/test/lib/python3.12/site-packages/pluggy/_hooks.py", line 513, in __call__
return self._hookexec(self.name, self._hookimpls.copy(), kwargs, firstresult)
^^^^^^^^^^^^^^^^^^^^^^^^^^^^^^^^^^^^^^^^^^^^^^^^^^^^^^^^^^^^^^^^^^^^^^
File "/Users/runner/miniconda3/envs/test/lib/python3.12/site-packages/pluggy/_manager.py", line 120, in _hookexec
return self._inner_hookexec(hook_name, methods, kwargs, firstresult)
^^^^^^^^^^^^^^^^^^^^^^^^^^^^^^^^^^^^^^^^^^^^^^^^^^^^^^^^^^^^^
File "/Users/runner/miniconda3/envs/test/lib/python3.12/site-packages/pluggy/_callers.py", line 182, in _multicall
return outcome.get_result()
^^^^^^^^^^^^^^^^^^^^
File "/Users/runner/miniconda3/envs/test/lib/python3.12/site-packages/pluggy/_result.py", line 100, in get_result
raise exc.with_traceback(exc.__traceback__)
File "/Users/runner/miniconda3/envs/test/lib/python3.12/site-packages/pluggy/_callers.py", line 167, in _multicall
teardown.throw(outcome._exception)
File "/Users/runner/miniconda3/envs/test/lib/python3.12/site-packages/_pytest/threadexception.py", line 87, in pytest_runtest_call
yield from thread_exception_runtest_hook()
File "/Users/runner/miniconda3/envs/test/lib/python3.12/site-packages/_pytest/threadexception.py", line 63, in thread_exception_runtest_hook
yield
File "/Users/runner/miniconda3/envs/test/lib/python3.12/site-packages/pluggy/_callers.py", line 167, in _multicall
teardown.throw(outcome._exception)
File "/Users/runner/miniconda3/envs/test/lib/python3.12/site-packages/_pytest/unraisableexception.py", line 90, in pytest_runtest_call
yield from unraisable_exception_runtest_hook()
File "/Users/runner/miniconda3/envs/test/lib/python3.12/site-packages/_pytest/unraisableexception.py", line 65, in unraisable_exception_runtest_hook
yield
File "/Users/runner/miniconda3/envs/test/lib/python3.12/site-packages/pluggy/_callers.py", line 167, in _multicall
teardown.throw(outcome._exception)
File "/Users/runner/miniconda3/envs/test/lib/python3.12/site-packages/_pytest/logging.py", line 850, in pytest_runtest_call
yield from self._runtest_for(item, "call")
File "/Users/runner/miniconda3/envs/test/lib/python3.12/site-packages/_pytest/logging.py", line 833, in _runtest_for
yield
File "/Users/runner/miniconda3/envs/test/lib/python3.12/site-packages/pluggy/_callers.py", line 167, in _multicall
teardown.throw(outcome._exception)
File "/Users/runner/miniconda3/envs/test/lib/python3.12/site-packages/_pytest/capture.py", line 878, in pytest_runtest_call
return (yield)
^^^^^
File "/Users/runner/miniconda3/envs/test/lib/python3.12/site-packages/pluggy/_callers.py", line 167, in _multicall
teardown.throw(outcome._exception)
File "/Users/runner/miniconda3/envs/test/lib/python3.12/site-packages/_pytest/skipping.py", line 257, in pytest_runtest_call
return (yield)
^^^^^
File "/Users/runner/miniconda3/envs/test/lib/python3.12/site-packages/pluggy/_callers.py", line 103, in _multicall
res = hook_impl.function(*args)
^^^^^^^^^^^^^^^^^^^^^^^^^
File "/Users/runner/miniconda3/envs/test/lib/python3.12/site-packages/_pytest/runner.py", line 183, in pytest_runtest_call
raise e
File "/Users/runner/miniconda3/envs/test/lib/python3.12/site-packages/_pytest/runner.py", line 173, in pytest_runtest_call
item.runtest()
File "/Users/runner/miniconda3/envs/test/lib/python3.12/site-packages/_pytest/python.py", line 1632, in runtest
self.ihook.pytest_pyfunc_call(pyfuncitem=self)
File "/Users/runner/miniconda3/envs/test/lib/python3.12/site-packages/pluggy/_hooks.py", line 513, in __call__
return self._hookexec(self.name, self._hookimpls.copy(), kwargs, firstresult)
^^^^^^^^^^^^^^^^^^^^^^^^^^^^^^^^^^^^^^^^^^^^^^^^^^^^^^^^^^^^^^^^^^^^^^
File "/Users/runner/miniconda3/envs/test/lib/python3.12/site-packages/pluggy/_manager.py", line 120, in _hookexec
return self._inner_hookexec(hook_name, methods, kwargs, firstresult)
^^^^^^^^^^^^^^^^^^^^^^^^^^^^^^^^^^^^^^^^^^^^^^^^^^^^^^^^^^^^^
File "/Users/runner/miniconda3/envs/test/lib/python3.12/site-packages/pluggy/_callers.py", line 139, in _multicall
raise exception.with_traceback(exception.__traceback__)
File "/Users/runner/miniconda3/envs/test/lib/python3.12/site-packages/pluggy/_callers.py", line 103, in _multicall
res = hook_impl.function(*args)
^^^^^^^^^^^^^^^^^^^^^^^^^
File "/Users/runner/miniconda3/envs/test/lib/python3.12/site-packages/_pytest/python.py", line 162, in pytest_pyfunc_call
result = testfunction(**testargs)
^^^^^^^^^^^^^^^^^^^^^^^^
File "/Users/runner/miniconda3/envs/test/lib/python3.12/site-packages/obspy/clients/iris/tests/test_client.py", line 266, in test_timeseries
st1 = client.timeseries("IU", "ANMO", "00", "BHZ", t1, t2)
^^^^^^^^^^^^^^^^^^^^^^^^^^^^^^^^^^^^^^^^^^^^^^^^^^^^
File "/Users/runner/miniconda3/envs/test/lib/python3.12/site-packages/obspy/clients/iris/client.py", line 335, in timeseries
raise Exception(msg)
Exception: No waveform data available (HTTPError: HTTP Error 500: )

Skipped tests (5)

Submodule Test Skip message
clients.fdsn clients/fdsn/tests/test_client.py::TestClient::test_trim_stream_after_get_waveform Skipped: data no longer available
clients.fdsn clients/fdsn/tests/test_client.py::TestClient::test_eida_token_resolution Skipped: Token is expired
clients.seedlink clients/seedlink/tests/test_slclient.py::TestSLClient::test_info Skipped: test must be started manually
clients.seedlink clients/seedlink/tests/test_slclient.py::TestSLClient::test_time_window Skipped: test must be started manually
clients.seedlink clients/seedlink/tests/test_slclient.py::TestSLClient::test_issue708 Skipped: test must be started manually

Slowest tests (20)

Runtime Test
63.852s clients/fdsn/tests/test_eidaws_routing_client.py::TestEIDAWSRoutingClient::test_get_waveforms_integration_test
26.218s clients/fdsn/tests/test_eidaws_routing_client.py::TestEIDAWSRoutingClient::test_get_stations_integration_test
13.923s clients/fdsn/tests/test_client.py::TestClient::test_irisph5_event
7.624s clients/syngine/tests/test_client.py::TestClient::test_get_available_models
6.370s core/tests/test_stream.py::TestStream::test_read_url_via_network
3.764s clients/syngine/tests/test_client.py::TestClient::test_get_waveforms
3.740s clients/seedlink/basic_client.py::obspy.clients.seedlink.basic_client.Client.get_waveforms
3.378s clients/seedlink/tests/test_basic_client.py::TestClient::test_multiple_waveform_requests_with_multiple_info_requests
2.884s clients/syngine/__init__.py::obspy.clients.syngine
1.927s clients/nrl/client.py::obspy.clients.nrl.client.NRL.get_response
1.898s clients/syngine/client.py::obspy.clients.syngine.client.Client.get_waveforms_bulk
1.762s clients/fdsn/tests/test_eidaws_routing_client.py::TestEIDAWSRoutingClient::test_proper_no_data_exception_on_out_of_epoch_dates
1.563s clients/iris/tests/test_client.py::TestClient::test_flinnengdahl
1.407s clients/seedlink/basic_client.py::obspy.clients.seedlink.basic_client.Client.get_info
1.273s clients/neic/tests/test_client.py::TestClient::test_get_waveform_nscl
1.260s clients/syngine/tests/test_client.py::TestClient::test_reading_saczip_files
1.248s clients/fdsn/client.py::obspy.clients.fdsn.client.Client.get_events
1.193s clients/earthworm/__init__.py::obspy.clients.earthworm
1.187s clients/fdsn/mass_downloader/__init__.py::obspy.clients.fdsn.mass_downloader
1.187s clients/syngine/client.py::obspy.clients.syngine.client.Client.get_waveforms

Warnings (4)

Stage Filename Category Message
runtest /Users/runner/miniconda3/envs/test/lib/python3.12/site-packages/obspy/clients/fdsn/routing/routing_client.py:108 UserWarning Failed to download data of type 'station' from 'http://service.iris.edu' due to: Traceback (most recent call last): File "/Users/runner/miniconda3/envs/test/lib/python3.12/site-packages/obspy/clients/fdsn/routing/routing_client.py", line 105, in _try_download_bulk return _download_bulk(r) ^^^^^^^^^^^^^^^^^ File "/Users/runner/miniconda3/envs/test/lib/python3.12/site-packages/obspy/clients/fdsn/routing/routing_client.py", line 140, in _download_bulk service = c.services["station"] ~~~~~~~~~~^^^^^^^^^^^ KeyError: 'station'
runtest /Users/runner/miniconda3/envs/test/lib/python3.12/site-packages/_pytest/threadexception.py:77 PytestUnhandledThreadExceptionWarning Exception in thread Thread-103 Traceback (most recent call last): File "/Users/runner/miniconda3/envs/test/lib/python3.12/threading.py", line 1073, in _bootstrap_inner self.run() File "/Users/runner/miniconda3/envs/test/lib/python3.12/site-packages/obspy/clients/fdsn/client.py", line 1550, in run code, data = download_url( ^^^^^^^^^^ ValueError: not enough values to unpack (expected 2, got 0)
runtest /Users/runner/miniconda3/envs/test/lib/python3.12/site-packages/obspy/io/sac/util.py:260 UserWarning Sample spacing read from SAC file (2.500000000 when rounded to nanoseconds) was rounded of to microsecond precision (2.500000000) to avoid floating point issues when converting to sampling rate (see #3408)
runtest /Users/runner/miniconda3/envs/test/lib/python3.12/site-packages/obspy/clients/fdsn/routing/routing_client.py:108 UserWarning Failed to download data of type 'waveform' from 'https://erde.geophysik.uni-muenchen.de' due to: Traceback (most recent call last): File "/Users/runner/miniconda3/envs/test/lib/python3.12/site-packages/obspy/clients/fdsn/routing/routing_client.py", line 105, in _try_download_bulk return _download_bulk(r) ^^^^^^^^^^^^^^^^^ File "/Users/runner/miniconda3/envs/test/lib/python3.12/site-packages/obspy/clients/fdsn/routing/routing_client.py", line 137, in _download_bulk service = c.services["dataselect"] ~~~~~~~~~~^^^^^^^^^^^^^^ KeyError: 'dataselect'