#95832 Report by node docker-ubuntu_18_04_bionic_32bit covering 2038 tests from 55 modules resulted into 22 errors

Report

ObsPy version
1.1.1rc1.post0+241.ga124222488
Continuous Integration
-
GitHub Pull Request
-
Report file
XML document
Total runtime
873.8 sec
Report date/time
2018-05-23 03:25:37

System / Python

Architecture
32bit
Machine
x86_64
Node
docker-ubuntu_18_04_bionic_32bit
Processor
x86_64
Python Compiler
GCC 7.3.0
Python Implementation
CPython
Python Version
2.7.15rc1
Release
4.4.0-124-generic
System
Linux
Version
#148-Ubuntu SMP Wed May 2 13:00:18 UTC 2018

Dependencies

cartopy
---
decorator
4.1.2
flake8
3.5.0
future
0.15.2
geographiclib
1.49
lxml.etree
4.2.1
m2crypto
---
matplotlib
2.1.1
mock
2.0.0
mpl_toolkits.basemap
1.1.0
numpy
1.13.3
pep8-naming
---
pyflakes
1.6.0
pyimgur
0.5.3
pyproj
1.9.5.1
requests
2.18.4
scipy
0.19.1
setuptools
39.0.1
shapefile
1.2.12
sqlalchemy
1.1.11

Modules (55)

Module Errors / Failures Tracebacks
obspy.clients.arclink 21 1 2 3 4 5 6 7 8 9 10 11 12 13 14 15 16 17 18 19 20 21
obspy.clients.earthworm - -
obspy.clients.fdsn 1 22
obspy.clients.filesystem - -
obspy.clients.iris - -
obspy.clients.neic - -
obspy.clients.nrl - -
obspy.clients.seedlink - -
obspy.clients.seishub - -
obspy.clients.syngine - -
obspy.core - -
obspy.db - -
obspy.geodetics - -
obspy.imaging - -
obspy.io.ah - -
obspy.io.arclink - -
obspy.io.ascii - -
obspy.io.cmtsolution - -
obspy.io.cnv - -
obspy.io.css - -
obspy.io.gcf - -
obspy.io.gse2 - -
obspy.io.iaspei - -
obspy.io.json - -
obspy.io.kinemetrics - -
obspy.io.kml - -
obspy.io.mseed - -
obspy.io.ndk - -
obspy.io.nied - -
obspy.io.nlloc - -
obspy.io.nordic - -
obspy.io.pdas - -
obspy.io.pde - -
obspy.io.quakeml - -
obspy.io.reftek - -
obspy.io.rg16 - -
obspy.io.sac - -
obspy.io.scardec - -
obspy.io.seg2 - -
obspy.io.segy - -
obspy.io.seisan - -
obspy.io.seiscomp - -
obspy.io.sh - -
obspy.io.shapefile - -
obspy.io.stationtxt - -
obspy.io.stationxml - -
obspy.io.wav - -
obspy.io.win - -
obspy.io.xseed - -
obspy.io.y - -
obspy.io.zmap - -
obspy.realtime - -
obspy.scripts - -
obspy.signal - -
obspy.taup - -
Summary 22 22

Tracebacks (22)

Traceback (most recent call last):
File "/obspy/obspy/clients/arclink/tests/test_client.py", line 241, in test_get_inventory_stationgroup
result = client.get_inventory(network="_NFOVALAIS")
File "/obspy/obspy/clients/arclink/client.py", line 1121, in get_inventory
result = self._fetch(rtype, rdata, route=False)
File "/obspy/obspy/clients/arclink/client.py", line 219, in _fetch
return self._request(request_type, request_data)
File "/obspy/obspy/clients/arclink/client.py", line 324, in _request
raise ArcLinkException("%s %s" % (err_code, msg))
ArcLinkException: UNSET
Traceback (most recent call last):
File "/obspy/obspy/clients/arclink/tests/test_client.py", line 370, in test_get_not_existing_waveform
'', '*', start, end)
File "/usr/lib/python2.7/unittest/case.py", line 473, in assertRaises
callableObj(*args, **kwargs)
File "/obspy/obspy/clients/arclink/client.py", line 444, in get_waveforms
compressed=compressed, route=route)
File "/obspy/obspy/clients/arclink/client.py", line 565, in save_waveforms
data = self._fetch(rtype, rdata, route=route)
File "/obspy/obspy/clients/arclink/client.py", line 258, in _fetch
self._reconnect()
File "/obspy/obspy/clients/arclink/client.py", line 174, in _reconnect
self._client.timeout)
File "/usr/lib/python2.7/telnetlib.py", line 227, in open
self.sock = socket.create_connection((host, port), timeout)
File "/usr/lib/python2.7/socket.py", line 575, in create_connection
raise err
error: [Errno 113] No route to host
Traceback (most recent call last):
File "/obspy/obspy/clients/arclink/tests/test_client.py", line 597, in test_get_paz
host='erde.geophysik.uni-muenchen.de', port=18001)
File "/obspy/obspy/clients/arclink/client.py", line 126, in __init__
self._client = Telnet(host, port, timeout)
File "/usr/lib/python2.7/telnetlib.py", line 211, in __init__
self.open(host, port, timeout)
File "/usr/lib/python2.7/telnetlib.py", line 227, in open
self.sock = socket.create_connection((host, port), timeout)
File "/usr/lib/python2.7/socket.py", line 575, in create_connection
raise err
error: [Errno 113] No route to host
Traceback (most recent call last):
File "/obspy/obspy/clients/arclink/tests/test_client.py", line 618, in test_get_paz2
host='erde.geophysik.uni-muenchen.de', port=18001)
File "/obspy/obspy/clients/arclink/client.py", line 126, in __init__
self._client = Telnet(host, port, timeout)
File "/usr/lib/python2.7/telnetlib.py", line 211, in __init__
self.open(host, port, timeout)
File "/usr/lib/python2.7/telnetlib.py", line 227, in open
self.sock = socket.create_connection((host, port), timeout)
File "/usr/lib/python2.7/socket.py", line 575, in create_connection
raise err
error: [Errno 113] No route to host
Traceback (most recent call last):
File "/obspy/obspy/clients/arclink/tests/test_client.py", line 121, in test_get_routing
user='test@obspy.org')
File "/obspy/obspy/clients/arclink/client.py", line 126, in __init__
self._client = Telnet(host, port, timeout)
File "/usr/lib/python2.7/telnetlib.py", line 211, in __init__
self.open(host, port, timeout)
File "/usr/lib/python2.7/telnetlib.py", line 227, in open
self.sock = socket.create_connection((host, port), timeout)
File "/usr/lib/python2.7/socket.py", line 575, in create_connection
raise err
error: [Errno 113] No route to host
Traceback (most recent call last):
File "/obspy/obspy/clients/arclink/tests/test_client.py", line 35, in test_get_waveform
stream = client.get_waveforms('BW', 'MANZ', '', 'EH*', start, end)
File "/obspy/obspy/clients/arclink/client.py", line 444, in get_waveforms
compressed=compressed, route=route)
File "/obspy/obspy/clients/arclink/client.py", line 565, in save_waveforms
data = self._fetch(rtype, rdata, route=route)
File "/obspy/obspy/clients/arclink/client.py", line 258, in _fetch
self._reconnect()
File "/obspy/obspy/clients/arclink/client.py", line 174, in _reconnect
self._client.timeout)
File "/usr/lib/python2.7/telnetlib.py", line 227, in open
self.sock = socket.create_connection((host, port), timeout)
File "/usr/lib/python2.7/socket.py", line 575, in create_connection
raise err
error: [Errno 113] No route to host
Traceback (most recent call last):
File "/obspy/obspy/clients/arclink/tests/test_client.py", line 508, in test_get_waveform_no_compression
compressed=False)
File "/obspy/obspy/clients/arclink/client.py", line 444, in get_waveforms
compressed=compressed, route=route)
File "/obspy/obspy/clients/arclink/client.py", line 565, in save_waveforms
data = self._fetch(rtype, rdata, route=route)
File "/obspy/obspy/clients/arclink/client.py", line 258, in _fetch
self._reconnect()
File "/obspy/obspy/clients/arclink/client.py", line 174, in _reconnect
self._client.timeout)
File "/usr/lib/python2.7/telnetlib.py", line 227, in open
self.sock = socket.create_connection((host, port), timeout)
File "/usr/lib/python2.7/socket.py", line 575, in create_connection
raise err
error: [Errno 113] No route to host
Traceback (most recent call last):
File "/obspy/obspy/clients/arclink/tests/test_client.py", line 74, in test_get_waveform_no_routing
user='test@obspy.org')
File "/obspy/obspy/clients/arclink/client.py", line 126, in __init__
self._client = Telnet(host, port, timeout)
File "/usr/lib/python2.7/telnetlib.py", line 211, in __init__
self.open(host, port, timeout)
File "/usr/lib/python2.7/telnetlib.py", line 227, in open
self.sock = socket.create_connection((host, port), timeout)
File "/usr/lib/python2.7/socket.py", line 575, in create_connection
raise err
error: [Errno 113] No route to host
Traceback (most recent call last):
File "/obspy/obspy/clients/arclink/tests/test_client.py", line 270, in test_get_waveform_with_metadata
metadata=True)
File "/obspy/obspy/clients/arclink/client.py", line 444, in get_waveforms
compressed=compressed, route=route)
File "/obspy/obspy/clients/arclink/client.py", line 565, in save_waveforms
data = self._fetch(rtype, rdata, route=route)
File "/obspy/obspy/clients/arclink/client.py", line 258, in _fetch
self._reconnect()
File "/obspy/obspy/clients/arclink/client.py", line 174, in _reconnect
self._client.timeout)
File "/usr/lib/python2.7/telnetlib.py", line 227, in open
self.sock = socket.create_connection((host, port), timeout)
File "/usr/lib/python2.7/socket.py", line 575, in create_connection
raise err
error: [Errno 113] No route to host
Traceback (most recent call last):
File "/obspy/obspy/clients/arclink/tests/test_client.py", line 381, in test_get_waveform_wrong_pattern
'', '*', start, end)
File "/usr/lib/python2.7/unittest/case.py", line 473, in assertRaises
callableObj(*args, **kwargs)
File "/obspy/obspy/clients/arclink/client.py", line 444, in get_waveforms
compressed=compressed, route=route)
File "/obspy/obspy/clients/arclink/client.py", line 565, in save_waveforms
data = self._fetch(rtype, rdata, route=route)
File "/obspy/obspy/clients/arclink/client.py", line 258, in _fetch
self._reconnect()
File "/obspy/obspy/clients/arclink/client.py", line 174, in _reconnect
self._client.timeout)
File "/usr/lib/python2.7/telnetlib.py", line 227, in open
self.sock = socket.create_connection((host, port), timeout)
File "/usr/lib/python2.7/socket.py", line 575, in create_connection
raise err
error: [Errno 113] No route to host
Traceback (most recent call last):
File "/obspy/obspy/clients/arclink/tests/test_decrypt.py", line 107, in test_get_waveform_with_default_dcid_key_file
stream2 = client2.get_waveforms('GE', 'APE', '', 'BHZ', start, end)
File "/obspy/obspy/clients/arclink/client.py", line 444, in get_waveforms
compressed=compressed, route=route)
File "/obspy/obspy/clients/arclink/client.py", line 565, in save_waveforms
data = self._fetch(rtype, rdata, route=route)
File "/obspy/obspy/clients/arclink/client.py", line 260, in _fetch
return self._request(request_type, request_data)
File "/obspy/obspy/clients/arclink/client.py", line 324, in _request
raise ArcLinkException("%s %s" % (err_code, msg))
ArcLinkException: UNSET
Traceback (most recent call last):
File "/usr/lib/python2.7/doctest.py", line 2226, in runTest
raise self.failureException(self.format_failure(new.getvalue()))
AssertionError: Failed doctest test for obspy.clients.arclink.client.Client.get_waveforms
File "/obspy/obspy/clients/arclink/client.py", line 391, in get_waveforms
----------------------------------------------------------------------
File "/obspy/obspy/clients/arclink/client.py", line 429, in obspy.clients.arclink.client.Client.get_waveforms
Failed example:
st = client.get_waveforms("BW", "RJOB", "", "EH*", t - 3, t + 15)
Exception raised:
Traceback (most recent call last):
File "/usr/lib/python2.7/doctest.py", line 1315, in __run
compileflags, 1) in test.globs
File "<doctest obspy.clients.arclink.client.Client.get_waveforms[4]>", line 1, in <module>
st = client.get_waveforms("BW", "RJOB", "", "EH*", t - 3, t + 15)
File "/obspy/obspy/clients/arclink/client.py", line 444, in get_waveforms
compressed=compressed, route=route)
File "/obspy/obspy/clients/arclink/client.py", line 565, in save_waveforms
data = self._fetch(rtype, rdata, route=route)
File "/obspy/obspy/clients/arclink/client.py", line 260, in _fetch
return self._request(request_type, request_data)
File "/obspy/obspy/clients/arclink/client.py", line 329, in _request
raise ArcLinkException('No data available')
ArcLinkException: No data available
Traceback (most recent call last):
File "/usr/lib/python2.7/doctest.py", line 2226, in runTest
raise self.failureException(self.format_failure(new.getvalue()))
AssertionError: Failed doctest test for obspy.clients.arclink.__init__
File "/obspy/obspy/clients/arclink/__init__.py", line 1, in __init__
----------------------------------------------------------------------
File "/obspy/obspy/clients/arclink/__init__.py", line 53, in obspy.clients.arclink.__init__
Failed example:
st = client.get_waveforms("BW", "RJOB", "", "EH*", t - 3, t + 15)
Exception raised:
Traceback (most recent call last):
File "/usr/lib/python2.7/doctest.py", line 1315, in __run
compileflags, 1) in test.globs
File "<doctest obspy.clients.arclink.__init__[4]>", line 1, in <module>
st = client.get_waveforms("BW", "RJOB", "", "EH*", t - 3, t + 15)
File "/obspy/obspy/clients/arclink/client.py", line 444, in get_waveforms
compressed=compressed, route=route)
File "/obspy/obspy/clients/arclink/client.py", line 565, in save_waveforms
data = self._fetch(rtype, rdata, route=route)
File "/obspy/obspy/clients/arclink/client.py", line 260, in _fetch
return self._request(request_type, request_data)
File "/obspy/obspy/clients/arclink/client.py", line 329, in _request
raise ArcLinkException('No data available')
ArcLinkException: No data available
Traceback (most recent call last):
File "/obspy/obspy/clients/arclink/tests/test_client.py", line 463, in test_save_waveform
host="erde.geophysik.uni-muenchen.de", port=18001)
File "/obspy/obspy/clients/arclink/client.py", line 126, in __init__
self._client = Telnet(host, port, timeout)
File "/usr/lib/python2.7/telnetlib.py", line 211, in __init__
self.open(host, port, timeout)
File "/usr/lib/python2.7/telnetlib.py", line 227, in open
self.sock = socket.create_connection((host, port), timeout)
File "/usr/lib/python2.7/socket.py", line 575, in create_connection
raise err
error: [Errno 113] No route to host
Traceback (most recent call last):
File "/obspy/obspy/clients/arclink/tests/test_client.py", line 564, in test_save_waveform_compressed
end, unpack=False)
File "/obspy/obspy/clients/arclink/client.py", line 565, in save_waveforms
data = self._fetch(rtype, rdata, route=route)
File "/obspy/obspy/clients/arclink/client.py", line 225, in _fetch
endtime=request_data[1])
File "/obspy/obspy/clients/arclink/client.py", line 622, in get_routing
result = self._fetch(rtype, rdata, route=False)
File "/obspy/obspy/clients/arclink/client.py", line 219, in _fetch
return self._request(request_type, request_data)
File "/obspy/obspy/clients/arclink/client.py", line 324, in _request
raise ArcLinkException("%s %s" % (err_code, msg))
ArcLinkException: UNSET
Traceback (most recent call last):
File "/obspy/obspy/clients/arclink/tests/test_client.py", line 693, in test_issue_311
metadata=False)
File "/obspy/obspy/clients/arclink/client.py", line 444, in get_waveforms
compressed=compressed, route=route)
File "/obspy/obspy/clients/arclink/client.py", line 565, in save_waveforms
data = self._fetch(rtype, rdata, route=route)
File "/obspy/obspy/clients/arclink/client.py", line 258, in _fetch
self._reconnect()
File "/obspy/obspy/clients/arclink/client.py", line 174, in _reconnect
self._client.timeout)
File "/usr/lib/python2.7/telnetlib.py", line 227, in open
self.sock = socket.create_connection((host, port), timeout)
File "/usr/lib/python2.7/socket.py", line 575, in create_connection
raise err
error: [Errno 113] No route to host
Traceback (most recent call last):
File "/obspy/obspy/clients/arclink/tests/test_client.py", line 634, in test_save_response
client.save_response(tempfile, 'BW', 'MANZ', '', 'EHZ', start, end)
File "/obspy/obspy/clients/arclink/client.py", line 1008, in save_response
data = self._fetch(rtype, rdata, route=route)
File "/obspy/obspy/clients/arclink/client.py", line 219, in _fetch
return self._request(request_type, request_data)
File "/obspy/obspy/clients/arclink/client.py", line 324, in _request
raise ArcLinkException("%s %s" % (err_code, msg))
ArcLinkException: UNSET
Traceback (most recent call last):
File "/obspy/obspy/clients/arclink/tests/test_decrypt.py", line 38, in test_get_waveform_with_dcid_key
stream2 = client2.get_waveforms('GE', 'APE', '', 'BHZ', start, end)
File "/obspy/obspy/clients/arclink/client.py", line 444, in get_waveforms
compressed=compressed, route=route)
File "/obspy/obspy/clients/arclink/client.py", line 565, in save_waveforms
data = self._fetch(rtype, rdata, route=route)
File "/obspy/obspy/clients/arclink/client.py", line 260, in _fetch
return self._request(request_type, request_data)
File "/obspy/obspy/clients/arclink/client.py", line 324, in _request
raise ArcLinkException("%s %s" % (err_code, msg))
ArcLinkException: UNSET
Traceback (most recent call last):
File "/obspy/obspy/clients/arclink/tests/test_decrypt.py", line 63, in test_get_waveform_with_dcid_key_file
stream2 = client2.get_waveforms('GE', 'APE', '', 'BHZ', start, end)
File "/obspy/obspy/clients/arclink/client.py", line 444, in get_waveforms
compressed=compressed, route=route)
File "/obspy/obspy/clients/arclink/client.py", line 565, in save_waveforms
data = self._fetch(rtype, rdata, route=route)
File "/obspy/obspy/clients/arclink/client.py", line 225, in _fetch
endtime=request_data[1])
File "/obspy/obspy/clients/arclink/client.py", line 622, in get_routing
result = self._fetch(rtype, rdata, route=False)
File "/obspy/obspy/clients/arclink/client.py", line 219, in _fetch
return self._request(request_type, request_data)
File "/obspy/obspy/clients/arclink/client.py", line 324, in _request
raise ArcLinkException("%s %s" % (err_code, msg))
ArcLinkException: UNSET
Traceback (most recent call last):
File "/obspy/obspy/clients/arclink/tests/test_client.py", line 527, in test_save_waveform_no_compression
end, compressed=False)
File "/obspy/obspy/clients/arclink/client.py", line 565, in save_waveforms
data = self._fetch(rtype, rdata, route=route)
File "/obspy/obspy/clients/arclink/client.py", line 225, in _fetch
endtime=request_data[1])
File "/obspy/obspy/clients/arclink/client.py", line 622, in get_routing
result = self._fetch(rtype, rdata, route=False)
File "/obspy/obspy/clients/arclink/client.py", line 219, in _fetch
return self._request(request_type, request_data)
File "/obspy/obspy/clients/arclink/client.py", line 324, in _request
raise ArcLinkException("%s %s" % (err_code, msg))
ArcLinkException: UNSET
Traceback (most recent call last):
File "/obspy/obspy/clients/arclink/tests/test_client.py", line 667, in test_srl
st = client.get_waveforms("BW", "RJOB", "", "EHZ", t, t + 30)
File "/obspy/obspy/clients/arclink/client.py", line 444, in get_waveforms
compressed=compressed, route=route)
File "/obspy/obspy/clients/arclink/client.py", line 565, in save_waveforms
data = self._fetch(rtype, rdata, route=route)
File "/obspy/obspy/clients/arclink/client.py", line 260, in _fetch
return self._request(request_type, request_data)
File "/obspy/obspy/clients/arclink/client.py", line 324, in _request
raise ArcLinkException("%s %s" % (err_code, msg))
ArcLinkException: UNSET
Traceback (most recent call last):
File "/obspy/obspy/clients/fdsn/tests/test_federator_routing_client.py", line 318, in test_get_waveforms_integration_test
channel="LHZ")
File "<decorator-gen-63>", line 2, in get_waveforms
File "/obspy/obspy/clients/fdsn/routing/routing_client.py", line 82, in _assert_filename_not_in_kwargs
return f(*args, **kwargs)
File "<decorator-gen-62>", line 2, in get_waveforms
File "/obspy/obspy/clients/fdsn/routing/routing_client.py", line 89, in _assert_attach_response_not_in_kwargs
return f(*args, **kwargs)
File "/obspy/obspy/clients/fdsn/routing/routing_client.py", line 334, in get_waveforms
return self.get_waveforms_bulk([bulk], **kwargs)
File "<decorator-gen-70>", line 2, in get_waveforms_bulk
File "/obspy/obspy/clients/fdsn/routing/routing_client.py", line 89, in _assert_attach_response_not_in_kwargs
return f(*args, **kwargs)
File "<decorator-gen-69>", line 2, in get_waveforms_bulk
File "/obspy/obspy/clients/fdsn/routing/routing_client.py", line 82, in _assert_filename_not_in_kwargs
return f(*args, **kwargs)
File "/obspy/obspy/clients/fdsn/routing/federator_routing_client.py", line 87, in get_waveforms_bulk
r = self._download(self._url + "/query", data=bulk_str)
File "/obspy/obspy/clients/base.py", line 245, in _download
self._handle_requests_http_error(r)
File "/obspy/obspy/clients/fdsn/routing/routing_client.py", line 303, in _handle_requests_http_error
raise_on_error(r.status_code, buf)
File "/obspy/obspy/clients/fdsn/client.py", line 1728, in raise_on_error
server_info)
FDSNException: Service responds: Internal server error
Detailed response of server:
Internal Server Error -- Error 500: *** note, WSS warning, a possible programing error has occurred - a null error message was received, alongwith Status: Internal Server Error
Request:
http://service.iris.edu/irisws/fedcatalog/1/query
Request Submitted:
2018/05/23 08:20:35 UTC
Service version:
Service: irisws-fedcatalog version: 1.1.5

Skipped tests (30)

Submodule Test Skip message
geodetics test_gps_2_dist_azimuth_bug150 (obspy.geodetics.tests.test_util_geodetics.UtilGeodeticsTestCase) Module geographiclib is installed, not using calc_vincenty_inverse
clients.arclink test_pycrypto (obspy.clients.arclink.tests.test_decrypt.ClientTestCase) PyCrypto is not installed
clients.seishub test_get_channel_ids (obspy.clients.seishub.tests.test_client.ClientTestCase) Seishub test server not reachable.
clients.seishub test_get_coordinates (obspy.clients.seishub.tests.test_client.ClientTestCase) Seishub test server not reachable.
clients.seishub test_get_event_list (obspy.clients.seishub.tests.test_client.ClientTestCase) Seishub test server not reachable.
clients.seishub test_get_location_ids (obspy.clients.seishub.tests.test_client.ClientTestCase) Seishub test server not reachable.
clients.seishub test_get_network_ids (obspy.clients.seishub.tests.test_client.ClientTestCase) Seishub test server not reachable.
clients.seishub test_get_paz (obspy.clients.seishub.tests.test_client.ClientTestCase) Seishub test server not reachable.
clients.seishub test_get_preview (obspy.clients.seishub.tests.test_client.ClientTestCase) Seishub test server not reachable.
clients.seishub test_get_preview_by_ids (obspy.clients.seishub.tests.test_client.ClientTestCase) Seishub test server not reachable.
clients.seishub test_get_station_ids (obspy.clients.seishub.tests.test_client.ClientTestCase) Seishub test server not reachable.
clients.seishub test_get_waveform_with_metadata (obspy.clients.seishub.tests.test_client.ClientTestCase) Seishub test server not reachable.
clients.seishub test_get_waveforms (obspy.clients.seishub.tests.test_client.ClientTestCase) Seishub test server not reachable.
clients.seishub test_localcache (obspy.clients.seishub.tests.test_client.ClientTestCase) Seishub test server not reachable.
clients.seishub test_ping (obspy.clients.seishub.tests.test_client.ClientTestCase) Seishub test server not reachable.
core test_location_plot_global (obspy.core.tests.test_inventory.InventoryCartopyTestCase) cartopy not installed
core test_location_plot_local (obspy.core.tests.test_inventory.InventoryCartopyTestCase) cartopy not installed
core test_location_plot_ortho (obspy.core.tests.test_inventory.InventoryCartopyTestCase) cartopy not installed
core test_catalog_plot_global (obspy.core.tests.test_event.CatalogCartopyTestCase) Cartopy not installed or too old
core test_catalog_plot_local (obspy.core.tests.test_event.CatalogCartopyTestCase) Cartopy not installed or too old
core test_catalog_plot_ortho (obspy.core.tests.test_event.CatalogCartopyTestCase) Cartopy not installed or too old
core test_catalog_plot_ortho_longitude_wrap (obspy.core.tests.test_event.CatalogCartopyTestCase) Cartopy not installed or too old
core test_flake8 (obspy.core.tests.test_code_formatting.CodeFormattingTestCase) flake8 check disabled
core test_location_plot_global (obspy.core.tests.test_network.NetworkCartopyTestCase) cartopy not installed
core test_location_plot_local (obspy.core.tests.test_network.NetworkCartopyTestCase) cartopy not installed
core test_location_plot_ortho (obspy.core.tests.test_network.NetworkCartopyTestCase) cartopy not installed
imaging test_script_plot (obspy.imaging.tests.test_mopad_script.MopadTestCase) Currently broken until further review.
clients.seedlink test_info (obspy.clients.seedlink.tests.test_slclient.SLClientTestCase) test must be started manually
clients.seedlink test_issue708 (obspy.clients.seedlink.tests.test_slclient.SLClientTestCase) test must be started manually
clients.seedlink test_time_window (obspy.clients.seedlink.tests.test_slclient.SLClientTestCase) test must be started manually

Slowest tests (20)

Runtime Test
34.755s test_get_waveform_with_dcid_key (obspy.clients.arclink.tests.test_decrypt.ClientTestCase)
34.690s test_get_inventory_stationgroup (obspy.clients.arclink.tests.test_client.ClientTestCase)
33.558s test_get_waveform_with_default_dcid_key_file (obspy.clients.arclink.tests.test_decrypt.ClientTestCase)
32.362s test_get_waveform_with_dcid_key_file (obspy.clients.arclink.tests.test_decrypt.ClientTestCase)
31.936s test_srl (obspy.clients.arclink.tests.test_client.ClientTestCase)
31.255s test_issue_372 (obspy.clients.arclink.tests.test_client.ClientTestCase)
31.062s test_save_waveform_compressed (obspy.clients.arclink.tests.test_client.ClientTestCase)
31.060s test_save_response (obspy.clients.arclink.tests.test_client.ClientTestCase)
31.053s test_save_waveform_no_compression (obspy.clients.arclink.tests.test_client.ClientTestCase)
24.812s test_cryptography (obspy.clients.arclink.tests.test_decrypt.ClientTestCase)
21.862s test_get_networks (obspy.clients.arclink.tests.test_client.ClientTestCase)
17.523s test_get_waveform_instrument_change (obspy.clients.arclink.tests.test_client.ClientTestCase)
10.988s test_plot_farfield_without_quiver_with_maps (obspy.core.tests.test_event.EventTestCase)
10.830s test_get_inventory (obspy.clients.arclink.tests.test_client.ClientTestCase)
10.611s test_redirection_auth (obspy.clients.fdsn.tests.test_client.ClientTestCase)
10.410s test_response_calculation_from_seed_and_xseed (obspy.io.xseed.tests.test_core.CoreTestCase)
10.101s test_redirection (obspy.clients.fdsn.tests.test_client.ClientTestCase)
9.853s test_dataselect_bulk (obspy.clients.fdsn.tests.test_client.ClientTestCase)
9.668s test_ppsd_restricted_stacks (obspy.signal.tests.test_spectral_estimation.PsdTestCase)
8.963s test_get_stations (obspy.clients.arclink.tests.test_client.ClientTestCase)

Chuck Norris fact

Chuck Norris can write infinite recursion functions and have them return.