#96859 Report by node sphinx covering 2040 tests from 55 modules resulted into 20 errors

Report

ObsPy Version
1.1.1rc1.post0+255.g06906f3...
Continuous Integration
-
GitHub Pull Request
-
Report File
XML Document
Total Runtime
1287.9 sec
Report Date/Time
2018-06-07 18:15:57

System / Python

Architecture
32bit
Machine
i686
Node
sphinx
Processor
i686
Python Compiler
GCC 4.4.7 20120313 (Red Hat 4.4.7-1)
Python Implementation
CPython
Python Version
3.4.4
Release
2.6.32-042stab130.1
System
Linux
Version
#1 SMP Tue May 22 09:19:34 MSK 2018

Dependencies

cartopy
---
decorator
4.0.6
flake8
2.5.1
future
0.15.2
geographiclib
---
lxml.etree
3.3.5
m2crypto
---
matplotlib
2.0.2
mock
1.3.0
mpl_toolkits.basemap
1.0.7
numpy
1.10.4
pep8-naming
---
pyflakes
1.0.0
pyimgur
---
pyproj
1.9.4
requests
2.9.1
scipy
0.17.0
setuptools
19.6.2
shapefile
---
sqlalchemy
1.0.11

Modules (55)

Module Errors /
Failures
Tracebacks
obspy.clients.arclink 11 1 2 3 4 5 6 7 8 9 10 11
obspy.clients.earthworm - -
obspy.clients.fdsn 1 12
obspy.clients.filesystem - -
obspy.clients.iris - -
obspy.clients.neic - -
obspy.clients.nrl - -
obspy.clients.seedlink 2 13 14
obspy.clients.seishub - -
obspy.clients.syngine 6 15 16 17 18 19 20
obspy.core - -
obspy.db - -
obspy.geodetics - -
obspy.imaging - -
obspy.io.ah - -
obspy.io.arclink - -
obspy.io.ascii - -
obspy.io.cmtsolution - -
obspy.io.cnv - -
obspy.io.css - -
obspy.io.gcf - -
obspy.io.gse2 - -
obspy.io.iaspei - -
obspy.io.json - -
obspy.io.kinemetrics - -
obspy.io.kml - -
obspy.io.mseed - -
obspy.io.ndk - -
obspy.io.nied - -
obspy.io.nlloc - -
obspy.io.nordic - -
obspy.io.pdas - -
obspy.io.pde - -
obspy.io.quakeml - -
obspy.io.reftek - -
obspy.io.rg16 - -
obspy.io.sac - -
obspy.io.scardec - -
obspy.io.seg2 - -
obspy.io.segy - -
obspy.io.seisan - -
obspy.io.seiscomp - -
obspy.io.sh - -
obspy.io.shapefile - -
obspy.io.stationtxt - -
obspy.io.stationxml - -
obspy.io.wav - -
obspy.io.win - -
obspy.io.xseed - -
obspy.io.y - -
obspy.io.zmap - -
obspy.realtime - -
obspy.scripts - -
obspy.signal - -
obspy.taup - -
Summary 20 20

Tracebacks (20)

Traceback (most recent call last):
File "/private-backup/home/obspy/update-docs/src/obspy/obspy/clients/arclink/tests/test_client.py", line 508, in test_get_waveform_no_compression
compressed=False)
File "/private-backup/home/obspy/update-docs/src/obspy/obspy/clients/arclink/client.py", line 444, in get_waveforms
compressed=compressed, route=route)
File "/private-backup/home/obspy/update-docs/src/obspy/obspy/clients/arclink/client.py", line 565, in save_waveforms
data = self._fetch(rtype, rdata, route=route)
File "/private-backup/home/obspy/update-docs/src/obspy/obspy/clients/arclink/client.py", line 225, in _fetch
endtime=request_data[1])
File "/private-backup/home/obspy/update-docs/src/obspy/obspy/clients/arclink/client.py", line 622, in get_routing
result = self._fetch(rtype, rdata, route=False)
File "/private-backup/home/obspy/update-docs/src/obspy/obspy/clients/arclink/client.py", line 219, in _fetch
return self._request(request_type, request_data)
File "/private-backup/home/obspy/update-docs/src/obspy/obspy/clients/arclink/client.py", line 324, in _request
raise ArcLinkException("%s %s" % (err_code, msg))
obspy.clients.arclink.client.ArcLinkException: b'UNSET'
Traceback (most recent call last):
File "/private-backup/home/obspy/update-docs/src/obspy/obspy/clients/arclink/tests/test_decrypt.py", line 82, in test_get_waveform_with_dcid_key_file
stream2 = client2.get_waveforms('GE', 'APE', '', 'BHZ', start, end)
File "/private-backup/home/obspy/update-docs/src/obspy/obspy/clients/arclink/client.py", line 444, in get_waveforms
compressed=compressed, route=route)
File "/private-backup/home/obspy/update-docs/src/obspy/obspy/clients/arclink/client.py", line 565, in save_waveforms
data = self._fetch(rtype, rdata, route=route)
File "/private-backup/home/obspy/update-docs/src/obspy/obspy/clients/arclink/client.py", line 225, in _fetch
endtime=request_data[1])
File "/private-backup/home/obspy/update-docs/src/obspy/obspy/clients/arclink/client.py", line 622, in get_routing
result = self._fetch(rtype, rdata, route=False)
File "/private-backup/home/obspy/update-docs/src/obspy/obspy/clients/arclink/client.py", line 219, in _fetch
return self._request(request_type, request_data)
File "/private-backup/home/obspy/update-docs/src/obspy/obspy/clients/arclink/client.py", line 324, in _request
raise ArcLinkException("%s %s" % (err_code, msg))
obspy.clients.arclink.client.ArcLinkException: b'UNSET'
Traceback (most recent call last):
File "/private-backup/home/obspy/update-docs/src/obspy/obspy/clients/arclink/tests/test_decrypt.py", line 158, in test_cryptography
self.test_get_waveform_with_dcid_key()
File "/private-backup/home/obspy/update-docs/src/obspy/obspy/clients/arclink/tests/test_decrypt.py", line 38, in test_get_waveform_with_dcid_key
stream2 = client2.get_waveforms('GE', 'APE', '', 'BHZ', start, end)
File "/private-backup/home/obspy/update-docs/src/obspy/obspy/clients/arclink/client.py", line 444, in get_waveforms
compressed=compressed, route=route)
File "/private-backup/home/obspy/update-docs/src/obspy/obspy/clients/arclink/client.py", line 565, in save_waveforms
data = self._fetch(rtype, rdata, route=route)
File "/private-backup/home/obspy/update-docs/src/obspy/obspy/clients/arclink/client.py", line 260, in _fetch
return self._request(request_type, request_data)
File "/private-backup/home/obspy/update-docs/src/obspy/obspy/clients/arclink/client.py", line 324, in _request
raise ArcLinkException("%s %s" % (err_code, msg))
obspy.clients.arclink.client.ArcLinkException: b'UNSET'
Traceback (most recent call last):
File "/private-backup/home/obspy/update-docs/src/obspy/obspy/clients/arclink/tests/test_client.py", line 404, in test_get_stations
result = client.get_stations(start, end, 'BW')
File "/private-backup/home/obspy/update-docs/src/obspy/obspy/clients/arclink/client.py", line 1379, in get_stations
endtime=endtime, route=route)
File "/private-backup/home/obspy/update-docs/src/obspy/obspy/clients/arclink/client.py", line 1123, in get_inventory
result = self._fetch(rtype, rdata, route=route)
File "/private-backup/home/obspy/update-docs/src/obspy/obspy/clients/arclink/client.py", line 219, in _fetch
return self._request(request_type, request_data)
File "/private-backup/home/obspy/update-docs/src/obspy/obspy/clients/arclink/client.py", line 324, in _request
raise ArcLinkException("%s %s" % (err_code, msg))
obspy.clients.arclink.client.ArcLinkException: b'UNSET'
Traceback (most recent call last):
File "/private-backup/home/obspy/update-docs/src/obspy/obspy/clients/arclink/tests/test_client.py", line 35, in test_get_waveform
stream = client.get_waveforms('BW', 'MANZ', '', 'EH*', start, end)
File "/private-backup/home/obspy/update-docs/src/obspy/obspy/clients/arclink/client.py", line 444, in get_waveforms
compressed=compressed, route=route)
File "/private-backup/home/obspy/update-docs/src/obspy/obspy/clients/arclink/client.py", line 565, in save_waveforms
data = self._fetch(rtype, rdata, route=route)
File "/private-backup/home/obspy/update-docs/src/obspy/obspy/clients/arclink/client.py", line 225, in _fetch
endtime=request_data[1])
File "/private-backup/home/obspy/update-docs/src/obspy/obspy/clients/arclink/client.py", line 622, in get_routing
result = self._fetch(rtype, rdata, route=False)
File "/private-backup/home/obspy/update-docs/src/obspy/obspy/clients/arclink/client.py", line 219, in _fetch
return self._request(request_type, request_data)
File "/private-backup/home/obspy/update-docs/src/obspy/obspy/clients/arclink/client.py", line 324, in _request
raise ArcLinkException("%s %s" % (err_code, msg))
obspy.clients.arclink.client.ArcLinkException: b'UNSET'
Traceback (most recent call last):
File "/private-backup/home/obspy/update-docs/src/obspy/obspy/clients/arclink/tests/test_client.py", line 172, in test_get_inventory
endtime=dt + 1)
File "/private-backup/home/obspy/update-docs/src/obspy/obspy/clients/arclink/client.py", line 1123, in get_inventory
result = self._fetch(rtype, rdata, route=route)
File "/private-backup/home/obspy/update-docs/src/obspy/obspy/clients/arclink/client.py", line 219, in _fetch
return self._request(request_type, request_data)
File "/private-backup/home/obspy/update-docs/src/obspy/obspy/clients/arclink/client.py", line 324, in _request
raise ArcLinkException("%s %s" % (err_code, msg))
obspy.clients.arclink.client.ArcLinkException: b'UNSET'
Traceback (most recent call last):
File "/private-backup/home/obspy/update-docs/src/obspy/obspy/clients/arclink/tests/test_client.py", line 757, in test_get_waveform_instrument_change
metadata=True)
File "/private-backup/home/obspy/update-docs/src/obspy/obspy/clients/arclink/client.py", line 444, in get_waveforms
compressed=compressed, route=route)
File "/private-backup/home/obspy/update-docs/src/obspy/obspy/clients/arclink/client.py", line 565, in save_waveforms
data = self._fetch(rtype, rdata, route=route)
File "/private-backup/home/obspy/update-docs/src/obspy/obspy/clients/arclink/client.py", line 225, in _fetch
endtime=request_data[1])
File "/private-backup/home/obspy/update-docs/src/obspy/obspy/clients/arclink/client.py", line 622, in get_routing
result = self._fetch(rtype, rdata, route=False)
File "/private-backup/home/obspy/update-docs/src/obspy/obspy/clients/arclink/client.py", line 219, in _fetch
return self._request(request_type, request_data)
File "/private-backup/home/obspy/update-docs/src/obspy/obspy/clients/arclink/client.py", line 324, in _request
raise ArcLinkException("%s %s" % (err_code, msg))
obspy.clients.arclink.client.ArcLinkException: b'UNSET'
Traceback (most recent call last):
File "/private-backup/home/obspy/update-docs/src/obspy/obspy/clients/arclink/tests/test_client.py", line 564, in test_save_waveform_compressed
end, unpack=False)
File "/private-backup/home/obspy/update-docs/src/obspy/obspy/clients/arclink/client.py", line 565, in save_waveforms
data = self._fetch(rtype, rdata, route=route)
File "/private-backup/home/obspy/update-docs/src/obspy/obspy/clients/arclink/client.py", line 260, in _fetch
return self._request(request_type, request_data)
File "/private-backup/home/obspy/update-docs/src/obspy/obspy/clients/arclink/client.py", line 324, in _request
raise ArcLinkException("%s %s" % (err_code, msg))
obspy.clients.arclink.client.ArcLinkException: b'UNSET'
Traceback (most recent call last):
File "/private-backup/home/obspy/update-docs/src/obspy/obspy/clients/arclink/tests/test_client.py", line 126, in test_get_routing
results = client.get_routing('BW', 'RJOB', dt, dt + 1)
File "/private-backup/home/obspy/update-docs/src/obspy/obspy/clients/arclink/client.py", line 622, in get_routing
result = self._fetch(rtype, rdata, route=False)
File "/private-backup/home/obspy/update-docs/src/obspy/obspy/clients/arclink/client.py", line 219, in _fetch
return self._request(request_type, request_data)
File "/private-backup/home/obspy/update-docs/src/obspy/obspy/clients/arclink/client.py", line 324, in _request
raise ArcLinkException("%s %s" % (err_code, msg))
obspy.clients.arclink.client.ArcLinkException: b'UNSET'
Traceback (most recent call last):
File "/home/obspy/anaconda3/envs/tmp_build_docs/lib/python3.4/doctest.py", line 2187, in runTest
raise self.failureException(self.format_failure(new.getvalue()))
AssertionError: Failed doctest test for obspy.clients.arclink.__init__
File "/private-backup/home/obspy/update-docs/src/obspy/obspy/clients/arclink/__init__.py", line 1, in __init__
----------------------------------------------------------------------
File "/private-backup/home/obspy/update-docs/src/obspy/obspy/clients/arclink/__init__.py", line 79, in obspy.clients.arclink.__init__
Failed example:
paz = client.get_paz('BW', 'MANZ', '', 'EHZ', dt)
Exception raised:
Traceback (most recent call last):
File "/home/obspy/anaconda3/envs/tmp_build_docs/lib/python3.4/doctest.py", line 1318, in __run
compileflags, 1), test.globs)
File "<doctest obspy.clients.arclink.__init__[10]>", line 1, in <module>
paz = client.get_paz('BW', 'MANZ', '', 'EHZ', dt)
File "/private-backup/home/obspy/update-docs/src/obspy/obspy/clients/arclink/client.py", line 947, in get_paz
instruments=True, route=route)
File "/private-backup/home/obspy/update-docs/src/obspy/obspy/clients/arclink/client.py", line 1123, in get_inventory
result = self._fetch(rtype, rdata, route=route)
File "/private-backup/home/obspy/update-docs/src/obspy/obspy/clients/arclink/client.py", line 219, in _fetch
return self._request(request_type, request_data)
File "/private-backup/home/obspy/update-docs/src/obspy/obspy/clients/arclink/client.py", line 324, in _request
raise ArcLinkException("%s %s" % (err_code, msg))
obspy.clients.arclink.client.ArcLinkException: b'UNSET'
Traceback (most recent call last):
File "/private-backup/home/obspy/update-docs/src/obspy/obspy/clients/arclink/tests/test_client.py", line 527, in test_save_waveform_no_compression
end, compressed=False)
File "/private-backup/home/obspy/update-docs/src/obspy/obspy/clients/arclink/client.py", line 565, in save_waveforms
data = self._fetch(rtype, rdata, route=route)
File "/private-backup/home/obspy/update-docs/src/obspy/obspy/clients/arclink/client.py", line 225, in _fetch
endtime=request_data[1])
File "/private-backup/home/obspy/update-docs/src/obspy/obspy/clients/arclink/client.py", line 622, in get_routing
result = self._fetch(rtype, rdata, route=False)
File "/private-backup/home/obspy/update-docs/src/obspy/obspy/clients/arclink/client.py", line 219, in _fetch
return self._request(request_type, request_data)
File "/private-backup/home/obspy/update-docs/src/obspy/obspy/clients/arclink/client.py", line 324, in _request
raise ArcLinkException("%s %s" % (err_code, msg))
obspy.clients.arclink.client.ArcLinkException: b'UNSET'
Traceback (most recent call last):
File "/private-backup/home/obspy/update-docs/src/obspy/obspy/clients/fdsn/tests/test_client.py", line 1286, in test_eida_token_resolution
user, password = client._resolve_eida_token(token=token)
File "/private-backup/home/obspy/update-docs/src/obspy/obspy/clients/fdsn/client.py", line 374, in _resolve_eida_token
use_gzip=True, return_string=True)
File "/private-backup/home/obspy/update-docs/src/obspy/obspy/clients/fdsn/client.py", line 1383, in _download
raise_on_error(code, data)
File "/private-backup/home/obspy/update-docs/src/obspy/obspy/clients/fdsn/client.py", line 1736, in raise_on_error
(str(data.__class__.__name__), str(data))))
obspy.clients.fdsn.header.FDSNException: Unknown Error (URLError): <urlopen error [SSL: CERTIFICATE_VERIFY_FAILED] certificate verify failed (_ssl.c:600)>
Traceback (most recent call last):
File "/home/obspy/anaconda3/envs/tmp_build_docs/lib/python3.4/doctest.py", line 2187, in runTest
raise self.failureException(self.format_failure(new.getvalue()))
AssertionError: Failed doctest test for obspy.clients.seedlink.basic_client.Client.get_waveforms
File "/private-backup/home/obspy/update-docs/src/obspy/obspy/clients/seedlink/basic_client.py", line 62, in get_waveforms
----------------------------------------------------------------------
File "/private-backup/home/obspy/update-docs/src/obspy/obspy/clients/seedlink/basic_client.py", line 69, in obspy.clients.seedlink.basic_client.Client.get_waveforms
Failed example:
st = client.get_waveforms("G", "FDF", "00", "BHZ", t, t + 5)
Exception raised:
Traceback (most recent call last):
File "/private-backup/home/obspy/update-docs/src/obspy/obspy/clients/seedlink/client/seedlinkconnection.py", line 1049, in connect
sock.connect((host_name, nport))
TimeoutError: [Errno 110] Connection timed out
During handling of the above exception, another exception occurred:
Traceback (most recent call last):
File "/home/obspy/anaconda3/envs/tmp_build_docs/lib/python3.4/doctest.py", line 1318, in __run
compileflags, 1), test.globs)
File "<doctest obspy.clients.seedlink.basic_client.Client.get_waveforms[3]>", line 1, in <module>
st = client.get_waveforms("G", "FDF", "00", "BHZ", t, t + 5)
File "/private-backup/home/obspy/update-docs/src/obspy/obspy/clients/seedlink/basic_client.py", line 125, in get_waveforms
self._slclient.run(packet_handler=self._packet_handler)
File "/private-backup/home/obspy/update-docs/src/obspy/obspy/clients/seedlink/slclient.py", line 243, in run
slpack = self.slconn.collect()
File "/private-backup/home/obspy/update-docs/src/obspy/obspy/clients/seedlink/client/seedlinkconnection.py", line 821, in collect
self.connect()
File "/private-backup/home/obspy/update-docs/src/obspy/obspy/clients/seedlink/client/seedlinkconnection.py", line 1071, in connect
raise SeedLinkException(msg % (e))
obspy.clients.seedlink.seedlinkexception.SeedLinkException: 'cannot connect to SeedLink server: [Errno 110] Connection timed out'
----------------------------------------------------------------------
File "/private-backup/home/obspy/update-docs/src/obspy/obspy/clients/seedlink/basic_client.py", line 70, in obspy.clients.seedlink.basic_client.Client.get_waveforms
Failed example:
print(st) # doctest: +ELLIPSIS
Exception raised:
Traceback (most recent call last):
File "/home/obspy/anaconda3/envs/tmp_build_docs/lib/python3.4/doctest.py", line 1318, in __run
compileflags, 1), test.globs)
File "<doctest obspy.clients.seedlink.basic_client.Client.get_waveforms[4]>", line 1, in <module>
print(st) # doctest: +ELLIPSIS
NameError: name 'st' is not defined
----------------------------------------------------------------------
File "/private-backup/home/obspy/update-docs/src/obspy/obspy/clients/seedlink/basic_client.py", line 77, in obspy.clients.seedlink.basic_client.Client.get_waveforms
Failed example:
st = client.get_waveforms("G", "FDF", "??", "B??", t, t + 5)
Exception raised:
Traceback (most recent call last):
File "/private-backup/home/obspy/update-docs/src/obspy/obspy/clients/seedlink/client/seedlinkconnection.py", line 1049, in connect
sock.connect((host_name, nport))
TimeoutError: [Errno 110] Connection timed out
During handling of the above exception, another exception occurred:
Traceback (most recent call last):
File "/home/obspy/anaconda3/envs/tmp_build_docs/lib/python3.4/doctest.py", line 1318, in __run
compileflags, 1), test.globs)
File "<doctest obspy.clients.seedlink.basic_client.Client.get_waveforms[5]>", line 1, in <module>
st = client.get_waveforms("G", "FDF", "??", "B??", t, t + 5)
File "/private-backup/home/obspy/update-docs/src/obspy/obspy/clients/seedlink/basic_client.py", line 125, in get_waveforms
self._slclient.run(packet_handler=self._packet_handler)
File "/private-backup/home/obspy/update-docs/src/obspy/obspy/clients/seedlink/slclient.py", line 243, in run
slpack = self.slconn.collect()
File "/private-backup/home/obspy/update-docs/src/obspy/obspy/clients/seedlink/client/seedlinkconnection.py", line 821, in collect
self.connect()
File "/private-backup/home/obspy/update-docs/src/obspy/obspy/clients/seedlink/client/seedlinkconnection.py", line 1071, in connect
raise SeedLinkException(msg % (e))
obspy.clients.seedlink.seedlinkexception.SeedLinkException: 'cannot connect to SeedLink server: [Errno 110] Connection timed out'
----------------------------------------------------------------------
File "/private-backup/home/obspy/update-docs/src/obspy/obspy/clients/seedlink/basic_client.py", line 78, in obspy.clients.seedlink.basic_client.Client.get_waveforms
Failed example:
st = st.sort(reverse=True)
Exception raised:
Traceback (most recent call last):
File "/home/obspy/anaconda3/envs/tmp_build_docs/lib/python3.4/doctest.py", line 1318, in __run
compileflags, 1), test.globs)
File "<doctest obspy.clients.seedlink.basic_client.Client.get_waveforms[6]>", line 1, in <module>
st = st.sort(reverse=True)
NameError: name 'st' is not defined
----------------------------------------------------------------------
File "/private-backup/home/obspy/update-docs/src/obspy/obspy/clients/seedlink/basic_client.py", line 79, in obspy.clients.seedlink.basic_client.Client.get_waveforms
Failed example:
print(st) # doctest: +ELLIPSIS
Exception raised:
Traceback (most recent call last):
File "/home/obspy/anaconda3/envs/tmp_build_docs/lib/python3.4/doctest.py", line 1318, in __run
compileflags, 1), test.globs)
File "<doctest obspy.clients.seedlink.basic_client.Client.get_waveforms[7]>", line 1, in <module>
print(st) # doctest: +ELLIPSIS
NameError: name 'st' is not defined
Traceback (most recent call last):
File "/private-backup/home/obspy/update-docs/src/obspy/obspy/clients/seedlink/client/seedlinkconnection.py", line 1049, in connect
sock.connect((host_name, nport))
TimeoutError: [Errno 110] Connection timed out
During handling of the above exception, another exception occurred:
Traceback (most recent call last):
File "/private-backup/home/obspy/update-docs/src/obspy/obspy/clients/seedlink/tests/test_basic_client.py", line 42, in test_get_waveform
_test_offset_from_realtime(offset)
File "/private-backup/home/obspy/update-docs/src/obspy/obspy/clients/seedlink/tests/test_basic_client.py", line 24, in _test_offset_from_realtime
st = self.client.get_waveforms(*request)
File "/private-backup/home/obspy/update-docs/src/obspy/obspy/clients/seedlink/basic_client.py", line 125, in get_waveforms
self._slclient.run(packet_handler=self._packet_handler)
File "/private-backup/home/obspy/update-docs/src/obspy/obspy/clients/seedlink/slclient.py", line 243, in run
slpack = self.slconn.collect()
File "/private-backup/home/obspy/update-docs/src/obspy/obspy/clients/seedlink/client/seedlinkconnection.py", line 821, in collect
self.connect()
File "/private-backup/home/obspy/update-docs/src/obspy/obspy/clients/seedlink/client/seedlinkconnection.py", line 1071, in connect
raise SeedLinkException(msg % (e))
obspy.clients.seedlink.seedlinkexception.SeedLinkException: 'cannot connect to SeedLink server: [Errno 110] Connection timed out'
Traceback (most recent call last):
File "/private-backup/home/obspy/update-docs/src/obspy/obspy/clients/syngine/tests/test_client.py", line 423, in test_saving_directly_to_file
endtime="P+10", components="Z", filename=tf)
File "/private-backup/home/obspy/update-docs/src/obspy/obspy/clients/syngine/client.py", line 371, in get_waveforms
filename=filename)
File "/private-backup/home/obspy/update-docs/src/obspy/obspy/clients/base.py", line 245, in _download
self._handle_requests_http_error(r)
File "/private-backup/home/obspy/update-docs/src/obspy/obspy/clients/syngine/client.py", line 62, in _handle_requests_http_error
raise ClientHTTPException(msg.strip())
obspy.clients.base.ClientHTTPException: HTTP code 500 when downloading 'http://service.iris.edu/irisws/syngine/1/query?station=ANMO&starttime=P-10&format=miniseed&network=IU&eventid=GCMT%3AC201002270634A&components=Z&endtime=P%2B10&model=test':
Error 500: GCMT lookup error [404]: <!DOCTYPE HTML PUBLIC "-//IETF//DTD HTML 2.0//EN">
<html><head>
<title>404 Not Found</title>
</head><body>
<h1>Not Found</h1>
<p>The requested URL /spudservice/momenttensor/gcmtid/C201002270634A/ndk was not found on this server.</p>
<p>Additionally, a 302 Found
error was encountered while trying to use an ErrorDocument to handle the request.</p>
<hr>
<address>Apache/2.2.15 (CentOS) Server at ds.iris.edu Port 80</address>
</body></html>
More Details:
handler exited, code: 1 reason: Internal Server Error
Request:
http://service.iris.edu/irisws/syngine/1/query?station=ANMO&starttime=P-10&format=miniseed&network=IU&eventid=GCMT%3AC201002270634A&components=Z&endtime=P%2B10&model=test
Request Submitted:
2018/06/07 23:08:43 UTC
Service version:
Service: irisws-syngine version: 1.0.4
Traceback (most recent call last):
File "/private-backup/home/obspy/update-docs/src/obspy/obspy/clients/syngine/tests/test_client.py", line 447, in test_reading_saczip_files
endtime="P+10", components="Z", format="saczip")
File "/private-backup/home/obspy/update-docs/src/obspy/obspy/clients/syngine/client.py", line 371, in get_waveforms
filename=filename)
File "/private-backup/home/obspy/update-docs/src/obspy/obspy/clients/base.py", line 245, in _download
self._handle_requests_http_error(r)
File "/private-backup/home/obspy/update-docs/src/obspy/obspy/clients/syngine/client.py", line 62, in _handle_requests_http_error
raise ClientHTTPException(msg.strip())
obspy.clients.base.ClientHTTPException: HTTP code 500 when downloading 'http://service.iris.edu/irisws/syngine/1/query?station=ANMO&starttime=P-10&format=saczip&network=IU&eventid=GCMT%3AC201002270634A&components=Z&endtime=P%2B10&model=test':
Error 500: GCMT lookup error [404]: <!DOCTYPE HTML PUBLIC "-//IETF//DTD HTML 2.0//EN">
<html><head>
<title>404 Not Found</title>
</head><body>
<h1>Not Found</h1>
<p>The requested URL /spudservice/momenttensor/gcmtid/C201002270634A/ndk was not found on this server.</p>
<p>Additionally, a 302 Found
error was encountered while trying to use an ErrorDocument to handle the request.</p>
<hr>
<address>Apache/2.2.15 (CentOS) Server at ds.iris.edu Port 80</address>
</body></html>
More Details:
handler exited, code: 1 reason: Internal Server Error
Request:
http://service.iris.edu/irisws/syngine/1/query?station=ANMO&starttime=P-10&format=saczip&network=IU&eventid=GCMT%3AC201002270634A&components=Z&endtime=P%2B10&model=test
Request Submitted:
2018/06/07 23:08:42 UTC
Service version:
Service: irisws-syngine version: 1.0.4
Traceback (most recent call last):
File "/private-backup/home/obspy/update-docs/src/obspy/obspy/clients/syngine/tests/test_client.py", line 353, in test_get_waveforms
components="Z")
File "/private-backup/home/obspy/update-docs/src/obspy/obspy/clients/syngine/client.py", line 371, in get_waveforms
filename=filename)
File "/private-backup/home/obspy/update-docs/src/obspy/obspy/clients/base.py", line 245, in _download
self._handle_requests_http_error(r)
File "/private-backup/home/obspy/update-docs/src/obspy/obspy/clients/syngine/client.py", line 62, in _handle_requests_http_error
raise ClientHTTPException(msg.strip())
obspy.clients.base.ClientHTTPException: HTTP code 500 when downloading 'http://service.iris.edu/irisws/syngine/1/query?station=ANMO&format=miniseed&network=IU&eventid=GCMT%3AC201002270634A&components=Z&model=test':
Error 500: GCMT lookup error [404]: <!DOCTYPE HTML PUBLIC "-//IETF//DTD HTML 2.0//EN">
<html><head>
<title>404 Not Found</title>
</head><body>
<h1>Not Found</h1>
<p>The requested URL /spudservice/momenttensor/gcmtid/C201002270634A/ndk was not found on this server.</p>
<p>Additionally, a 302 Found
error was encountered while trying to use an ErrorDocument to handle the request.</p>
<hr>
<address>Apache/2.2.15 (CentOS) Server at ds.iris.edu Port 80</address>
</body></html>
More Details:
handler exited, code: 1 reason: Internal Server Error
Request:
http://service.iris.edu/irisws/syngine/1/query?station=ANMO&format=miniseed&network=IU&eventid=GCMT%3AC201002270634A&components=Z&model=test
Request Submitted:
2018/06/07 23:08:42 UTC
Service version:
Service: irisws-syngine version: 1.0.4
Traceback (most recent call last):
File "/home/obspy/anaconda3/envs/tmp_build_docs/lib/python3.4/doctest.py", line 2187, in runTest
raise self.failureException(self.format_failure(new.getvalue()))
AssertionError: Failed doctest test for obspy.clients.syngine.__init__
File "/private-backup/home/obspy/update-docs/src/obspy/obspy/clients/syngine/__init__.py", line 1, in __init__
----------------------------------------------------------------------
File "/private-backup/home/obspy/update-docs/src/obspy/obspy/clients/syngine/__init__.py", line 28, in obspy.clients.syngine.__init__
Failed example:
st = client.get_waveforms(model="ak135f_5s", network="IU", station="ANMO",
eventid="GCMT:C201002270634A")
Exception raised:
Traceback (most recent call last):
File "/home/obspy/anaconda3/envs/tmp_build_docs/lib/python3.4/doctest.py", line 1318, in __run
compileflags, 1), test.globs)
File "<doctest obspy.clients.syngine.__init__[2]>", line 2, in <module>
eventid="GCMT:C201002270634A")
File "/private-backup/home/obspy/update-docs/src/obspy/obspy/clients/syngine/client.py", line 371, in get_waveforms
filename=filename)
File "/private-backup/home/obspy/update-docs/src/obspy/obspy/clients/base.py", line 245, in _download
self._handle_requests_http_error(r)
File "/private-backup/home/obspy/update-docs/src/obspy/obspy/clients/syngine/client.py", line 62, in _handle_requests_http_error
raise ClientHTTPException(msg.strip())
obspy.clients.base.ClientHTTPException: HTTP code 500 when downloading 'http://service.iris.edu/irisws/syngine/1/query?station=ANMO&model=ak135f_5s&format=miniseed&network=IU&eventid=GCMT%3AC201002270634A':
Error 500: GCMT lookup error [404]: <!DOCTYPE HTML PUBLIC "-//IETF//DTD HTML 2.0//EN">
<html><head>
<title>404 Not Found</title>
</head><body>
<h1>Not Found</h1>
<p>The requested URL /spudservice/momenttensor/gcmtid/C201002270634A/ndk was not found on this server.</p>
<p>Additionally, a 302 Found
error was encountered while trying to use an ErrorDocument to handle the request.</p>
<hr>
<address>Apache/2.2.15 (CentOS) Server at ds.iris.edu Port 80</address>
</body></html>
More Details:
handler exited, code: 1 reason: Internal Server Error
Request:
http://service.iris.edu/irisws/syngine/1/query?station=ANMO&model=ak135f_5s&format=miniseed&network=IU&eventid=GCMT%3AC201002270634A
Request Submitted:
2018/06/07 23:08:36 UTC
Service version:
Service: irisws-syngine version: 1.0.4
----------------------------------------------------------------------
File "/private-backup/home/obspy/update-docs/src/obspy/obspy/clients/syngine/__init__.py", line 30, in obspy.clients.syngine.__init__
Failed example:
print(st) # doctest: +ELLIPSIS
Exception raised:
Traceback (most recent call last):
File "/home/obspy/anaconda3/envs/tmp_build_docs/lib/python3.4/doctest.py", line 1318, in __run
compileflags, 1), test.globs)
File "<doctest obspy.clients.syngine.__init__[3]>", line 1, in <module>
print(st) # doctest: +ELLIPSIS
NameError: name 'st' is not defined
----------------------------------------------------------------------
File "/private-backup/home/obspy/update-docs/src/obspy/obspy/clients/syngine/__init__.py", line 54, in obspy.clients.syngine.__init__
Failed example:
st = client.get_waveforms(model="ak135f_5s", network="IU", station="AN*",
eventid="GCMT:C201002270634A",
starttime="P-10", endtime="P+20")
Exception raised:
Traceback (most recent call last):
File "/home/obspy/anaconda3/envs/tmp_build_docs/lib/python3.4/doctest.py", line 1318, in __run
compileflags, 1), test.globs)
File "<doctest obspy.clients.syngine.__init__[5]>", line 3, in <module>
starttime="P-10", endtime="P+20")
File "/private-backup/home/obspy/update-docs/src/obspy/obspy/clients/syngine/client.py", line 371, in get_waveforms
filename=filename)
File "/private-backup/home/obspy/update-docs/src/obspy/obspy/clients/base.py", line 245, in _download
self._handle_requests_http_error(r)
File "/private-backup/home/obspy/update-docs/src/obspy/obspy/clients/syngine/client.py", line 62, in _handle_requests_http_error
raise ClientHTTPException(msg.strip())
obspy.clients.base.ClientHTTPException: HTTP code 500 when downloading 'http://service.iris.edu/irisws/syngine/1/query?station=AN%2A&starttime=P-10&format=miniseed&network=IU&eventid=GCMT%3AC201002270634A&endtime=P%2B20&model=ak135f_5s':
Error 500: GCMT lookup error [404]: <!DOCTYPE HTML PUBLIC "-//IETF//DTD HTML 2.0//EN">
<html><head>
<title>404 Not Found</title>
</head><body>
<h1>Not Found</h1>
<p>The requested URL /spudservice/momenttensor/gcmtid/C201002270634A/ndk was not found on this server.</p>
<p>Additionally, a 302 Found
error was encountered while trying to use an ErrorDocument to handle the request.</p>
<hr>
<address>Apache/2.2.15 (CentOS) Server at ds.iris.edu Port 80</address>
</body></html>
More Details:
handler exited, code: 1 reason: Internal Server Error
Request:
http://service.iris.edu/irisws/syngine/1/query?station=AN%2A&starttime=P-10&format=miniseed&network=IU&eventid=GCMT%3AC201002270634A&endtime=P%2B20&model=ak135f_5s
Request Submitted:
2018/06/07 23:08:37 UTC
Service version:
Service: irisws-syngine version: 1.0.4
----------------------------------------------------------------------
File "/private-backup/home/obspy/update-docs/src/obspy/obspy/clients/syngine/__init__.py", line 79, in obspy.clients.syngine.__init__
Failed example:
st = client.get_waveforms_bulk(
model="ak135f_5s", eventid="GCMT:C201002270634A",
bulk=bulk, starttime="P-10", endtime="P+20")
Exception raised:
Traceback (most recent call last):
File "/home/obspy/anaconda3/envs/tmp_build_docs/lib/python3.4/doctest.py", line 1318, in __run
compileflags, 1), test.globs)
File "<doctest obspy.clients.syngine.__init__[8]>", line 3, in <module>
bulk=bulk, starttime="P-10", endtime="P+20")
File "/private-backup/home/obspy/update-docs/src/obspy/obspy/clients/syngine/client.py", line 608, in get_waveforms_bulk
data=buf, filename=filename)
File "/private-backup/home/obspy/update-docs/src/obspy/obspy/clients/base.py", line 245, in _download
self._handle_requests_http_error(r)
File "/private-backup/home/obspy/update-docs/src/obspy/obspy/clients/syngine/client.py", line 62, in _handle_requests_http_error
raise ClientHTTPException(msg.strip())
obspy.clients.base.ClientHTTPException: HTTP code 500 when downloading 'http://service.iris.edu/irisws/syngine/1/query':
Error 500: GCMT lookup error [404]: <!DOCTYPE HTML PUBLIC "-//IETF//DTD HTML 2.0//EN">
<html><head>
<title>404 Not Found</title>
</head><body>
<h1>Not Found</h1>
<p>The requested URL /spudservice/momenttensor/gcmtid/C201002270634A/ndk was not found on this server.</p>
<p>Additionally, a 302 Found
error was encountered while trying to use an ErrorDocument to handle the request.</p>
<hr>
<address>Apache/2.2.15 (CentOS) Server at ds.iris.edu Port 80</address>
</body></html>
More Details:
handler exited, code: 1 reason: Internal Server Error
Request:
http://service.iris.edu/irisws/syngine/1/query
Request Submitted:
2018/06/07 23:08:38 UTC
Service version:
Service: irisws-syngine version: 1.0.4
----------------------------------------------------------------------
File "/private-backup/home/obspy/update-docs/src/obspy/obspy/clients/syngine/__init__.py", line 82, in obspy.clients.syngine.__init__
Failed example:
print(st) # doctest: +ELLIPSIS
Exception raised:
Traceback (most recent call last):
File "/home/obspy/anaconda3/envs/tmp_build_docs/lib/python3.4/doctest.py", line 1318, in __run
compileflags, 1), test.globs)
File "<doctest obspy.clients.syngine.__init__[9]>", line 1, in <module>
print(st) # doctest: +ELLIPSIS
NameError: name 'st' is not defined
Traceback (most recent call last):
File "/home/obspy/anaconda3/envs/tmp_build_docs/lib/python3.4/doctest.py", line 2187, in runTest
raise self.failureException(self.format_failure(new.getvalue()))
AssertionError: Failed doctest test for obspy.clients.syngine.client.Client.get_waveforms
File "/private-backup/home/obspy/update-docs/src/obspy/obspy/clients/syngine/client.py", line 213, in get_waveforms
----------------------------------------------------------------------
File "/private-backup/home/obspy/update-docs/src/obspy/obspy/clients/syngine/client.py", line 227, in obspy.clients.syngine.client.Client.get_waveforms
Failed example:
st = client.get_waveforms(model="ak135f_5s", network="IU",
station="ANMO",
eventid="GCMT:C201002270634A")
Exception raised:
Traceback (most recent call last):
File "/home/obspy/anaconda3/envs/tmp_build_docs/lib/python3.4/doctest.py", line 1318, in __run
compileflags, 1), test.globs)
File "<doctest obspy.clients.syngine.client.Client.get_waveforms[2]>", line 3, in <module>
eventid="GCMT:C201002270634A")
File "/private-backup/home/obspy/update-docs/src/obspy/obspy/clients/syngine/client.py", line 371, in get_waveforms
filename=filename)
File "/private-backup/home/obspy/update-docs/src/obspy/obspy/clients/base.py", line 245, in _download
self._handle_requests_http_error(r)
File "/private-backup/home/obspy/update-docs/src/obspy/obspy/clients/syngine/client.py", line 62, in _handle_requests_http_error
raise ClientHTTPException(msg.strip())
obspy.clients.base.ClientHTTPException: HTTP code 500 when downloading 'http://service.iris.edu/irisws/syngine/1/query?station=ANMO&model=ak135f_5s&format=miniseed&network=IU&eventid=GCMT%3AC201002270634A':
Error 500: GCMT lookup error [404]: <!DOCTYPE HTML PUBLIC "-//IETF//DTD HTML 2.0//EN">
<html><head>
<title>404 Not Found</title>
</head><body>
<h1>Not Found</h1>
<p>The requested URL /spudservice/momenttensor/gcmtid/C201002270634A/ndk was not found on this server.</p>
<p>Additionally, a 302 Found
error was encountered while trying to use an ErrorDocument to handle the request.</p>
<hr>
<address>Apache/2.2.15 (CentOS) Server at ds.iris.edu Port 80</address>
</body></html>
More Details:
handler exited, code: 1 reason: Internal Server Error
Request:
http://service.iris.edu/irisws/syngine/1/query?station=ANMO&model=ak135f_5s&format=miniseed&network=IU&eventid=GCMT%3AC201002270634A
Request Submitted:
2018/06/07 23:08:28 UTC
Service version:
Service: irisws-syngine version: 1.0.4
----------------------------------------------------------------------
File "/private-backup/home/obspy/update-docs/src/obspy/obspy/clients/syngine/client.py", line 230, in obspy.clients.syngine.client.Client.get_waveforms
Failed example:
print(st) # doctest: +ELLIPSIS
Exception raised:
Traceback (most recent call last):
File "/home/obspy/anaconda3/envs/tmp_build_docs/lib/python3.4/doctest.py", line 1318, in __run
compileflags, 1), test.globs)
File "<doctest obspy.clients.syngine.client.Client.get_waveforms[3]>", line 1, in <module>
print(st) # doctest: +ELLIPSIS
NameError: name 'st' is not defined
Traceback (most recent call last):
File "/private-backup/home/obspy/update-docs/src/obspy/obspy/clients/syngine/tests/test_client.py", line 264, in test_error_handling
self.assertIn("HTTP code 400 when", msg)
AssertionError: 'HTTP code 400 when' not found in 'HTTP code 500 when downloading \'http://service.iris.edu/irisws/syngine/1/query?station=ANMO&format=miniseed&network=IU&eventid=GCMT%3AC201002270634A&components=ABC&model=ak135f_5s\':\n\nError 500: GCMT lookup error [404]: <!DOCTYPE HTML PUBLIC "-//IETF//DTD HTML 2.0//EN">\n<html><head>\n<title>404 Not Found</title>\n</head><body>\n<h1>Not Found</h1>\n<p>The requested URL /spudservice/momenttensor/gcmtid/C201002270634A/ndk was not found on this server.</p>\n<p>Additionally, a 302 Found\nerror was encountered while trying to use an ErrorDocument to handle the request.</p>\n<hr>\n<address>Apache/2.2.15 (CentOS) Server at ds.iris.edu Port 80</address>\n</body></html>\n\n\n\nMore Details:\nhandler exited, code: 1 reason: Internal Server Error\n\nRequest:\nhttp://service.iris.edu/irisws/syngine/1/query?station=ANMO&format=miniseed&network=IU&eventid=GCMT%3AC201002270634A&components=ABC&model=ak135f_5s\n\nRequest Submitted:\n2018/06/07 23:08:39 UTC\n\nService version:\nService: irisws-syngine version: 1.0.4'

Skipped Tests (43)

Submodule Test Skip Message
core test_flake8 (obspy.core.tests.test_code_formatting.CodeFormattingTestCase) Formatting tests require at least flake8 3.0.
core test_location_plot_global (obspy.core.tests.test_network.NetworkCartopyTestCase) cartopy not installed
core test_location_plot_local (obspy.core.tests.test_network.NetworkCartopyTestCase) cartopy not installed
core test_location_plot_ortho (obspy.core.tests.test_network.NetworkCartopyTestCase) cartopy not installed
core test_location_plot_global (obspy.core.tests.test_inventory.InventoryCartopyTestCase) cartopy not installed
core test_location_plot_local (obspy.core.tests.test_inventory.InventoryCartopyTestCase) cartopy not installed
core test_location_plot_ortho (obspy.core.tests.test_inventory.InventoryCartopyTestCase) cartopy not installed
core test_catalog_plot_global (obspy.core.tests.test_event.CatalogCartopyTestCase) Cartopy not installed or too old
core test_catalog_plot_local (obspy.core.tests.test_event.CatalogCartopyTestCase) Cartopy not installed or too old
core test_catalog_plot_ortho (obspy.core.tests.test_event.CatalogCartopyTestCase) Cartopy not installed or too old
core test_catalog_plot_ortho_longitude_wrap (obspy.core.tests.test_event.CatalogCartopyTestCase) Cartopy not installed or too old
geodetics test_gps_2_dist_azimuth_with_geographiclib (obspy.geodetics.tests.test_util_geodetics.UtilGeodeticsTestCase) Module geographiclib is not installed
geodetics test_issue_375 (obspy.geodetics.tests.test_util_geodetics.UtilGeodeticsTestCase) Module geographiclib is not installed
clients.arclink test_get_waveform_with_default_dcid_key_file (obspy.clients.arclink.tests.test_decrypt.ClientTestCase) $HOME/dcidpasswords.txt already exists
clients.arclink test_m2crypto (obspy.clients.arclink.tests.test_decrypt.ClientTestCase) M2Crypto is not installed
io.shapefile test_write_catalog_shapefile (obspy.io.shapefile.tests.test_core.ShapefileTestCase) pyshp not installed
io.shapefile test_write_catalog_shapefile_via_plugin (obspy.io.shapefile.tests.test_core.ShapefileTestCase) pyshp not installed
io.shapefile test_write_catalog_shapefile_with_extra_field (obspy.io.shapefile.tests.test_core.ShapefileTestCase) pyshp not installed
io.shapefile test_write_inventory_shapefile (obspy.io.shapefile.tests.test_core.ShapefileTestCase) pyshp not installed
io.shapefile test_write_inventory_shapefile_via_plugin (obspy.io.shapefile.tests.test_core.ShapefileTestCase) pyshp not installed
imaging test_script_plot (obspy.imaging.tests.test_mopad_script.MopadTestCase) Currently broken until further review.
clients.seishub test_get_channel_ids (obspy.clients.seishub.tests.test_client.ClientTestCase) Seishub test server not reachable.
clients.seishub test_get_coordinates (obspy.clients.seishub.tests.test_client.ClientTestCase) Seishub test server not reachable.
clients.seishub test_get_event_list (obspy.clients.seishub.tests.test_client.ClientTestCase) Seishub test server not reachable.
clients.seishub test_get_location_ids (obspy.clients.seishub.tests.test_client.ClientTestCase) Seishub test server not reachable.
clients.seishub test_get_network_ids (obspy.clients.seishub.tests.test_client.ClientTestCase) Seishub test server not reachable.
clients.seishub test_get_paz (obspy.clients.seishub.tests.test_client.ClientTestCase) Seishub test server not reachable.
clients.seishub test_get_preview (obspy.clients.seishub.tests.test_client.ClientTestCase) Seishub test server not reachable.
clients.seishub test_get_preview_by_ids (obspy.clients.seishub.tests.test_client.ClientTestCase) Seishub test server not reachable.
clients.seishub test_get_station_ids (obspy.clients.seishub.tests.test_client.ClientTestCase) Seishub test server not reachable.
clients.seishub test_get_waveform_with_metadata (obspy.clients.seishub.tests.test_client.ClientTestCase) Seishub test server not reachable.
clients.seishub test_get_waveforms (obspy.clients.seishub.tests.test_client.ClientTestCase) Seishub test server not reachable.
clients.seishub test_localcache (obspy.clients.seishub.tests.test_client.ClientTestCase) Seishub test server not reachable.
clients.seishub test_ping (obspy.clients.seishub.tests.test_client.ClientTestCase) Seishub test server not reachable.
taup test_compute_ray_paths (obspy.taup.tests.test_ray_paths.RayPathCalculationsTestCase) test needs geographiclib >= 1.34
taup test_path_geo (obspy.taup.tests.test_taup_geo.TaupGeoTestCase) Module geographiclib is not installed or too old.
taup test_path_resampling (obspy.taup.tests.test_taup_geo.TaupGeoTestCase) Module geographiclib is not installed or too old.
taup test_p_iasp91_geo_manual (obspy.taup.tests.test_tau.TauPyModelTestCase) Module geographiclib is not installed
taup test_pierce_p_iasp91_geo (obspy.taup.tests.test_tau.TauPyModelTestCase) test needs geographiclib >= 1.34
taup test_single_path_geo_iasp91 (obspy.taup.tests.test_tau.TauPyModelTestCase) test needs geographiclib >= 1.34
clients.seedlink test_info (obspy.clients.seedlink.tests.test_slclient.SLClientTestCase) test must be started manually
clients.seedlink test_issue708 (obspy.clients.seedlink.tests.test_slclient.SLClientTestCase) test must be started manually
clients.seedlink test_time_window (obspy.clients.seedlink.tests.test_slclient.SLClientTestCase) test must be started manually

Slowest Tests (20)

Runtime Test
126.107s get_waveforms (obspy.clients.seedlink.basic_client.Client)
63.685s test_get_waveform (obspy.clients.seedlink.tests.test_basic_client.ClientTestCase)
36.280s test_get_waveform_no_routing (obspy.clients.arclink.tests.test_client.ClientTestCase)
30.800s test_get_waveform_with_dcid_key_file (obspy.clients.arclink.tests.test_decrypt.ClientTestCase)
29.591s test_get_networks (obspy.clients.arclink.tests.test_client.ClientTestCase)
29.039s test_cryptography (obspy.clients.arclink.tests.test_decrypt.ClientTestCase)
28.227s test_get_inventory (obspy.clients.arclink.tests.test_client.ClientTestCase)
28.070s test_get_waveform_with_metadata (obspy.clients.arclink.tests.test_client.ClientTestCase)
27.400s __init__ (obspy.clients.arclink)
27.039s test_save_waveform_compressed (obspy.clients.arclink.tests.test_client.ClientTestCase)
26.818s test_get_routing (obspy.clients.arclink.tests.test_client.ClientTestCase)
26.070s test_save_waveform_no_compression (obspy.clients.arclink.tests.test_client.ClientTestCase)
25.913s test_get_stations_inconsistency (obspy.clients.arclink.tests.test_client.ClientTestCase)
25.910s test_get_waveform_no_compression (obspy.clients.arclink.tests.test_client.ClientTestCase)
25.888s test_get_stations (obspy.clients.arclink.tests.test_client.ClientTestCase)
25.883s test_get_waveform (obspy.clients.arclink.tests.test_client.ClientTestCase)
25.869s test_get_waveform_instrument_change (obspy.clients.arclink.tests.test_client.ClientTestCase)
20.966s test_plot_farfield_without_quiver_with_maps (obspy.core.tests.test_event.EventTestCase)
14.339s test_srl (obspy.clients.arclink.tests.test_client.ClientTestCase)
12.052s test_response_calculation_from_seed_and_xseed (obspy.io.xseed.tests.test_core.CoreTestCase)

Chuck Norris Fact

If Chuck Norris writes code with bugs, the bugs fix themselves.